00001_TE_2096x1400_8bit_sRGB	200	21
00001_TE_2096x1400_8bit_sRGB	150	24
00001_TE_2096x1400_8bit_sRGB	100	29
00001_TE_2096x1400_8bit_sRGB	75	32
00001_TE_2096x1400_8bit_sRGB	50	36
00001_TE_2096x1400_8bit_sRGB	25	41
00001_TE_2096x1400_8bit_sRGB	12	45
00001_TE_2096x1400_8bit_sRGB	6	49
00001_TE_2096x1400_8bit_sRGB	3	51
00002_TE_2144x1424_8bit_sRGB	200	19
00002_TE_2144x1424_8bit_sRGB	150	22
00002_TE_2144x1424_8bit_sRGB	100	25
00002_TE_2144x1424_8bit_sRGB	75	28
00002_TE_2144x1424_8bit_sRGB	50	31
00002_TE_2144x1424_8bit_sRGB	25	36
00002_TE_2144x1424_8bit_sRGB	12	40
00002_TE_2144x1424_8bit_sRGB	6	44
00002_TE_2144x1424_8bit_sRGB	3	47
00003_TE_1944x1296_8bit_sRGB	200	15
00003_TE_1944x1296_8bit_sRGB	150	18
00003_TE_1944x1296_8bit_sRGB	100	22
00003_TE_1944x1296_8bit_sRGB	75	24
00003_TE_1944x1296_8bit_sRGB	50	28
00003_TE_1944x1296_8bit_sRGB	25	34
00003_TE_1944x1296_8bit_sRGB	12	40
00003_TE_1944x1296_8bit_sRGB	6	46
00003_TE_1944x1296_8bit_sRGB	3	51
00004_TE_1808x1352_8bit_sRGB	200	19
00004_TE_1808x1352_8bit_sRGB	150	23
00004_TE_1808x1352_8bit_sRGB	100	27
00004_TE_1808x1352_8bit_sRGB	75	30
00004_TE_1808x1352_8bit_sRGB	50	34
00004_TE_1808x1352_8bit_sRGB	25	39
00004_TE_1808x1352_8bit_sRGB	12	43
00004_TE_1808x1352_8bit_sRGB	6	48
00004_TE_1808x1352_8bit_sRGB	3	51
00005_TE_1336x872_8bit_sRGB	200	10
00005_TE_1336x872_8bit_sRGB	150	12
00005_TE_1336x872_8bit_sRGB	100	15
00005_TE_1336x872_8bit_sRGB	75	18
00005_TE_1336x872_8bit_sRGB	50	22
00005_TE_1336x872_8bit_sRGB	25	31
00005_TE_1336x872_8bit_sRGB	12	38
00005_TE_1336x872_8bit_sRGB	6	44
00005_TE_1336x872_8bit_sRGB	3	51
00006_TE_1544x1120_8bit_sRGB	200	16
00006_TE_1544x1120_8bit_sRGB	150	21
00006_TE_1544x1120_8bit_sRGB	100	26
00006_TE_1544x1120_8bit_sRGB	75	29
00006_TE_1544x1120_8bit_sRGB	50	33
00006_TE_1544x1120_8bit_sRGB	25	39
00006_TE_1544x1120_8bit_sRGB	12	44
00006_TE_1544x1120_8bit_sRGB	6	47
00006_TE_1544x1120_8bit_sRGB	3	51
00007_TE_1472x976_8bit_sRGB	200	15
00007_TE_1472x976_8bit_sRGB	150	18
00007_TE_1472x976_8bit_sRGB	100	21
00007_TE_1472x976_8bit_sRGB	75	23
00007_TE_1472x976_8bit_sRGB	50	26
00007_TE_1472x976_8bit_sRGB	25	31
00007_TE_1472x976_8bit_sRGB	12	38
00007_TE_1472x976_8bit_sRGB	6	42
00007_TE_1472x976_8bit_sRGB	3	47
00008_TE_1912x1272_8bit_sRGB	200	17
00008_TE_1912x1272_8bit_sRGB	150	21
00008_TE_1912x1272_8bit_sRGB	100	26
00008_TE_1912x1272_8bit_sRGB	75	29
00008_TE_1912x1272_8bit_sRGB	50	32
00008_TE_1912x1272_8bit_sRGB	25	36
00008_TE_1912x1272_8bit_sRGB	12	40
00008_TE_1912x1272_8bit_sRGB	6	42
00008_TE_1912x1272_8bit_sRGB	3	45
00009_TE_1976x1312_8bit_sRGB	200	26
00009_TE_1976x1312_8bit_sRGB	150	30
00009_TE_1976x1312_8bit_sRGB	100	34
00009_TE_1976x1312_8bit_sRGB	75	37
00009_TE_1976x1312_8bit_sRGB	50	40
00009_TE_1976x1312_8bit_sRGB	25	44
00009_TE_1976x1312_8bit_sRGB	12	48
00009_TE_1976x1312_8bit_sRGB	6	51
00009_TE_1976x1312_8bit_sRGB	3	51
00010_TE_1744x1160_8bit_sRGB	200	22
00010_TE_1744x1160_8bit_sRGB	150	25
00010_TE_1744x1160_8bit_sRGB	100	29
00010_TE_1744x1160_8bit_sRGB	75	32
00010_TE_1744x1160_8bit_sRGB	50	35
00010_TE_1744x1160_8bit_sRGB	25	40
00010_TE_1744x1160_8bit_sRGB	12	46
00010_TE_1744x1160_8bit_sRGB	6	51
00010_TE_1744x1160_8bit_sRGB	3	51
00011_TE_1512x2016_8bit_sRGB	200	21
00011_TE_1512x2016_8bit_sRGB	150	24
00011_TE_1512x2016_8bit_sRGB	100	27
00011_TE_1512x2016_8bit_sRGB	75	29
00011_TE_1512x2016_8bit_sRGB	50	31
00011_TE_1512x2016_8bit_sRGB	25	35
00011_TE_1512x2016_8bit_sRGB	12	38
00011_TE_1512x2016_8bit_sRGB	6	41
00011_TE_1512x2016_8bit_sRGB	3	44
00012_TE_1920x1280_8bit_sRGB	200	16
00012_TE_1920x1280_8bit_sRGB	150	20
00012_TE_1920x1280_8bit_sRGB	100	24
00012_TE_1920x1280_8bit_sRGB	75	27
00012_TE_1920x1280_8bit_sRGB	50	31
00012_TE_1920x1280_8bit_sRGB	25	37
00012_TE_1920x1280_8bit_sRGB	12	42
00012_TE_1920x1280_8bit_sRGB	6	46
00012_TE_1920x1280_8bit_sRGB	3	51
00013_TE_3680x2456_8bit_sRGB	200	14
00013_TE_3680x2456_8bit_sRGB	150	17
00013_TE_3680x2456_8bit_sRGB	100	21
00013_TE_3680x2456_8bit_sRGB	75	24
00013_TE_3680x2456_8bit_sRGB	50	27
00013_TE_3680x2456_8bit_sRGB	25	33
00013_TE_3680x2456_8bit_sRGB	12	39
00013_TE_3680x2456_8bit_sRGB	6	43
00013_TE_3680x2456_8bit_sRGB	3	47
00014_TE_3680x2456_8bit_sRGB	200	13
00014_TE_3680x2456_8bit_sRGB	150	15
00014_TE_3680x2456_8bit_sRGB	100	19
00014_TE_3680x2456_8bit_sRGB	75	23
00014_TE_3680x2456_8bit_sRGB	50	27
00014_TE_3680x2456_8bit_sRGB	25	34
00014_TE_3680x2456_8bit_sRGB	12	39
00014_TE_3680x2456_8bit_sRGB	6	44
00014_TE_3680x2456_8bit_sRGB	3	49
00015_TE_1744x2000_8bit_sRGB	200	19
00015_TE_1744x2000_8bit_sRGB	150	20
00015_TE_1744x2000_8bit_sRGB	100	23
00015_TE_1744x2000_8bit_sRGB	75	24
00015_TE_1744x2000_8bit_sRGB	50	26
00015_TE_1744x2000_8bit_sRGB	25	29
00015_TE_1744x2000_8bit_sRGB	12	33
00015_TE_1744x2000_8bit_sRGB	6	37
00015_TE_1744x2000_8bit_sRGB	3	41
00016_TE_1192x832_8bit_sRGB	200	19
00016_TE_1192x832_8bit_sRGB	150	22
00016_TE_1192x832_8bit_sRGB	100	27
00016_TE_1192x832_8bit_sRGB	75	30
00016_TE_1192x832_8bit_sRGB	50	34
00016_TE_1192x832_8bit_sRGB	25	40
00016_TE_1192x832_8bit_sRGB	12	45
00016_TE_1192x832_8bit_sRGB	6	49
00016_TE_1192x832_8bit_sRGB	3	51
00017_TE_1280x848_8bit_sRGB	200	21
00017_TE_1280x848_8bit_sRGB	150	25
00017_TE_1280x848_8bit_sRGB	100	30
00017_TE_1280x848_8bit_sRGB	75	33
00017_TE_1280x848_8bit_sRGB	50	36
00017_TE_1280x848_8bit_sRGB	25	41
00017_TE_1280x848_8bit_sRGB	12	45
00017_TE_1280x848_8bit_sRGB	6	48
00017_TE_1280x848_8bit_sRGB	3	51
00018_TE_3032x1856_8bit_sRGB	200	24
00018_TE_3032x1856_8bit_sRGB	150	27
00018_TE_3032x1856_8bit_sRGB	100	30
00018_TE_3032x1856_8bit_sRGB	75	32
00018_TE_3032x1856_8bit_sRGB	50	35
00018_TE_3032x1856_8bit_sRGB	25	40
00018_TE_3032x1856_8bit_sRGB	12	45
00018_TE_3032x1856_8bit_sRGB	6	49
00018_TE_3032x1856_8bit_sRGB	3	51
00019_TE_1920x1080_8bit_sRGB	200	18
00019_TE_1920x1080_8bit_sRGB	150	19
00019_TE_1920x1080_8bit_sRGB	100	24
00019_TE_1920x1080_8bit_sRGB	75	27
00019_TE_1920x1080_8bit_sRGB	50	31
00019_TE_1920x1080_8bit_sRGB	25	37
00019_TE_1920x1080_8bit_sRGB	12	43
00019_TE_1920x1080_8bit_sRGB	6	49
00019_TE_1920x1080_8bit_sRGB	3	51
00020_TE_3680x2456_8bit_sRGB	200	20
00020_TE_3680x2456_8bit_sRGB	150	22
00020_TE_3680x2456_8bit_sRGB	100	26
00020_TE_3680x2456_8bit_sRGB	75	28
00020_TE_3680x2456_8bit_sRGB	50	32
00020_TE_3680x2456_8bit_sRGB	25	37
00020_TE_3680x2456_8bit_sRGB	12	41
00020_TE_3680x2456_8bit_sRGB	6	45
00020_TE_3680x2456_8bit_sRGB	3	49
00021_TE_2192x1520_8bit_sRGB	200	22
00021_TE_2192x1520_8bit_sRGB	150	25
00021_TE_2192x1520_8bit_sRGB	100	29
00021_TE_2192x1520_8bit_sRGB	75	32
00021_TE_2192x1520_8bit_sRGB	50	35
00021_TE_2192x1520_8bit_sRGB	25	39
00021_TE_2192x1520_8bit_sRGB	12	44
00021_TE_2192x1520_8bit_sRGB	6	47
00021_TE_2192x1520_8bit_sRGB	3	51
00022_TE_1248x832_8bit_sRGB	200	17
00022_TE_1248x832_8bit_sRGB	150	20
00022_TE_1248x832_8bit_sRGB	100	25
00022_TE_1248x832_8bit_sRGB	75	28
00022_TE_1248x832_8bit_sRGB	50	31
00022_TE_1248x832_8bit_sRGB	25	37
00022_TE_1248x832_8bit_sRGB	12	43
00022_TE_1248x832_8bit_sRGB	6	47
00022_TE_1248x832_8bit_sRGB	3	51
00023_TE_2464x1640_8bit_sRGB	200	21
00023_TE_2464x1640_8bit_sRGB	150	21
00023_TE_2464x1640_8bit_sRGB	100	24
00023_TE_2464x1640_8bit_sRGB	75	27
00023_TE_2464x1640_8bit_sRGB	50	30
00023_TE_2464x1640_8bit_sRGB	25	34
00023_TE_2464x1640_8bit_sRGB	12	39
00023_TE_2464x1640_8bit_sRGB	6	43
00023_TE_2464x1640_8bit_sRGB	3	48
00024_TE_1536x1024_8bit_sRGB	200	24
00024_TE_1536x1024_8bit_sRGB	150	27
00024_TE_1536x1024_8bit_sRGB	100	32
00024_TE_1536x1024_8bit_sRGB	75	34
00024_TE_1536x1024_8bit_sRGB	50	37
00024_TE_1536x1024_8bit_sRGB	25	42
00024_TE_1536x1024_8bit_sRGB	12	46
00024_TE_1536x1024_8bit_sRGB	6	49
00024_TE_1536x1024_8bit_sRGB	3	51
00025_TE_1984x1320_8bit_sRGB	200	18
00025_TE_1984x1320_8bit_sRGB	150	19
00025_TE_1984x1320_8bit_sRGB	100	23
00025_TE_1984x1320_8bit_sRGB	75	26
00025_TE_1984x1320_8bit_sRGB	50	30
00025_TE_1984x1320_8bit_sRGB	25	35
00025_TE_1984x1320_8bit_sRGB	12	41
00025_TE_1984x1320_8bit_sRGB	6	46
00025_TE_1984x1320_8bit_sRGB	3	50
00026_TE_1784x1296_8bit_sRGB	200	16
00026_TE_1784x1296_8bit_sRGB	150	19
00026_TE_1784x1296_8bit_sRGB	100	23
00026_TE_1784x1296_8bit_sRGB	75	26
00026_TE_1784x1296_8bit_sRGB	50	30
00026_TE_1784x1296_8bit_sRGB	25	36
00026_TE_1784x1296_8bit_sRGB	12	41
00026_TE_1784x1296_8bit_sRGB	6	46
00026_TE_1784x1296_8bit_sRGB	3	51
00027_TE_3680x2456_8bit_sRGB	200	32
00027_TE_3680x2456_8bit_sRGB	150	32
00027_TE_3680x2456_8bit_sRGB	100	36
00027_TE_3680x2456_8bit_sRGB	75	38
00027_TE_3680x2456_8bit_sRGB	50	41
00027_TE_3680x2456_8bit_sRGB	25	45
00027_TE_3680x2456_8bit_sRGB	12	48
00027_TE_3680x2456_8bit_sRGB	6	51
00027_TE_3680x2456_8bit_sRGB	3	51
00028_TE_800x1200_8bit_sRGB	200	14
00028_TE_800x1200_8bit_sRGB	150	17
00028_TE_800x1200_8bit_sRGB	100	20
00028_TE_800x1200_8bit_sRGB	75	22
00028_TE_800x1200_8bit_sRGB	50	25
00028_TE_800x1200_8bit_sRGB	25	31
00028_TE_800x1200_8bit_sRGB	12	37
00028_TE_800x1200_8bit_sRGB	6	42
00028_TE_800x1200_8bit_sRGB	3	47
00029_TE_976x1472_8bit_sRGB	200	15
00029_TE_976x1472_8bit_sRGB	150	17
00029_TE_976x1472_8bit_sRGB	100	20
00029_TE_976x1472_8bit_sRGB	75	23
00029_TE_976x1472_8bit_sRGB	50	27
00029_TE_976x1472_8bit_sRGB	25	34
00029_TE_976x1472_8bit_sRGB	12	40
00029_TE_976x1472_8bit_sRGB	6	45
00029_TE_976x1472_8bit_sRGB	3	50
00030_TE_560x888_8bit_sRGB	200	18
00030_TE_560x888_8bit_sRGB	150	21
00030_TE_560x888_8bit_sRGB	100	24
00030_TE_560x888_8bit_sRGB	75	26
00030_TE_560x888_8bit_sRGB	50	29
00030_TE_560x888_8bit_sRGB	25	35
00030_TE_560x888_8bit_sRGB	12	39
00030_TE_560x888_8bit_sRGB	6	44
00030_TE_560x888_8bit_sRGB	3	48
00031_TE_1752x1856_8bit_sRGB	200	15
00031_TE_1752x1856_8bit_sRGB	150	17
00031_TE_1752x1856_8bit_sRGB	100	20
00031_TE_1752x1856_8bit_sRGB	75	22
00031_TE_1752x1856_8bit_sRGB	50	25
00031_TE_1752x1856_8bit_sRGB	25	30
00031_TE_1752x1856_8bit_sRGB	12	35
00031_TE_1752x1856_8bit_sRGB	6	39
00031_TE_1752x1856_8bit_sRGB	3	44
00032_TE_7680x5120_8bit_sRGB	200	20
00032_TE_7680x5120_8bit_sRGB	150	24
00032_TE_7680x5120_8bit_sRGB	100	28
00032_TE_7680x5120_8bit_sRGB	75	30
00032_TE_7680x5120_8bit_sRGB	50	34
00032_TE_7680x5120_8bit_sRGB	25	40
00032_TE_7680x5120_8bit_sRGB	12	44
00032_TE_7680x5120_8bit_sRGB	6	47
00032_TE_7680x5120_8bit_sRGB	3	51
00033_TE_2120x1608_8bit_sRGB	200	17
00033_TE_2120x1608_8bit_sRGB	150	19
00033_TE_2120x1608_8bit_sRGB	100	22
00033_TE_2120x1608_8bit_sRGB	75	24
00033_TE_2120x1608_8bit_sRGB	50	28
00033_TE_2120x1608_8bit_sRGB	25	34
00033_TE_2120x1608_8bit_sRGB	12	40
00033_TE_2120x1608_8bit_sRGB	6	45
00033_TE_2120x1608_8bit_sRGB	3	50
00034_TE_1072x928_8bit_sRGB	200	17
00034_TE_1072x928_8bit_sRGB	150	20
00034_TE_1072x928_8bit_sRGB	100	25
00034_TE_1072x928_8bit_sRGB	75	28
00034_TE_1072x928_8bit_sRGB	50	32
00034_TE_1072x928_8bit_sRGB	25	38
00034_TE_1072x928_8bit_sRGB	12	42
00034_TE_1072x928_8bit_sRGB	6	46
00034_TE_1072x928_8bit_sRGB	3	50
00035_TE_877x1658_8bit_sRGB	200	18
00035_TE_877x1658_8bit_sRGB	150	22
00035_TE_877x1658_8bit_sRGB	100	27
00035_TE_877x1658_8bit_sRGB	75	30
00035_TE_877x1658_8bit_sRGB	50	34
00035_TE_877x1658_8bit_sRGB	25	40
00035_TE_877x1658_8bit_sRGB	12	45
00035_TE_877x1658_8bit_sRGB	6	49
00035_TE_877x1658_8bit_sRGB	3	51
00036_TE_998x1675_8bit_sRGB	200	19
00036_TE_998x1675_8bit_sRGB	150	23
00036_TE_998x1675_8bit_sRGB	100	27
00036_TE_998x1675_8bit_sRGB	75	29
00036_TE_998x1675_8bit_sRGB	50	33
00036_TE_998x1675_8bit_sRGB	25	38
00036_TE_998x1675_8bit_sRGB	12	43
00036_TE_998x1675_8bit_sRGB	6	46
00036_TE_998x1675_8bit_sRGB	3	49
00037_TE_5616x3744_8bit_sRGB	200	11
00037_TE_5616x3744_8bit_sRGB	150	14
00037_TE_5616x3744_8bit_sRGB	100	18
00037_TE_5616x3744_8bit_sRGB	75	20
00037_TE_5616x3744_8bit_sRGB	50	23
00037_TE_5616x3744_8bit_sRGB	25	29
00037_TE_5616x3744_8bit_sRGB	12	35
00037_TE_5616x3744_8bit_sRGB	6	41
00037_TE_5616x3744_8bit_sRGB	3	45
00038_TE_8160x6120_8bit_sRGB	200	17
00038_TE_8160x6120_8bit_sRGB	150	20
00038_TE_8160x6120_8bit_sRGB	100	23
00038_TE_8160x6120_8bit_sRGB	75	25
00038_TE_8160x6120_8bit_sRGB	50	27
00038_TE_8160x6120_8bit_sRGB	25	31
00038_TE_8160x6120_8bit_sRGB	12	37
00038_TE_8160x6120_8bit_sRGB	6	42
00038_TE_8160x6120_8bit_sRGB	3	47
00039_TE_5464x3640_8bit_sRGB	200	7
00039_TE_5464x3640_8bit_sRGB	150	11
00039_TE_5464x3640_8bit_sRGB	100	21
00039_TE_5464x3640_8bit_sRGB	75	26
00039_TE_5464x3640_8bit_sRGB	50	31
00039_TE_5464x3640_8bit_sRGB	25	36
00039_TE_5464x3640_8bit_sRGB	12	41
00039_TE_5464x3640_8bit_sRGB	6	45
00039_TE_5464x3640_8bit_sRGB	3	49
00040_TE_7394x4932_8bit_sRGB	200	15
00040_TE_7394x4932_8bit_sRGB	150	19
00040_TE_7394x4932_8bit_sRGB	100	23
00040_TE_7394x4932_8bit_sRGB	75	25
00040_TE_7394x4932_8bit_sRGB	50	27
00040_TE_7394x4932_8bit_sRGB	25	33
00040_TE_7394x4932_8bit_sRGB	12	39
00040_TE_7394x4932_8bit_sRGB	6	45
00040_TE_7394x4932_8bit_sRGB	3	51
00041_TE_3374x5055_8bit_sRGB	200	16
00041_TE_3374x5055_8bit_sRGB	150	22
00041_TE_3374x5055_8bit_sRGB	100	29
00041_TE_3374x5055_8bit_sRGB	75	32
00041_TE_3374x5055_8bit_sRGB	50	35
00041_TE_3374x5055_8bit_sRGB	25	39
00041_TE_3374x5055_8bit_sRGB	12	43
00041_TE_3374x5055_8bit_sRGB	6	47
00041_TE_3374x5055_8bit_sRGB	3	51
00042_TE_2787x4004_8bit_sRGB	200	14
00042_TE_2787x4004_8bit_sRGB	150	17
00042_TE_2787x4004_8bit_sRGB	100	21
00042_TE_2787x4004_8bit_sRGB	75	24
00042_TE_2787x4004_8bit_sRGB	50	28
00042_TE_2787x4004_8bit_sRGB	25	34
00042_TE_2787x4004_8bit_sRGB	12	39
00042_TE_2787x4004_8bit_sRGB	6	43
00042_TE_2787x4004_8bit_sRGB	3	46
00043_TE_945x840_8bit_sRGB	200	10
00043_TE_945x840_8bit_sRGB	150	12
00043_TE_945x840_8bit_sRGB	100	16
00043_TE_945x840_8bit_sRGB	75	19
00043_TE_945x840_8bit_sRGB	50	23
00043_TE_945x840_8bit_sRGB	25	29
00043_TE_945x840_8bit_sRGB	12	34
00043_TE_945x840_8bit_sRGB	6	39
00043_TE_945x840_8bit_sRGB	3	44
00044_TE_1430x1834_8bit_sRGB	200	17
00044_TE_1430x1834_8bit_sRGB	150	20
00044_TE_1430x1834_8bit_sRGB	100	24
00044_TE_1430x1834_8bit_sRGB	75	26
00044_TE_1430x1834_8bit_sRGB	50	29
00044_TE_1430x1834_8bit_sRGB	25	35
00044_TE_1430x1834_8bit_sRGB	12	39
00044_TE_1430x1834_8bit_sRGB	6	43
00044_TE_1430x1834_8bit_sRGB	3	47
00045_TE_2533x1897_8bit_sRGB	200	16
00045_TE_2533x1897_8bit_sRGB	150	19
00045_TE_2533x1897_8bit_sRGB	100	23
00045_TE_2533x1897_8bit_sRGB	75	24
00045_TE_2533x1897_8bit_sRGB	50	27
00045_TE_2533x1897_8bit_sRGB	25	33
00045_TE_2533x1897_8bit_sRGB	12	38
00045_TE_2533x1897_8bit_sRGB	6	44
00045_TE_2533x1897_8bit_sRGB	3	49
00046_TE_2816x1878_8bit_sRGB	200	20
00046_TE_2816x1878_8bit_sRGB	150	23
00046_TE_2816x1878_8bit_sRGB	100	26
00046_TE_2816x1878_8bit_sRGB	75	28
00046_TE_2816x1878_8bit_sRGB	50	30
00046_TE_2816x1878_8bit_sRGB	25	32
00046_TE_2816x1878_8bit_sRGB	12	36
00046_TE_2816x1878_8bit_sRGB	6	41
00046_TE_2816x1878_8bit_sRGB	3	46
00047_TE_2500x1875_8bit_sRGB	200	31
00047_TE_2500x1875_8bit_sRGB	150	34
00047_TE_2500x1875_8bit_sRGB	100	38
00047_TE_2500x1875_8bit_sRGB	75	40
00047_TE_2500x1875_8bit_sRGB	50	43
00047_TE_2500x1875_8bit_sRGB	25	47
00047_TE_2500x1875_8bit_sRGB	12	50
00047_TE_2500x1875_8bit_sRGB	6	51
00047_TE_2500x1875_8bit_sRGB	3	51
00048_TE_2500x1667_8bit_sRGB	200	25
00048_TE_2500x1667_8bit_sRGB	150	28
00048_TE_2500x1667_8bit_sRGB	100	32
00048_TE_2500x1667_8bit_sRGB	75	33
00048_TE_2500x1667_8bit_sRGB	50	35
00048_TE_2500x1667_8bit_sRGB	25	37
00048_TE_2500x1667_8bit_sRGB	12	41
00048_TE_2500x1667_8bit_sRGB	6	46
00048_TE_2500x1667_8bit_sRGB	3	50
00049_TE_5566x3569_8bit_sRGB	200	20
00049_TE_5566x3569_8bit_sRGB	150	23
00049_TE_5566x3569_8bit_sRGB	100	27
00049_TE_5566x3569_8bit_sRGB	75	29
00049_TE_5566x3569_8bit_sRGB	50	33
00049_TE_5566x3569_8bit_sRGB	25	38
00049_TE_5566x3569_8bit_sRGB	12	44
00049_TE_5566x3569_8bit_sRGB	6	49
00049_TE_5566x3569_8bit_sRGB	3	51
00050_TE_3976x2652_8bit_sRGB	200	17
00050_TE_3976x2652_8bit_sRGB	150	20
00050_TE_3976x2652_8bit_sRGB	100	24
00050_TE_3976x2652_8bit_sRGB	75	27
00050_TE_3976x2652_8bit_sRGB	50	30
00050_TE_3976x2652_8bit_sRGB	25	35
00050_TE_3976x2652_8bit_sRGB	12	40
00050_TE_3976x2652_8bit_sRGB	6	44
00050_TE_3976x2652_8bit_sRGB	3	47
