<?xml version="1.0" encoding="utf-8"?>
<!-- Generator: Adobe Illustrator 26.4.0, SVG Export Plug-In . SVG Version: 6.00 Build 0)  -->
<svg version="1.1" id="Layer_1" focusable="false" xmlns="http://www.w3.org/2000/svg" xmlns:xlink="http://www.w3.org/1999/xlink"
	 x="0px" y="0px" viewBox="0 0 152 88" style="enable-background:new 0 0 152 88;" xml:space="preserve">
<style type="text/css">
	.st0{fill:#FFFFFF;}
</style>
<path class="st0" d="M135.5,74.7c0.1-3.8,0.9-6.9,3.1-9.6c1.9-2.5,5.1-3.8,8.2-3.4c2.5,0.2,4.5,2,4.8,4.5c0.9,5,0,9.5-3.7,13.2
	c-2.1,2.2-5.3,3-8.2,2.1c-2.4-0.6-3.7-2.4-4.1-4.8C135.6,76,135.6,75.1,135.5,74.7z M147.4,68.8c0-0.3,0-0.6,0-0.9
	c-0.1-1-0.3-2-1.5-2.5c-1.1-0.4-2.3-0.2-3.1,0.7c-0.4,0.4-0.8,0.8-1,1.3c-1.5,2.7-2,5.9-1.6,8.9c0.1,1.2,1.1,2.2,2.4,2.1
	c0.2,0,0.3,0,0.4-0.1c1.2-0.2,2.2-1.1,2.7-2.2C146.9,73.8,147.5,71.3,147.4,68.8z"/>
<path class="st0" d="M133.8,53.8c-0.3,1.8-0.6,3.4-0.9,5.1c-1,5.8-2.1,11.6-3.1,17.4c-0.2,1.1,0.2,1.4,1.3,1.2
	c0.5-0.2,1,0.1,1.2,0.6c0,0.1,0,0.1,0,0.2c0.1,0.8,0.2,1.6,0.3,2.3c0,0.2-0.1,0.4-0.3,0.5c-1.6,0.7-3.4,0.9-5.1,0.5
	c-1.2-0.2-2-1.3-2-2.5c0-1.7,0.2-3.3,0.5-4.9c0.9-5.4,1.9-10.9,2.9-16.3c0-0.2,0-0.4,0-0.6h-2.3c-0.3-1,0.3-2,1.3-2.2
	c0,0,0.1,0,0.1,0C129.7,54.6,131.7,54.2,133.8,53.8z"/>
<path class="st0" d="M120.2,81.6c-1.6,0-3,0-4.4,0c-0.8,0-1.1-0.4-0.9-1.4c0.5-2.3,0.9-4.6,1.4-6.9c0.3-1.9,0.7-3.7,1-5.6
	c0.3-1.6-0.7-2.4-2.3-1.9c-1,0.4-1.8,1.2-2.3,2.2c-0.9,2-1.6,4.1-1.9,6.3c-0.4,2.2-0.8,4.5-1.2,6.8c-0.1,0.4-0.2,0.6-0.6,0.6
	c-0.9,0-1.9,0-2.8,0c-0.9,0-1.1-0.4-0.9-1.2c0.7-3.7,1.4-7.3,2.1-11c0.4-1.7,0.4-3.5,0.1-5.3c-0.2-0.4,0-0.9,0.5-1.1
	c1.1-0.4,2.3-0.8,3.5-1.3l0.7,3.6c0.2-0.3,0.5-0.5,0.7-0.8c0.8-1,1.9-1.9,3.1-2.4c2.5-1,5.2,0.2,5.8,2.5c0.2,1,0.3,2,0.1,2.9
	c-0.7,4-1.5,8.1-2.4,12.1C119.3,80.4,119.6,81.2,120.2,81.6z"/>
<path class="st0" d="M91.6,74c0.1,0.7,0.2,1.4,0.4,2.1c0.5,1.4,2,2.2,3.5,1.9c1.1-0.2,2.3-0.5,3.3-1c1.3-0.5,1.5-0.5,1.9,0.7
	c0.2,0.5,0.4,1,0.5,1.5c0,0.2,0,0.4-0.2,0.6c-2.8,1.9-6.2,2.5-9.4,1.7c-2.2-0.5-3.9-2.3-4.2-4.6c-1-4.1,0-8.5,2.7-11.7
	c2-2.6,5.3-3.9,8.6-3.4c2,0.1,3.6,1.4,4.2,3.3c0.8,2.1,0.3,4.4-1.3,6c-1.3,1.3-3,2.1-4.8,2.3c-1.5,0.3-3,0.3-4.5,0.5
	C92.2,74,92,74,91.6,74z M92.1,70.5c1.7,0.1,3.4-0.2,5-0.9c0.8-0.4,1.4-1.1,1.6-1.9c0.4-1-0.1-2.1-1.2-2.5c-0.3-0.1-0.6-0.1-0.9-0.1
	c-0.9,0.1-1.7,0.4-2.3,1C93.1,67.3,92.4,68.9,92.1,70.5L92.1,70.5z"/>
<path class="st0" d="M74.8,61.9c0.7,4.9,1.4,9.7,2.1,14.5l0.1,0c0.6-1.6,1.2-3.2,1.8-4.8c1.1-2.8,2.1-5.6,3.2-8.5
	c0.4-1.1,0.7-1.2,1.8-1.2h3.4c-0.1,0.3-0.2,0.5-0.3,0.7c-2.8,6.2-5.6,12.3-8.4,18.5c-0.1,0.4-0.5,0.6-0.9,0.6c-0.7,0-1.5,0-2.2,0
	c-0.7,0.1-1.4-0.4-1.5-1.1c0,0,0,0,0-0.1c-0.7-3.4-1.5-6.9-2.2-10.3c-0.5-2.2-0.9-4.4-1.4-6.6c-0.3-1.3,0-1.7,1.3-1.7
	C72.7,61.9,73.7,61.9,74.8,61.9z"/>
<path class="st0" d="M44.7,88c0-2,0-4,0-6c-0.2-7.3-2.1-14-6.9-19.6c-3.4-3.8-7.6-6.9-12.3-8.8c-5.2-2.2-10.6-3.7-16.2-4.5
	c-1.6-0.2-3.2-0.4-4.8-0.7c-2.2-0.4-3.9-2-4.3-4.2c-0.7-2.1,0.2-4.5,2-5.7c1.3-0.8,2.6-1.6,4-2.2c9-4.5,17.6-9.7,25.7-15.8
	c3.6-2.7,7.1-5.6,10.8-8.1c8-5.6,17.1-9.4,26.7-11.3c5.8-1.1,11.8-1.3,17.7-0.6c1.5,0.2,2.9,0.5,4.5,0.8c-0.1,0.1-0.2,0.3-0.3,0.4
	c-4.2,3.6-7.8,7.8-10.7,12.5c-6.3,9.5-11.3,19.7-14.9,30.5c0,0.1-0.1,0.2-0.2,0.4c-0.4-1.9-0.8-3.7-1.2-5.4
	c-0.9-3.8-1.7-7.5-2.6-11.3c-0.2-1.6-1.3-3-2.9-3.6c-1.5-0.5-3.2-0.2-4.3,1c-1.2,1.1-1.6,2.7-1.1,4.2c1.7,7.1,3.5,14.3,5.3,21.4
	c0.2,0.8,0.4,1.7,0.6,2.7c-1.5-1.1-2.9-2-4.3-3c-5.3-3.8-10.6-7.5-15.9-11.2c-1.3-1.1-3.1-1.3-4.6-0.5c-1.5,0.8-2.4,2.4-2.3,4.1
	c0.1,1.4,0.9,2.7,2.2,3.5c2.4,1.7,4.8,3.3,7.2,4.9c4.8,3.3,9.5,6.6,14.3,9.8l0.2,0.2c1.7,1.1,3.4,1.6,5.2,0.3
	C57.7,72,51.8,80.4,44.7,88z"/>
</svg>
