<?xml version="1.0" encoding="UTF-8" standalone="no"?>
<svg
   xmlns:dc="http://purl.org/dc/elements/1.1/"
   xmlns:cc="http://creativecommons.org/ns#"
   xmlns:rdf="http://www.w3.org/1999/02/22-rdf-syntax-ns#"
   xmlns:svg="http://www.w3.org/2000/svg"
   xmlns="http://www.w3.org/2000/svg"
   viewBox="0 0 799.62665 151.66667"
   height="151.66667"
   width="799.62665"
   xml:space="preserve"
   id="svg2"
   version="1.1"><metadata
     id="metadata8"><rdf:RDF><cc:Work
         rdf:about=""><dc:format>image/svg+xml</dc:format><dc:type
           rdf:resource="http://purl.org/dc/dcmitype/StillImage" /></cc:Work></rdf:RDF></metadata><defs
     id="defs6" /><g
     transform="matrix(1.3333333,0,0,-1.3333333,0,151.66667)"
     id="g10"><g
       transform="scale(0.1)"
       id="g12"><path
         id="path14"
         style="fill:#247a38;fill-opacity:1;fill-rule:nonzero;stroke:none"
         d="m 2998.54,406.504 -60.65,-121.25 60.73,-121.191 60.64,121.21 -60.72,121.231" /><path
         id="path16"
         style="fill:#4dbd39;fill-opacity:1;fill-rule:nonzero;stroke:none"
         d="m 0,504.941 c 0,35.977 29.8438,58.164 58.1836,58.164 24.4727,0 38.2422,-13.007 47.4414,-25.253 l 202.09,-305.254 v 277.715 c 0,34.433 28.32,56.621 56.633,56.621 28.34,0 56.636,-22.188 56.636,-56.621 V 59.6914 c 0,-35.2031 -29.082,-56.62109 -56.636,-56.62109 -25.254,0 -39.035,11.49999 -48.215,23.71099 L 113.27,332.051 V 56.6211 C 113.27,22.2109 84.9805,0 56.6406,0 28.3203,0 0,22.2109 0,56.6211 V 504.941" /><path
         id="path18"
         style="fill:#4dbd39;fill-opacity:1;fill-rule:nonzero;stroke:none"
         d="M 776.563,56.7813 C 776.563,22.2305 748.176,0 719.758,0 691.379,0 662.969,22.2305 662.969,56.7813 V 510.137 c 0,34.531 27.629,56.797 56.789,56.797 29.937,0 56.805,-22.266 56.805,-56.797 V 56.7813" /><path
         id="path20"
         style="fill:#4dbd39;fill-opacity:1;fill-rule:nonzero;stroke:none"
         d="m 2418.28,108.078 h -202.54 v 121.336 h 147.02 c 32.68,0 54.46,25.645 54.46,53.633 0,27.226 -20.99,54.473 -54.46,54.473 h -147.02 v 121.308 h 201.64 c 32.68,0 54.46,25.645 54.46,53.633 0,27.227 -20.99,54.473 -54.46,54.473 h -259.24 c -31.11,0 -57.55,-24.922 -57.55,-57.559 V 57.5391 C 2100.59,25.6602 2126.27,0 2158.14,0 h 260.14 c 31.9,0 54.46,24.8789 54.46,53.6289 0,28.8125 -22.56,54.4491 -54.46,54.4491" /><path
         id="path22"
         style="fill:#4dbd39;fill-opacity:1;fill-rule:nonzero;stroke:none"
         d="m 996.379,416.875 c 0,-65.566 33.861,-116.172 100.621,-150.391 l 62.17,-32.246 c 48.28,-25.019 74.86,-53.769 74.86,-80.976 0,-23.121 -17.48,-50.121 -66.77,-50.121 -37.26,0 -59.77,14.75 -79.64,27.781 -16.03,10.504 -29.86,19.566 -47.84,19.566 -27.07,0 -47.483,-21.468 -47.483,-49.957 C 992.297,51.6797 1076.99,0 1157.06,0 c 123.01,0 179.02,79.4492 179.02,153.262 0,67.871 -31.27,116.66 -98.39,153.535 l -74.46,40.879 c -50.54,27.226 -60.71,47.07 -60.71,70.273 0,22.285 18.45,44.746 59.64,44.746 32.25,0 50.64,-11.523 66.89,-21.679 14.05,-8.77 27.33,-17.051 46.31,-17.051 29.01,0 48.5,23.047 48.5,44.57 0,11.367 -2.03,25.274 -17.05,42.324 -18.48,21.661 -73,56.075 -140.58,56.075 -106.32,0 -169.851,-76.309 -169.851,-150.059" /><path
         id="path24"
         style="fill:#4dbd39;fill-opacity:1;fill-rule:nonzero;stroke:none"
         d="m 1536.34,416.875 c 0,-65.578 33.85,-116.172 100.61,-150.391 l 62.18,-32.246 c 48.28,-25.019 74.86,-53.769 74.86,-80.976 0,-23.121 -17.49,-50.121 -66.77,-50.121 -37.27,0 -59.79,14.75 -79.65,27.781 -16.03,10.504 -29.85,19.566 -47.83,19.566 -27.07,0 -47.48,-21.468 -47.48,-49.957 C 1532.26,51.6797 1616.94,0 1697.02,0 c 123.01,0 179.02,79.4492 179.02,153.262 0,67.871 -31.26,116.66 -98.39,153.523 l -74.47,40.879 c -50.54,27.227 -60.7,47.082 -60.7,70.285 0,22.274 18.45,44.735 59.64,44.735 32.26,0 50.64,-11.512 66.88,-21.668 14.06,-8.782 27.32,-17.063 46.32,-17.063 29.01,0 48.48,23.059 48.48,44.582 0,11.356 -2.02,25.274 -17.03,42.324 -18.48,21.661 -73,56.063 -140.58,56.063 -106.32,0 -169.85,-76.297 -169.85,-150.047" /><path
         id="path26"
         style="fill:#4dbd39;fill-opacity:1;fill-rule:nonzero;stroke:none"
         d="m 3110.41,566.934 c -21.03,0 -36.6,-10.079 -46.76,-30.274 l -65.11,-130.156 60.72,-121.231 101.33,202.598 c 4.55,9.004 6.81,17.656 6.81,26.016 0,14.883 -5.8,27.402 -17.3,37.656 -11.55,10.273 -24.75,15.391 -39.69,15.391 m -453.93,0 c -14.9,0 -28.1,-5.118 -39.68,-15.391 -11.53,-10.254 -17.3,-22.773 -17.3,-37.656 0,-8.809 2.18,-17.481 6.5,-26.016 L 2830.39,40 c 13.32,-26.6406 30.96,-40 52.93,-40 22.11,0 39.84,13.3398 53.18,39.8594 l 62.12,124.2036 -60.73,121.191 -54.47,-108.887 -180.51,360.293 c -10.16,20.195 -25.63,30.274 -46.43,30.274" /><path
         id="path28"
         style="fill:#4dbd39;fill-opacity:1;fill-rule:nonzero;stroke:none"
         d="m 2288.12,910.75 h -115.01 v 58.652 h 88.17 c 15.79,0 26.32,12.395 26.32,25.922 0,13.166 -10.14,26.336 -26.32,26.336 h -88.17 v 58.64 h 114.57 c 15.8,0 26.32,12.4 26.32,25.93 0,13.16 -10.14,26.33 -26.32,26.33 h -142.43 c -15.04,0 -27.82,-12.05 -27.82,-27.83 V 886.316 c 0,-15.406 12.41,-27.812 27.82,-27.812 h 142.87 c 15.42,0 26.32,12.027 26.32,25.926 0,13.929 -10.9,26.32 -26.32,26.32" /><path
         id="path30"
         style="fill:#4dbd39;fill-opacity:1;fill-rule:nonzero;stroke:none"
         d="m 2951.63,910.75 h -115.01 v 58.652 h 88.17 c 15.8,0 26.32,12.395 26.32,25.922 0,13.166 -10.13,26.336 -26.32,26.336 h -88.17 v 58.64 h 114.57 c 15.8,0 26.33,12.4 26.33,25.93 0,13.16 -10.15,26.33 -26.33,26.33 h -142.42 c -15.04,0 -27.82,-12.05 -27.82,-27.83 V 886.316 c 0,-15.406 12.41,-27.812 27.82,-27.812 h 142.86 c 15.42,0 26.33,12.027 26.33,25.926 0,13.929 -10.91,26.32 -26.33,26.32" /><path
         id="path32"
         style="fill:#4dbd39;fill-opacity:1;fill-rule:nonzero;stroke:none"
         d="m 3253.51,910.75 h -115.02 v 58.652 h 88.18 c 15.8,0 26.33,12.395 26.33,25.922 0,13.166 -10.16,26.336 -26.33,26.336 h -88.18 v 58.64 h 114.59 c 15.79,0 26.31,12.4 26.31,25.93 0,13.16 -10.14,26.33 -26.31,26.33 h -142.43 c -15.04,0 -27.83,-12.05 -27.83,-27.83 V 886.316 c 0,-15.406 12.42,-27.812 27.83,-27.812 h 142.86 c 15.41,0 26.32,12.027 26.32,25.926 0,13.929 -10.91,26.32 -26.32,26.32" /><path
         id="path34"
         style="fill:#4dbd39;fill-opacity:1;fill-rule:nonzero;stroke:none"
         d="m 4165.86,910.75 h -115.02 v 58.652 h 88.18 c 15.8,0 26.33,12.395 26.33,25.922 0,13.166 -10.15,26.336 -26.33,26.336 h -88.18 v 58.64 h 114.59 c 15.79,0 26.32,12.4 26.32,25.93 0,13.16 -10.15,26.33 -26.32,26.33 h -142.42 c -15.05,0 -27.83,-12.05 -27.83,-27.83 V 886.316 c 0,-15.406 12.42,-27.812 27.83,-27.812 h 142.85 c 15.41,0 26.33,12.027 26.33,25.926 0,13.929 -10.92,26.32 -26.33,26.32" /><path
         id="path36"
         style="fill:#4dbd39;fill-opacity:1;fill-rule:nonzero;stroke:none"
         d="m 1903.92,1137.46 c -67.3,0 -98.87,-50 -98.87,-108.28 v -66.555 c 0,-41.727 16.55,-108.641 99.63,-108.641 80.81,0 99.61,66.172 99.61,104.922 v 33.789 c 0,16.195 -13.16,26.315 -26.32,26.315 h -52.62 c -14.3,0 -24.81,-12.39 -24.81,-25.553 0,-13.547 10.89,-25.176 24.81,-25.176 h 24.43 V 956.98 c 0,-26.296 -12.03,-51.101 -44.34,-51.101 -31.61,0 -44.76,27.82 -44.76,55.605 v 67.696 c 0,24.8 9.41,56.02 45.1,56.02 23.69,0 37.62,-16.55 45.5,-25.21 3.76,-4.11 10.16,-8.64 19.58,-8.64 14.26,0 27.05,11.27 27.05,27.07 0,3.4 -0.39,6.78 -2.65,11.68 -3.75,8.24 -28.91,47.36 -91.34,47.36" /><path
         id="path38"
         style="fill:#4dbd39;fill-opacity:1;fill-rule:nonzero;stroke:none"
         d="m 2630.59,1132.93 c -16.91,0 -25.19,-10.53 -32.32,-24.43 -22.19,-43.63 -58.65,-117.289 -58.65,-117.289 0,0 -36.47,73.659 -58.65,117.289 -7.14,13.9 -15.41,24.43 -32.32,24.43 -14.68,0 -29.34,-11.27 -29.34,-29.33 V 884.453 c 0,-16.543 13.53,-27.832 27.8,-27.832 13.95,0 27.84,10.906 27.84,27.832 v 132.697 c 8.63,-16.17 27.08,-57.142 39.49,-80.841 3.75,-7.141 13.15,-15.051 25.18,-15.051 12.03,0 21.42,7.91 25.17,15.051 12.43,23.699 30.84,64.671 39.51,80.841 V 884.453 c 0,-16.926 13.87,-27.832 27.8,-27.832 14.3,0 27.82,11.289 27.82,27.832 V 1103.6 c 0,18.06 -14.65,29.33 -29.33,29.33" /><path
         id="path40"
         style="fill:#4dbd39;fill-opacity:1;fill-rule:nonzero;stroke:none"
         d="m 3563.64,1134.82 c -13.92,0 -27.83,-10.93 -27.83,-27.83 V 970.527 l -99.24,150.003 c -4.51,6.01 -11.27,12.4 -23.3,12.4 -13.9,0 -28.57,-10.92 -28.57,-28.55 V 884.07 c 0,-16.922 13.92,-27.832 27.83,-27.832 13.91,0 27.81,10.91 27.81,27.832 v 135.32 l 99.63,-149.995 c 4.53,-6.016 11.27,-11.641 23.67,-11.641 13.56,0 27.82,10.527 27.82,27.832 v 221.404 c 0,16.9 -13.91,27.83 -27.82,27.83" /><path
         id="path42"
         style="fill:#4dbd39;fill-opacity:1;fill-rule:nonzero;stroke:none"
         d="m 3869.31,1132.55 h -152.27 c -16.17,0 -25.96,-13.55 -25.96,-26.32 0,-13.16 9.79,-25.94 25.96,-25.94 h 48.48 V 884.453 c 0,-13.535 10.54,-27.832 27.85,-27.832 17.28,0 27.77,14.297 27.77,27.832 v 195.837 h 48.17 c 15.78,0 26.31,12.41 26.31,25.94 0,13.54 -10.53,26.32 -26.31,26.32" /><path
         id="path44"
         style="fill:#4ab0e7;fill-opacity:1;fill-rule:nonzero;stroke:none"
         d="m 5814.62,107.172 c 38.07,0 68.38,31.851 68.38,68.355 v 216.661 c 0,38.828 -32.64,67.558 -68.38,67.558 H 5679.53 V 107.172 Z m -249.31,402.281 c 0,31.055 25.65,57.481 57.52,57.481 h 192.57 c 113.44,0 181.84,-89.317 181.84,-185.625 V 183.301 C 5997.24,94.75 5927.28,0 5815.4,0 h -192.57 c -31.11,0 -57.52,24.8398 -57.52,57.4609 V 509.453" /><path
         id="path46"
         style="fill:#4ab0e7;fill-opacity:1;fill-rule:nonzero;stroke:none"
         d="m 3340.8,566.934 c -21.03,0 -36.62,-10.079 -46.78,-30.274 L 3113.81,176.367 3059.26,285.273 2998.62,164.063 3060.8,40 c 13.36,-26.6406 30.92,-40 52.85,-40 22.17,0 39.9,13.3398 53.28,39.8594 L 3391,487.871 c 4.49,9.004 6.73,17.656 6.73,26.016 0,14.883 -5.74,27.402 -17.26,37.656 -11.52,10.273 -24.75,15.391 -39.67,15.391 m -453.92,0 c -14.95,0 -28.15,-5.118 -39.69,-15.391 -11.51,-10.254 -17.27,-22.773 -17.27,-37.656 0,-8.809 2.13,-17.481 6.43,-26.016 l 101.54,-202.617 60.65,121.25 -65.2,130.156 c -10.21,20.195 -25.74,30.274 -46.46,30.274" /><path
         id="path48"
         style="fill:#4ab0e7;fill-opacity:1;fill-rule:nonzero;stroke:none"
         d="m 3669.8,249.57 70.68,141.075 70.57,-141.075 z M 4017.67,79.1797 3793.58,526.953 c -13.32,26.66 -31.07,39.981 -53.22,39.981 -21.95,0 -39.55,-13.262 -52.91,-39.786 L 3463.06,79.2813 c -4.3,-8.6016 -6.43,-17.293 -6.43,-26.0821 0,-14.8984 5.74,-27.5195 17.25,-37.789 C 3485.44,5.14063 3498.62,0 3513.56,0 c 20.79,0 36.27,10.1211 46.45,30.4102 l 55.44,110.6638 h 249.88 L 3920.69,30.4102 C 3930.89,10.1211 3946.49,0 3967.49,0 c 14.92,0 28.14,5.14063 39.69,15.3906 11.52,10.25 17.3,22.8282 17.3,37.7305 0,8.3398 -2.28,17.0391 -6.81,26.0586" /><path
         id="path50"
         style="fill:#4ab0e7;fill-opacity:1;fill-rule:nonzero;stroke:none"
         d="m 4362.86,249.57 70.68,141.075 70.57,-141.075 z M 4710.72,79.1797 4486.64,526.953 c -13.32,26.66 -31.07,39.981 -53.22,39.981 -21.96,0 -39.55,-13.262 -52.91,-39.786 L 4156.11,79.2813 c -4.29,-8.6016 -6.42,-17.293 -6.42,-26.0821 0,-14.8984 5.74,-27.5195 17.24,-37.789 C 4178.5,5.14063 4191.68,0 4206.62,0 c 20.78,0 36.27,10.1211 46.45,30.4102 l 55.44,110.6638 h 249.88 L 4613.75,30.4102 C 4623.95,10.1211 4639.55,0 4660.55,0 c 14.92,0 28.14,5.14063 39.68,15.3906 11.53,10.25 17.31,22.8282 17.31,37.7305 0,8.3398 -2.29,17.0391 -6.82,26.0586" /><path
         id="path52"
         style="fill:#4ab0e7;fill-opacity:1;fill-rule:nonzero;stroke:none"
         d="m 5016.47,459.746 h 134.68 c 35.74,0 68.38,-28.73 68.38,-67.558 v -20.45 c 0,-36.504 -30.31,-68.359 -68.38,-68.359 h -134.68 z m 317.3,-80.234 v 1.797 c 0,96.308 -68.4,185.625 -181.84,185.625 h -135.46 -57.45 c -31.72,0 -57.44,-25.723 -57.44,-57.442 V 57.4414 C 4901.58,25.7188 4927.3,0 4959.02,0 c 31.73,0 57.45,25.7188 57.45,57.4414 V 196.211 h 126.44 L 5227.25,30.0781 C 5236.52,12.3398 5255.02,0 5277.42,0 c 30.86,0 56.35,25.4492 56.35,56.2891 0,7.7109 -3.11,18.5507 -6.19,24.7109 -15.9,31.23 -54.11,101.137 -76.95,144.527 52.66,34.864 83.14,95.672 83.14,153.985" /></g></g></svg>