{"frames": {

"buttons/empty":
{
	"frame": {"x":349,"y":1061,"w":171,"h":173},
	"rotated": false,
	"trimmed": false,
	"spriteSourceSize": {"x":0,"y":0,"w":171,"h":173},
	"sourceSize": {"w":171,"h":173},
	"anchor": {"x":0,"y":0}
},
"buttons/home":
{
	"frame": {"x":1,"y":1061,"w":172,"h":173},
	"rotated": false,
	"trimmed": false,
	"spriteSourceSize": {"x":0,"y":0,"w":172,"h":173},
	"sourceSize": {"w":172,"h":173},
	"anchor": {"x":0,"y":0}
},
"buttons/locked":
{
	"frame": {"x":641,"y":547,"w":171,"h":173},
	"rotated": false,
	"trimmed": false,
	"spriteSourceSize": {"x":0,"y":0,"w":171,"h":173},
	"sourceSize": {"w":171,"h":173},
	"anchor": {"x":0,"y":0}
},
"buttons/play":
{
	"frame": {"x":175,"y":1061,"w":172,"h":173},
	"rotated": false,
	"trimmed": false,
	"spriteSourceSize": {"x":0,"y":0,"w":172,"h":173},
	"sourceSize": {"w":172,"h":173},
	"anchor": {"x":0,"y":0}
},
"buttons/restart":
{
	"frame": {"x":641,"y":722,"w":171,"h":173},
	"rotated": false,
	"trimmed": false,
	"spriteSourceSize": {"x":0,"y":0,"w":171,"h":173},
	"sourceSize": {"w":171,"h":173},
	"anchor": {"x":0,"y":0}
},
"buttons/sound-off":
{
	"frame": {"x":641,"y":897,"w":171,"h":173},
	"rotated": false,
	"trimmed": false,
	"spriteSourceSize": {"x":0,"y":0,"w":171,"h":173},
	"sourceSize": {"w":171,"h":173},
	"anchor": {"x":0,"y":0}
},
"buttons/sound-on":
{
	"frame": {"x":522,"y":1072,"w":171,"h":173},
	"rotated": false,
	"trimmed": false,
	"spriteSourceSize": {"x":0,"y":0,"w":171,"h":173},
	"sourceSize": {"w":171,"h":173},
	"anchor": {"x":0,"y":0}
},
"Fireball_1":
{
	"frame": {"x":814,"y":709,"w":18,"h":11},
	"rotated": false,
	"trimmed": true,
	"spriteSourceSize": {"x":5,"y":9,"w":18,"h":11},
	"sourceSize": {"w":32,"h":32},
	"anchor": {"x":0.59375,"y":0.46875}
},
"Fireball_2":
{
	"frame": {"x":814,"y":722,"w":18,"h":11},
	"rotated": false,
	"trimmed": true,
	"spriteSourceSize": {"x":5,"y":9,"w":18,"h":11},
	"sourceSize": {"w":32,"h":32},
	"anchor": {"x":0.59375,"y":0.46875}
},
"Fireball_3":
{
	"frame": {"x":814,"y":748,"w":17,"h":11},
	"rotated": false,
	"trimmed": true,
	"spriteSourceSize": {"x":6,"y":9,"w":17,"h":11},
	"sourceSize": {"w":32,"h":32},
	"anchor": {"x":0.59375,"y":0.46875}
},
"Fireball_4":
{
	"frame": {"x":814,"y":735,"w":18,"h":11},
	"rotated": false,
	"trimmed": true,
	"spriteSourceSize": {"x":5,"y":9,"w":18,"h":11},
	"sourceSize": {"w":32,"h":32},
	"anchor": {"x":0.59375,"y":0.46875}
},
"Hearth":
{
	"frame": {"x":695,"y":1072,"w":32,"h":32},
	"rotated": false,
	"trimmed": false,
	"spriteSourceSize": {"x":0,"y":0,"w":32,"h":32},
	"sourceSize": {"w":32,"h":32},
	"anchor": {"x":0,"y":0}
},
"Player/Idle_1":
{
	"frame": {"x":695,"y":1195,"w":16,"h":33},
	"rotated": false,
	"trimmed": true,
	"spriteSourceSize": {"x":4,"y":31,"w":16,"h":33},
	"sourceSize": {"w":32,"h":64},
	"anchor": {"x":0.375,"y":1}
},
"Player/Idle_2":
{
	"frame": {"x":729,"y":1099,"w":18,"h":34},
	"rotated": false,
	"trimmed": true,
	"spriteSourceSize": {"x":3,"y":30,"w":18,"h":34},
	"sourceSize": {"w":32,"h":64},
	"anchor": {"x":0.375,"y":1}
},
"Player/Walk_1":
{
	"frame": {"x":749,"y":1099,"w":16,"h":33},
	"rotated": false,
	"trimmed": true,
	"spriteSourceSize": {"x":4,"y":31,"w":16,"h":33},
	"sourceSize": {"w":32,"h":64},
	"anchor": {"x":0.375,"y":1}
},
"Player/Walk_2":
{
	"frame": {"x":695,"y":1159,"w":18,"h":34},
	"rotated": false,
	"trimmed": true,
	"spriteSourceSize": {"x":4,"y":30,"w":18,"h":34},
	"sourceSize": {"w":32,"h":64},
	"anchor": {"x":0.40625,"y":1}
},
"Player/Walk_3":
{
	"frame": {"x":767,"y":1099,"w":16,"h":33},
	"rotated": false,
	"trimmed": true,
	"spriteSourceSize": {"x":4,"y":31,"w":16,"h":33},
	"sourceSize": {"w":32,"h":64},
	"anchor": {"x":0.375,"y":1}
},
"Player/Walk_4":
{
	"frame": {"x":785,"y":1099,"w":15,"h":34},
	"rotated": false,
	"trimmed": true,
	"spriteSourceSize": {"x":4,"y":30,"w":15,"h":34},
	"sourceSize": {"w":32,"h":64},
	"anchor": {"x":0.375,"y":1}
},
"Rune1":
{
	"frame": {"x":715,"y":1159,"w":9,"h":12},
	"rotated": false,
	"trimmed": false,
	"spriteSourceSize": {"x":0,"y":0,"w":9,"h":12},
	"sourceSize": {"w":9,"h":12},
	"anchor": {"x":0,"y":0}
},
"Rune2":
{
	"frame": {"x":802,"y":1099,"w":7,"h":10},
	"rotated": false,
	"trimmed": false,
	"spriteSourceSize": {"x":0,"y":0,"w":7,"h":10},
	"sourceSize": {"w":7,"h":10},
	"anchor": {"x":0,"y":0}
},
"Rune3":
{
	"frame": {"x":695,"y":1230,"w":9,"h":10},
	"rotated": false,
	"trimmed": false,
	"spriteSourceSize": {"x":0,"y":0,"w":9,"h":10},
	"sourceSize": {"w":9,"h":10},
	"anchor": {"x":0,"y":0}
},
"Rune4":
{
	"frame": {"x":1,"y":1236,"w":9,"h":7},
	"rotated": false,
	"trimmed": false,
	"spriteSourceSize": {"x":0,"y":0,"w":9,"h":7},
	"sourceSize": {"w":9,"h":7},
	"anchor": {"x":0,"y":0}
},
"Skateboard":
{
	"frame": {"x":729,"y":1135,"w":16,"h":17},
	"rotated": false,
	"trimmed": true,
	"spriteSourceSize": {"x":10,"y":10,"w":16,"h":17},
	"sourceSize": {"w":32,"h":32},
	"anchor": {"x":0,"y":0}
},
"SkBlobbo_1":
{
	"frame": {"x":814,"y":682,"w":19,"h":25},
	"rotated": false,
	"trimmed": true,
	"spriteSourceSize": {"x":7,"y":7,"w":19,"h":25},
	"sourceSize": {"w":32,"h":32},
	"anchor": {"x":0.5,"y":1}
},
"SkBlobbo_2":
{
	"frame": {"x":814,"y":572,"w":19,"h":26},
	"rotated": false,
	"trimmed": true,
	"spriteSourceSize": {"x":7,"y":6,"w":19,"h":26},
	"sourceSize": {"w":32,"h":32},
	"anchor": {"x":0.5,"y":1}
},
"SkBlobbo_3":
{
	"frame": {"x":814,"y":600,"w":19,"h":26},
	"rotated": false,
	"trimmed": true,
	"spriteSourceSize": {"x":7,"y":6,"w":19,"h":26},
	"sourceSize": {"w":32,"h":32},
	"anchor": {"x":0.5,"y":1}
},
"SkBlobboDeath_1":
{
	"frame": {"x":835,"y":662,"w":20,"h":17},
	"rotated": false,
	"trimmed": true,
	"spriteSourceSize": {"x":7,"y":4,"w":20,"h":17},
	"sourceSize": {"w":32,"h":32},
	"anchor": {"x":0.5,"y":1}
},
"SkBlobboDeath_2":
{
	"frame": {"x":835,"y":681,"w":20,"h":17},
	"rotated": false,
	"trimmed": true,
	"spriteSourceSize": {"x":7,"y":4,"w":20,"h":17},
	"sourceSize": {"w":32,"h":32},
	"anchor": {"x":0,"y":0}
},
"SkBlobboHurt_1":
{
	"frame": {"x":814,"y":628,"w":19,"h":25},
	"rotated": false,
	"trimmed": true,
	"spriteSourceSize": {"x":7,"y":7,"w":19,"h":25},
	"sourceSize": {"w":32,"h":32},
	"anchor": {"x":0.5,"y":1}
},
"SkBlobboHurt_2":
{
	"frame": {"x":814,"y":544,"w":19,"h":26},
	"rotated": false,
	"trimmed": true,
	"spriteSourceSize": {"x":8,"y":6,"w":19,"h":26},
	"sourceSize": {"w":32,"h":32},
	"anchor": {"x":0.5,"y":1}
},
"SkBlobboHurt_3":
{
	"frame": {"x":814,"y":655,"w":19,"h":25},
	"rotated": false,
	"trimmed": true,
	"spriteSourceSize": {"x":7,"y":7,"w":19,"h":25},
	"sourceSize": {"w":32,"h":32},
	"anchor": {"x":0.5,"y":1}
},
"Title":
{
	"frame": {"x":1,"y":1,"w":800,"h":544},
	"rotated": false,
	"trimmed": false,
	"spriteSourceSize": {"x":0,"y":0,"w":800,"h":544},
	"sourceSize": {"w":800,"h":544},
	"anchor": {"x":0,"y":0}
},
"W_1":
{
	"frame": {"x":221,"y":547,"w":90,"h":512},
	"rotated": false,
	"trimmed": true,
	"spriteSourceSize": {"x":83,"y":0,"w":90,"h":512},
	"sourceSize": {"w":256,"h":512},
	"anchor": {"x":0,"y":0}
},
"W_2":
{
	"frame": {"x":485,"y":547,"w":78,"h":512},
	"rotated": false,
	"trimmed": true,
	"spriteSourceSize": {"x":95,"y":0,"w":78,"h":512},
	"sourceSize": {"w":256,"h":512},
	"anchor": {"x":0,"y":0}
},
"W_3":
{
	"frame": {"x":565,"y":547,"w":74,"h":512},
	"rotated": false,
	"trimmed": true,
	"spriteSourceSize": {"x":95,"y":0,"w":74,"h":512},
	"sourceSize": {"w":256,"h":512},
	"anchor": {"x":0,"y":0}
},
"W_4":
{
	"frame": {"x":803,"y":1,"w":62,"h":512},
	"rotated": false,
	"trimmed": true,
	"spriteSourceSize": {"x":99,"y":0,"w":62,"h":512},
	"sourceSize": {"w":256,"h":512},
	"anchor": {"x":0,"y":0}
},
"W_5":
{
	"frame": {"x":401,"y":547,"w":82,"h":512},
	"rotated": false,
	"trimmed": true,
	"spriteSourceSize": {"x":79,"y":0,"w":82,"h":512},
	"sourceSize": {"w":256,"h":512},
	"anchor": {"x":0,"y":0}
},
"W_6":
{
	"frame": {"x":1,"y":547,"w":118,"h":512},
	"rotated": false,
	"trimmed": true,
	"spriteSourceSize": {"x":67,"y":0,"w":118,"h":512},
	"sourceSize": {"w":256,"h":512},
	"anchor": {"x":0,"y":0}
},
"W_7":
{
	"frame": {"x":121,"y":547,"w":98,"h":512},
	"rotated": false,
	"trimmed": true,
	"spriteSourceSize": {"x":79,"y":0,"w":98,"h":512},
	"sourceSize": {"w":256,"h":512},
	"anchor": {"x":0,"y":0}
},
"W_8":
{
	"frame": {"x":313,"y":547,"w":86,"h":512},
	"rotated": false,
	"trimmed": true,
	"spriteSourceSize": {"x":79,"y":0,"w":86,"h":512},
	"sourceSize": {"w":256,"h":512},
	"anchor": {"x":0,"y":0}
},
"Water_1":
{
	"frame": {"x":803,"y":515,"w":32,"h":27},
	"rotated": false,
	"trimmed": true,
	"spriteSourceSize": {"x":0,"y":5,"w":32,"h":27},
	"sourceSize": {"w":32,"h":32},
	"anchor": {"x":0,"y":0}
},
"Water_2":
{
	"frame": {"x":837,"y":515,"w":32,"h":26},
	"rotated": false,
	"trimmed": true,
	"spriteSourceSize": {"x":0,"y":6,"w":32,"h":26},
	"sourceSize": {"w":32,"h":32},
	"anchor": {"x":0,"y":0}
},
"Water_3":
{
	"frame": {"x":695,"y":1106,"w":32,"h":25},
	"rotated": false,
	"trimmed": true,
	"spriteSourceSize": {"x":0,"y":7,"w":32,"h":25},
	"sourceSize": {"w":32,"h":32},
	"anchor": {"x":0,"y":0}
},
"Water_4":
{
	"frame": {"x":695,"y":1133,"w":32,"h":24},
	"rotated": false,
	"trimmed": true,
	"spriteSourceSize": {"x":0,"y":8,"w":32,"h":24},
	"sourceSize": {"w":32,"h":32},
	"anchor": {"x":0,"y":0}
},
"Water_5":
{
	"frame": {"x":729,"y":1072,"w":32,"h":25},
	"rotated": false,
	"trimmed": true,
	"spriteSourceSize": {"x":0,"y":7,"w":32,"h":25},
	"sourceSize": {"w":32,"h":32},
	"anchor": {"x":0,"y":0}
},
"Water_6":
{
	"frame": {"x":837,"y":543,"w":32,"h":26},
	"rotated": false,
	"trimmed": true,
	"spriteSourceSize": {"x":0,"y":6,"w":32,"h":26},
	"sourceSize": {"w":32,"h":32},
	"anchor": {"x":0,"y":0}
},
"Weapon/Attack_1":
{
	"frame": {"x":835,"y":571,"w":31,"h":11},
	"rotated": false,
	"trimmed": true,
	"spriteSourceSize": {"x":3,"y":17,"w":31,"h":11},
	"sourceSize": {"w":64,"h":32},
	"anchor": {"x":0.21875,"y":1}
},
"Weapon/Attack_2":
{
	"frame": {"x":835,"y":584,"w":31,"h":11},
	"rotated": false,
	"trimmed": true,
	"spriteSourceSize": {"x":4,"y":17,"w":31,"h":11},
	"sourceSize": {"w":64,"h":32},
	"anchor": {"x":0.21875,"y":1}
},
"Weapon/Attack_3":
{
	"frame": {"x":835,"y":597,"w":31,"h":11},
	"rotated": false,
	"trimmed": true,
	"spriteSourceSize": {"x":5,"y":15,"w":31,"h":11},
	"sourceSize": {"w":64,"h":32},
	"anchor": {"x":0.21875,"y":1}
},
"Weapon/Attack_4":
{
	"frame": {"x":763,"y":1072,"w":24,"h":25},
	"rotated": false,
	"trimmed": true,
	"spriteSourceSize": {"x":6,"y":2,"w":24,"h":25},
	"sourceSize": {"w":64,"h":32},
	"anchor": {"x":0.21875,"y":1}
},
"Weapon/Attack_5":
{
	"frame": {"x":789,"y":1072,"w":24,"h":25},
	"rotated": false,
	"trimmed": true,
	"spriteSourceSize": {"x":5,"y":2,"w":24,"h":25},
	"sourceSize": {"w":64,"h":32},
	"anchor": {"x":0.21875,"y":1}
},
"Weapon/Attack_6":
{
	"frame": {"x":835,"y":610,"w":31,"h":11},
	"rotated": false,
	"trimmed": true,
	"spriteSourceSize": {"x":3,"y":14,"w":31,"h":11},
	"sourceSize": {"w":64,"h":32},
	"anchor": {"x":0.21875,"y":1}
},
"Weapon/Idle_1":
{
	"frame": {"x":835,"y":623,"w":31,"h":11},
	"rotated": false,
	"trimmed": true,
	"spriteSourceSize": {"x":3,"y":17,"w":31,"h":11},
	"sourceSize": {"w":64,"h":32},
	"anchor": {"x":0.21875,"y":1}
},
"Weapon/Idle_2":
{
	"frame": {"x":835,"y":636,"w":31,"h":11},
	"rotated": false,
	"trimmed": true,
	"spriteSourceSize": {"x":3,"y":15,"w":31,"h":11},
	"sourceSize": {"w":64,"h":32},
	"anchor": {"x":0.21875,"y":1}
},
"Weapon/Idle_3":
{
	"frame": {"x":835,"y":649,"w":31,"h":11},
	"rotated": false,
	"trimmed": true,
	"spriteSourceSize": {"x":3,"y":16,"w":31,"h":11},
	"sourceSize": {"w":64,"h":32},
	"anchor": {"x":0.21875,"y":1}
}},
"animations": {
	"Fireball": ["Fireball_1","Fireball_2","Fireball_3","Fireball_4"],
	"Player/Idle": ["Player/Idle_1","Player/Idle_2"],
	"Player/Walk": ["Player/Walk_1","Player/Walk_2","Player/Walk_3","Player/Walk_4"],
	"Rune": ["Rune1","Rune2","Rune3","Rune4"],
	"SkBlobbo": ["SkBlobbo_1","SkBlobbo_2","SkBlobbo_3"],
	"SkBlobboDeath": ["SkBlobboDeath_1","SkBlobboDeath_2"],
	"SkBlobboHurt": ["SkBlobboHurt_1","SkBlobboHurt_2","SkBlobboHurt_3"],
	"W": ["W_1","W_2","W_3","W_4","W_5","W_6","W_7","W_8"],
	"Water": ["Water_1","Water_2","Water_3","Water_4","Water_5","Water_6"],
	"Weapon/Attack": ["Weapon/Attack_1","Weapon/Attack_2","Weapon/Attack_3","Weapon/Attack_4","Weapon/Attack_5","Weapon/Attack_6"],
	"Weapon/Idle": ["Weapon/Idle_1","Weapon/Idle_2","Weapon/Idle_3"]
},
"meta": {
	"app": "https://www.codeandweb.com/texturepacker",
	"version": "1.0",
	"image": "atlas.png",
	"format": "RGBA8888",
	"size": {"w":870,"h":1246},
	"scale": "1",
	"smartupdate": "$TexturePacker:SmartUpdate:0ea6787929f9d02d0389d37009e79202:88210a647b2ab7f42b8d117330fdcfc2:cbce6b53f0f49e0bf15173c25c41f876$"
}
}
