{ "compressionlevel":-1,
 "height":25,
 "infinite":false,
 "layers":[
        {
         "data":[61, 61, 61, 61, 61, 61, 61, 61, 61, 61, 61, 61, 61, 61, 61, 61, 61, 61, 61, 61, 61, 61, 61, 61, 61,
            61, 61, 61, 61, 61, 61, 61, 61, 61, 61, 61, 61, 61, 61, 61, 61, 61, 61, 61, 61, 61, 61, 61, 61, 61,
            61, 61, 61, 61, 61, 61, 61, 61, 61, 61, 61, 61, 61, 61, 61, 61, 61, 61, 61, 61, 61, 61, 61, 61, 61,
            61, 61, 61, 61, 61, 61, 61, 61, 61, 61, 61, 61, 61, 61, 61, 61, 61, 61, 61, 61, 61, 61, 61, 61, 61,
            61, 61, 61, 61, 61, 61, 61, 61, 61, 61, 61, 61, 61, 61, 61, 61, 61, 61, 61, 61, 61, 61, 61, 61, 61,
            61, 61, 61, 61, 61, 61, 61, 61, 61, 61, 61, 61, 61, 61, 61, 61, 61, 61, 61, 61, 61, 61, 61, 61, 61,
            61, 61, 61, 61, 61, 61, 61, 61, 61, 61, 61, 61, 61, 61, 61, 61, 61, 61, 61, 61, 61, 61, 61, 61, 61,
            61, 61, 61, 61, 61, 61, 61, 61, 61, 61, 61, 61, 61, 61, 61, 61, 61, 61, 61, 61, 61, 61, 61, 61, 61,
            61, 61, 61, 61, 61, 61, 61, 61, 61, 61, 61, 61, 61, 61, 61, 61, 61, 61, 61, 61, 61, 61, 61, 61, 61,
            61, 61, 61, 61, 61, 61, 61, 61, 61, 61, 61, 61, 61, 61, 61, 61, 61, 61, 61, 61, 61, 61, 61, 61, 61,
            61, 61, 61, 61, 61, 61, 61, 61, 61, 61, 61, 61, 61, 61, 61, 61, 61, 61, 61, 61, 61, 61, 61, 61, 61,
            61, 61, 61, 61, 61, 61, 61, 61, 61, 61, 61, 61, 61, 61, 61, 61, 61, 61, 61, 61, 61, 61, 61, 61, 61,
            61, 61, 61, 61, 61, 61, 61, 61, 61, 61, 61, 61, 61, 61, 61, 61, 61, 61, 61, 61, 61, 61, 61, 61, 61,
            61, 61, 61, 61, 61, 61, 61, 61, 61, 61, 61, 61, 61, 61, 61, 61, 61, 61, 61, 61, 61, 61, 61, 61, 61,
            61, 61, 61, 61, 61, 61, 61, 61, 61, 61, 61, 61, 61, 61, 61, 61, 61, 61, 61, 61, 61, 61, 61, 61, 61,
            61, 61, 61, 61, 61, 61, 61, 61, 61, 61, 61, 61, 61, 61, 61, 61, 61, 61, 61, 61, 61, 61, 61, 61, 61,
            61, 61, 61, 61, 61, 61, 61, 61, 61, 61, 61, 61, 61, 61, 61, 61, 61, 61, 61, 61, 61, 61, 61, 61, 61,
            61, 61, 61, 61, 61, 61, 61, 61, 61, 61, 61, 61, 61, 61, 61, 61, 61, 61, 61, 61, 61, 61, 61, 61, 61,
            61, 61, 61, 61, 61, 61, 61, 61, 61, 61, 61, 61, 61, 61, 61, 61, 61, 61, 61, 61, 61, 61, 61, 61, 61,
            61, 61, 61, 61, 61, 61, 61, 61, 61, 61, 61, 61, 61, 61, 61, 61, 61, 61, 61, 61, 61, 61, 61, 61, 61,
            61, 61, 61, 61, 61, 61, 61, 61, 61, 61, 61, 61, 61, 61, 61, 61, 61, 61, 61, 61, 61, 61, 61, 61, 61,
            61, 61, 61, 61, 61, 61, 61, 61, 61, 61, 61, 61, 61, 61, 61, 61, 61, 61, 61, 61, 61, 61, 61, 61, 61,
            61, 61, 61, 61, 61, 61, 61, 61, 61, 61, 61, 61, 61, 61, 61, 61, 61, 61, 61, 61, 61, 61, 61, 61, 61,
            61, 61, 61, 61, 61, 61, 61, 61, 61, 61, 61, 61, 61, 61, 61, 61, 61, 61, 61, 61, 61, 61, 61, 61, 61,
            61, 61, 61, 61, 61, 61, 61, 61, 61, 61, 61, 61, 61, 61, 61, 61, 61, 61, 61, 61, 61, 61, 61, 61, 61],
         "height":25,
         "id":3,
         "name":"Back",
         "opacity":1,
         "type":"tilelayer",
         "visible":true,
         "width":25,
         "x":0,
         "y":0
        }, 
        {
         "data":[24, 3, 0, 0, 0, 0, 0, 0, 0, 0, 0, 0, 0, 0, 0, 0, 0, 0, 0, 0, 0, 0, 0, 0, 11,
            12, 24, 3, 0, 0, 0, 0, 0, 0, 0, 0, 0, 0, 0, 0, 0, 0, 0, 0, 1, 2, 3, 0, 0, 11,
            12, 12, 13, 0, 0, 0, 0, 0, 0, 0, 0, 0, 0, 0, 0, 0, 0, 1, 2, 19, 22, 23, 0, 0, 11,
            12, 12, 13, 0, 0, 0, 0, 0, 1, 2, 2, 2, 2, 2, 2, 2, 2, 26, 4, 23, 0, 0, 0, 0, 11,
            12, 12, 24, 3, 0, 0, 0, 32, 17, 12, 12, 12, 12, 12, 12, 12, 4, 22, 23, 0, 0, 0, 0, 0, 11,
            12, 12, 12, 24, 3, 0, 0, 0, 21, 22, 22, 6, 12, 12, 12, 12, 13, 0, 0, 0, 0, 0, 0, 0, 11,
            12, 12, 12, 12, 13, 0, 0, 0, 0, 0, 0, 11, 12, 12, 12, 4, 23, 0, 0, 0, 0, 0, 0, 0, 11,
            12, 12, 12, 12, 24, 3, 0, 0, 0, 0, 0, 21, 22, 22, 22, 23, 0, 0, 0, 0, 0, 0, 0, 0, 11,
            12, 12, 12, 12, 12, 24, 2, 3, 0, 0, 0, 0, 0, 0, 0, 0, 0, 0, 0, 0, 0, 0, 0, 49, 11,
            12, 12, 12, 12, 12, 4, 22, 23, 0, 0, 0, 0, 0, 0, 0, 0, 0, 0, 0, 0, 0, 0, 0, 0, 11,
            12, 12, 12, 4, 22, 23, 0, 0, 0, 0, 0, 0, 0, 0, 0, 0, 0, 0, 0, 0, 0, 0, 0, 0, 11,
            12, 4, 22, 23, 0, 0, 0, 0, 0, 0, 0, 0, 0, 0, 0, 0, 0, 0, 0, 0, 0, 0, 0, 0, 11,
            4, 23, 0, 0, 0, 0, 0, 0, 32, 41, 2, 2, 2, 2, 2, 2, 2, 2, 2, 3, 0, 0, 0, 0, 11,
            13, 0, 0, 0, 0, 0, 0, 0, 0, 21, 6, 12, 12, 12, 12, 12, 12, 12, 12, 13, 0, 0, 0, 0, 11,
            13, 0, 0, 0, 0, 0, 0, 0, 0, 0, 21, 6, 12, 12, 12, 12, 12, 12, 4, 23, 0, 0, 0, 0, 11,
            13, 0, 0, 7, 8, 8, 9, 0, 0, 0, 0, 21, 22, 22, 22, 22, 22, 22, 23, 0, 0, 0, 0, 7, 11,
            13, 0, 0, 0, 0, 0, 0, 0, 0, 0, 0, 0, 0, 0, 0, 0, 0, 0, 0, 0, 0, 0, 0, 0, 11,
            13, 0, 0, 0, 0, 0, 0, 0, 0, 0, 0, 0, 0, 0, 0, 0, 0, 0, 0, 0, 0, 0, 0, 0, 11,
            13, 0, 0, 0, 0, 1, 2, 2, 3, 0, 0, 0, 0, 0, 0, 0, 0, 0, 0, 0, 0, 0, 0, 7, 11,
            13, 8, 8, 8, 8, 21, 22, 6, 24, 3, 0, 0, 0, 0, 0, 0, 0, 0, 0, 0, 0, 0, 0, 0, 11,
            13, 0, 0, 0, 0, 0, 0, 21, 6, 24, 3, 0, 0, 0, 0, 0, 0, 0, 0, 0, 0, 0, 0, 0, 11,
            13, 0, 0, 0, 0, 0, 0, 0, 21, 6, 24, 2, 3, 0, 0, 0, 0, 0, 0, 0, 0, 0, 0, 0, 11,
            13, 0, 0, 0, 0, 0, 0, 0, 0, 11, 4, 22, 23, 8, 8, 8, 8, 1, 3, 0, 0, 0, 0, 0, 11,
            24, 2, 2, 2, 3, 0, 0, 0, 0, 11, 13, 0, 0, 0, 0, 0, 0, 16, 13, 0, 0, 0, 0, 0, 11,
            4, 22, 22, 22, 23, 8, 8, 8, 8, 21, 23, 8, 8, 8, 8, 8, 8, 21, 23, 8, 8, 8, 8, 8, 11],
         "height":25,
         "id":1,
         "name":"Tiles",
         "opacity":1,
         "type":"tilelayer",
         "visible":true,
         "width":25,
         "x":0,
         "y":0
        }, 
        {
         "draworder":"topdown",
         "id":2,
         "name":"Objects",
         "objects":[
                {
                 "height":800,
                 "id":5,
                 "name":"",
                 "rotation":0,
                 "type":"Wall",
                 "visible":true,
                 "width":32,
                 "x":0,
                 "y":0
                }, 
                {
                 "height":800,
                 "id":6,
                 "name":"",
                 "rotation":0,
                 "type":"Wall",
                 "visible":true,
                 "width":32,
                 "x":768,
                 "y":0
                }, 
                {
                 "height":32,
                 "id":47,
                 "name":"",
                 "properties":[
                        {
                         "name":"sides",
                         "type":"int",
                         "value":2
                        }],
                 "rotation":0,
                 "type":"Wall",
                 "visible":true,
                 "width":32,
                 "x":736,
                 "y":480
                }, 
                {
                 "height":32,
                 "id":49,
                 "name":"",
                 "properties":[
                        {
                         "name":"sides",
                         "type":"int",
                         "value":2
                        }],
                 "rotation":0,
                 "type":"Wall",
                 "visible":true,
                 "width":32,
                 "x":736,
                 "y":256
                }, 
                {
                 "height":32,
                 "id":61,
                 "name":"",
                 "rotation":0,
                 "type":"EnemySpawn",
                 "visible":true,
                 "width":288,
                 "x":256,
                 "y":64
                }, 
                {
                 "height":32,
                 "id":84,
                 "name":"",
                 "properties":[
                        {
                         "name":"sides",
                         "type":"int",
                         "value":2
                        }],
                 "rotation":0,
                 "type":"Wall",
                 "visible":true,
                 "width":32,
                 "x":736,
                 "y":576
                }, 
                {
                 "height":32,
                 "id":85,
                 "name":"",
                 "properties":[
                        {
                         "name":"sides",
                         "type":"int",
                         "value":2
                        }],
                 "rotation":0,
                 "type":"Wall",
                 "visible":true,
                 "width":128,
                 "x":96,
                 "y":480
                }, 
                {
                 "height":32,
                 "id":86,
                 "name":"",
                 "properties":[
                        {
                         "name":"sides",
                         "type":"int",
                         "value":2
                        }],
                 "rotation":0,
                 "type":"Wall",
                 "visible":true,
                 "width":128,
                 "x":32,
                 "y":608
                }, 
                {
                 "height":32,
                 "id":87,
                 "name":"",
                 "properties":[
                        {
                         "name":"sides",
                         "type":"int",
                         "value":2
                        }],
                 "rotation":0,
                 "type":"Wall",
                 "visible":true,
                 "width":128,
                 "x":160,
                 "y":768
                }, 
                {
                 "height":32,
                 "id":88,
                 "name":"",
                 "properties":[
                        {
                         "name":"sides",
                         "type":"int",
                         "value":2
                        }],
                 "rotation":0,
                 "type":"Wall",
                 "visible":true,
                 "width":160,
                 "x":608,
                 "y":768
                }, 
                {
                 "height":64,
                 "id":90,
                 "name":"",
                 "rotation":0,
                 "type":"Wall",
                 "visible":true,
                 "width":128,
                 "x":160,
                 "y":576
                }, 
                {
                 "height":32,
                 "id":91,
                 "name":"",
                 "rotation":0,
                 "type":"Wall",
                 "visible":true,
                 "width":128,
                 "x":224,
                 "y":640
                }, 
                {
                 "height":32,
                 "id":93,
                 "name":"",
                 "rotation":0,
                 "type":"Wall",
                 "visible":true,
                 "width":160,
                 "x":256,
                 "y":672
                }, 
                {
                 "height":96,
                 "id":97,
                 "name":"",
                 "rotation":0,
                 "type":"Wall",
                 "visible":true,
                 "width":64,
                 "x":544,
                 "y":704
                }, 
                {
                 "height":32,
                 "id":98,
                 "name":"",
                 "rotation":0,
                 "type":"Wall",
                 "visible":true,
                 "width":32,
                 "x":288,
                 "y":608
                }, 
                {
                 "height":64,
                 "id":99,
                 "name":"",
                 "rotation":0,
                 "type":"Wall",
                 "visible":true,
                 "width":128,
                 "x":32,
                 "y":736
                }, 
                {
                 "height":32,
                 "id":100,
                 "name":"",
                 "rotation":0,
                 "type":"Wall",
                 "visible":true,
                 "width":384,
                 "x":256,
                 "y":384
                }, 
                {
                 "height":32,
                 "id":101,
                 "name":"",
                 "rotation":0,
                 "type":"Wall",
                 "visible":true,
                 "width":352,
                 "x":288,
                 "y":416
                }, 
                {
                 "height":32,
                 "id":102,
                 "name":"",
                 "rotation":0,
                 "type":"Wall",
                 "visible":true,
                 "width":320,
                 "x":320,
                 "y":448
                }, 
                {
                 "height":32,
                 "id":103,
                 "name":"",
                 "rotation":0,
                 "type":"Wall",
                 "visible":true,
                 "width":256,
                 "x":352,
                 "y":480
                }, 
                {
                 "height":416,
                 "id":104,
                 "name":"",
                 "rotation":0,
                 "type":"Wall",
                 "visible":true,
                 "width":30,
                 "x":32,
                 "y":0
                }, 
                {
                 "height":256,
                 "id":105,
                 "name":"",
                 "rotation":0,
                 "type":"Wall",
                 "visible":true,
                 "width":64,
                 "x":64,
                 "y":128
                }, 
                {
                 "height":128,
                 "id":106,
                 "name":"",
                 "rotation":0,
                 "type":"Wall",
                 "visible":true,
                 "width":64,
                 "x":128,
                 "y":224
                }, 
                {
                 "height":64,
                 "id":107,
                 "name":"",
                 "rotation":0,
                 "type":"Wall",
                 "visible":true,
                 "width":64,
                 "x":192,
                 "y":256
                }, 
                {
                 "height":64,
                 "id":108,
                 "name":"",
                 "rotation":0,
                 "type":"Wall",
                 "visible":true,
                 "width":32,
                 "x":128,
                 "y":160
                },
            
                {
                 "height":96,
                 "id":109,
                 "name":"",
                 "rotation":0,
                 "type":"Wall",
                 "visible":true,
                 "width":32,
                 "x":64,
                 "y":32
                }, 
                {
                 "height":32,
                 "id":110,
                 "name":"",
                 "rotation":0,
                 "type":"Wall",
                 "visible":true,
                 "width":32,
                 "x":224,
                 "y":128
                }, 
                {
                 "height":64,
                 "id":111,
                 "name":"",
                 "rotation":0,
                 "type":"Wall",
                 "visible":true,
                 "width":352,
                 "x":256,
                 "y":96
                }, 
                {
                 "height":96,
                 "id":112,
                 "name":"",
                 "rotation":0,
                 "type":"Wall",
                 "visible":true,
                 "width":160,
                 "x":352,
                 "y":160
                }, 
                {
                 "height":64,
                 "id":113,
                 "name":"",
                 "rotation":0,
                 "type":"Wall",
                 "visible":true,
                 "width":32,
                 "x":512,
                 "y":160
                }, 
                {
                 "height":32,
                 "id":114,
                 "name":"",
                 "rotation":0,
                 "type":"Wall",
                 "visible":true,
                 "width":96,
                 "x":256,
                 "y":160
                }, 
                {
                 "height":64,
                 "id":115,
                 "name":"",
                 "rotation":0,
                 "type":"Wall",
                 "visible":true,
                 "width":96,
                 "x":608,
                 "y":32
                }, 
                {
                 "height":64,
                 "id":116,
                 "name":"",
                 "rotation":0,
                 "type":"Wall",
                 "visible":true,
                 "width":96,
                 "x":544,
                 "y":64
                }, 
                {
                 "height":320,
                 "id":118,
                 "name":"",
                 "rotation":0,
                 "type":"WaterFall",
                 "visible":true,
                 "width":32,
                 "x":480,
                 "y":384
                }, 
                {
                 "height":64,
                 "id":119,
                 "name":"",
                 "rotation":0,
                 "type":"WaterFall",
                 "visible":true,
                 "width":32,
                 "x":416,
                 "y":704
                }, 
                {
                 "height":128,
                 "id":120,
                 "name":"",
                 "rotation":0,
                 "type":"WaterFall",
                 "visible":true,
                 "width":32,
                 "x":384,
                 "y":-32
                }, 
                {
                 "height":288,
                 "id":121,
                 "name":"",
                 "rotation":0,
                 "type":"WaterFall",
                 "visible":true,
                 "width":32,
                 "x":256,
                 "y":96
                }, 
                {
                 "height":288,
                 "id":122,
                 "name":"",
                 "rotation":0,
                 "type":"WaterFall",
                 "visible":true,
                 "width":32,
                 "x":512,
                 "y":96
                }, 
                {
                 "height":32,
                 "id":123,
                 "name":"",
                 "rotation":0,
                 "type":"EnemySpawn",
                 "visible":true,
                 "width":384,
                 "x":256,
                 "y":352
                }, 
                {
                 "height":32,
                 "id":124,
                 "name":"",
                 "rotation":0,
                 "type":"EnemySpawn",
                 "visible":true,
                 "width":192,
                 "x":416,
                 "y":672
                }, 
                {
                 "height":32,
                 "id":125,
                 "name":"",
                 "rotation":0,
                 "type":"EnemySpawn",
                 "visible":true,
                 "width":128,
                 "x":160,
                 "y":544
                }, 
                {
                 "height":96,
                 "id":126,
                 "name":"",
                 "rotation":0,
                 "type":"Wall",
                 "visible":true,
                 "width":64,
                 "x":288,
                 "y":704
                }, 
                {
                 "height":32,
                 "id":127,
                 "name":"",
                 "rotation":0,
                 "type":"Wall",
                 "visible":true,
                 "width":64,
                 "x":352,
                 "y":704
                }, 
                {
                 "height":32,
                 "id":128,
                 "name":"",
                 "properties":[
                        {
                         "name":"sides",
                         "type":"int",
                         "value":2
                        }],
                 "rotation":0,
                 "type":"Wall",
                 "visible":true,
                 "width":192,
                 "x":352,
                 "y":768
                }, 
                {
                 "height":32,
                 "id":129,
                 "name":"",
                 "properties":[
                        {
                         "name":"sides",
                         "type":"int",
                         "value":2
                        }],
                 "rotation":0,
                 "type":"Wall",
                 "visible":true,
                 "width":128,
                 "x":416,
                 "y":704
                }, 
                {
                 "height":0,
                 "id":130,
                 "name":"",
                 "polyline":[
                        {
                         "x":0,
                         "y":0
                        }, 
                        {
                         "x":-46,
                         "y":-46
                        }, 
                        {
                         "x":-148,
                         "y":-49
                        }, 
                        {
                         "x":-136,
                         "y":-183
                        }, 
                        {
                         "x":17,
                         "y":-211
                        }, 
                        {
                         "x":22,
                         "y":-292
                        }, 
                        {
                         "x":-58,
                         "y":-310
                        }, 
                        {
                         "x":-34,
                         "y":-366
                        }, 
                        {
                         "x":59,
                         "y":-405
                        }, 
                        {
                         "x":62,
                         "y":-506
                        }, 
                        {
                         "x":-22,
                         "y":-551
                        }, 
                        {
                         "x":-82,
                         "y":-631
                        }, 
                        {
                         "x":-125,
                         "y":-736
                        }],
                 "rotation":0,
                 "type":"RuneLine",
                 "visible":true,
                 "width":0,
                 "x":227,
                 "y":749
                }, 
                {
                 "height":0,
                 "id":131,
                 "name":"",
                 "polyline":[
                        {
                         "x":0,
                         "y":0
                        }, 
                        {
                         "x":23,
                         "y":-75
                        }, 
                        {
                         "x":-69,
                         "y":-121
                        }, 
                        {
                         "x":-152,
                         "y":-173
                        }, 
                        {
                         "x":-227,
                         "y":-213
                        }],
                 "rotation":0,
                 "type":"RuneLine",
                 "visible":true,
                 "width":0,
                 "x":471,
                 "y":754
                }, 
                {
                 "height":0,
                 "id":132,
                 "name":"",
                 "polyline":[
                        {
                         "x":0,
                         "y":0
                        }, 
                        {
                         "x":-33,
                         "y":-75
                        }, 
                        {
                         "x":-202,
                         "y":-72
                        }],
                 "rotation":0,
                 "type":"RuneLine",
                 "visible":true,
                 "width":0,
                 "x":693,
                 "y":751
                }, 
                {
                 "height":0,
                 "id":133,
                 "name":"",
                 "polyline":[
                        {
                         "x":0,
                         "y":0
                        }, 
                        {
                         "x":158,
                         "y":-129
                        }, 
                        {
                         "x":163,
                         "y":-271
                        }, 
                        {
                         "x":22,
                         "y":-326
                        }, 
                        {
                         "x":-281,
                         "y":-337
                        }],
                 "rotation":0,
                 "type":"RuneLine",
                 "visible":true,
                 "width":0,
                 "x":579,
                 "y":680
                }, 
                {
                 "height":0,
                 "id":134,
                 "name":"",
                 "polyline":[
                        {
                         "x":0,
                         "y":0
                        }, 
                        {
                         "x":-5,
                         "y":-125
                        }, 
                        {
                         "x":-31,
                         "y":-65
                        }, 
                        {
                         "x":-9,
                         "y":-5
                        }],
                 "rotation":0,
                 "type":"RuneLine",
                 "visible":true,
                 "width":0,
                 "x":759,
                 "y":242
                }],
         "opacity":1,
         "type":"objectgroup",
         "visible":true,
         "x":0,
         "y":0
        }],
 "nextlayerid":4,
 "nextobjectid":135,
 "orientation":"orthogonal",
 "renderorder":"right-down",
 "tiledversion":"1.8.4",
 "tileheight":32,
 "tilesets":[
        {
         "firstgid":1,
         "source":"test-tileset.json"
        }],
 "tilewidth":32,
 "type":"map",
 "version":"1.8",
 "width":25
}