{ "compressionlevel":-1,
 "height":25,
 "infinite":false,
 "layers":[
        {
         "data":[61, 61, 61, 61, 61, 61, 61, 61, 61, 61, 61, 61, 61, 61, 61, 61, 61, 61, 61, 61, 61, 61, 61, 61, 61,
            61, 61, 61, 61, 61, 61, 61, 61, 61, 61, 61, 61, 61, 61, 61, 61, 61, 61, 61, 61, 61, 61, 61, 61, 61,
            61, 61, 61, 61, 61, 61, 61, 61, 61, 61, 61, 61, 61, 61, 61, 61, 61, 61, 61, 61, 61, 61, 61, 61, 61,
            61, 61, 61, 61, 61, 61, 61, 61, 61, 61, 61, 61, 61, 61, 61, 61, 61, 61, 61, 61, 61, 61, 61, 61, 61,
            61, 61, 61, 61, 61, 61, 61, 61, 61, 61, 61, 61, 61, 61, 61, 61, 61, 61, 61, 61, 61, 61, 61, 61, 61,
            61, 61, 61, 61, 61, 61, 61, 61, 61, 61, 61, 61, 61, 61, 61, 61, 61, 61, 61, 61, 61, 61, 61, 61, 61,
            61, 61, 61, 61, 61, 61, 61, 61, 61, 61, 61, 61, 61, 61, 61, 61, 61, 61, 61, 61, 61, 61, 61, 61, 61,
            61, 61, 61, 61, 61, 61, 61, 61, 61, 61, 61, 61, 61, 61, 61, 61, 61, 61, 61, 61, 61, 61, 61, 61, 61,
            61, 61, 61, 61, 61, 61, 61, 61, 61, 61, 61, 61, 61, 61, 61, 61, 61, 61, 61, 61, 61, 61, 61, 61, 61,
            61, 61, 61, 61, 61, 61, 61, 61, 61, 61, 61, 61, 61, 61, 61, 61, 61, 61, 61, 61, 61, 61, 61, 61, 61,
            61, 61, 61, 61, 61, 61, 61, 61, 61, 61, 61, 61, 61, 61, 61, 61, 61, 61, 61, 61, 61, 61, 61, 61, 61,
            61, 61, 61, 61, 61, 61, 61, 61, 61, 61, 61, 61, 61, 61, 61, 61, 61, 61, 61, 61, 61, 61, 61, 61, 61,
            61, 61, 61, 61, 61, 61, 61, 61, 61, 61, 61, 61, 61, 61, 61, 61, 61, 61, 61, 61, 61, 61, 61, 61, 61,
            61, 61, 61, 61, 61, 61, 61, 61, 61, 61, 61, 61, 61, 61, 61, 61, 61, 61, 61, 61, 61, 61, 61, 61, 61,
            61, 61, 61, 61, 61, 61, 61, 61, 61, 61, 61, 61, 61, 61, 61, 61, 61, 61, 61, 61, 61, 61, 61, 61, 61,
            61, 61, 61, 61, 61, 61, 61, 61, 61, 61, 61, 61, 61, 61, 61, 61, 61, 61, 61, 61, 61, 61, 61, 61, 61,
            61, 61, 61, 61, 61, 61, 61, 61, 61, 61, 61, 61, 61, 61, 61, 61, 61, 61, 61, 61, 61, 61, 61, 61, 61,
            61, 61, 61, 61, 61, 61, 61, 61, 61, 61, 61, 61, 61, 61, 61, 61, 61, 61, 61, 61, 61, 61, 61, 61, 61,
            61, 61, 61, 61, 61, 61, 61, 61, 61, 61, 61, 61, 61, 61, 61, 61, 61, 61, 61, 61, 61, 61, 61, 61, 61,
            61, 61, 61, 61, 61, 61, 61, 61, 61, 61, 61, 61, 61, 61, 61, 61, 61, 61, 61, 61, 61, 61, 61, 61, 61,
            61, 61, 61, 61, 61, 61, 61, 61, 61, 61, 61, 61, 61, 61, 61, 61, 61, 61, 61, 61, 61, 61, 61, 61, 61,
            61, 61, 61, 61, 61, 61, 61, 61, 61, 61, 61, 61, 61, 61, 61, 61, 61, 61, 61, 61, 61, 61, 61, 61, 61,
            61, 61, 61, 61, 61, 61, 61, 61, 61, 61, 61, 61, 61, 61, 61, 61, 61, 61, 61, 61, 61, 61, 61, 61, 61,
            61, 61, 61, 61, 61, 61, 61, 61, 61, 61, 61, 61, 61, 61, 61, 61, 61, 61, 61, 61, 61, 61, 61, 61, 61,
            61, 61, 61, 61, 61, 61, 61, 61, 61, 61, 61, 61, 61, 61, 61, 61, 61, 61, 61, 61, 61, 61, 61, 61, 61],
         "height":25,
         "id":3,
         "name":"Back",
         "opacity":1,
         "type":"tilelayer",
         "visible":true,
         "width":25,
         "x":0,
         "y":0
        }, 
        {
         "data":[13, 0, 0, 0, 0, 0, 0, 0, 0, 0, 0, 0, 0, 0, 0, 0, 0, 0, 0, 0, 0, 0, 0, 0, 11,
            13, 0, 0, 0, 0, 0, 0, 0, 0, 0, 0, 0, 0, 0, 0, 0, 0, 0, 0, 0, 0, 0, 0, 0, 11,
            13, 0, 0, 0, 0, 0, 31, 0, 0, 31, 0, 0, 31, 0, 0, 31, 0, 0, 31, 0, 0, 31, 0, 0, 11,
            13, 0, 0, 0, 0, 0, 0, 0, 0, 0, 0, 0, 0, 0, 0, 0, 0, 0, 0, 0, 0, 0, 0, 0, 11,
            13, 0, 1, 2, 3, 0, 0, 0, 0, 0, 0, 0, 0, 0, 0, 0, 0, 0, 0, 0, 0, 0, 0, 0, 11,
            13, 0, 11, 12, 13, 0, 0, 1, 2, 2, 2, 2, 2, 2, 2, 2, 2, 2, 2, 3, 0, 0, 0, 0, 11,
            13, 0, 21, 22, 23, 0, 0, 21, 22, 22, 22, 22, 22, 22, 22, 22, 22, 22, 22, 23, 0, 0, 0, 0, 11,
            13, 0, 0, 0, 0, 0, 0, 0, 0, 0, 0, 0, 0, 0, 0, 0, 0, 0, 0, 0, 0, 0, 0, 0, 11,
            13, 0, 0, 0, 0, 0, 0, 0, 0, 0, 0, 0, 0, 0, 0, 0, 0, 0, 0, 0, 0, 1, 2, 2, 26,
            13, 0, 0, 0, 0, 0, 0, 0, 0, 0, 0, 0, 0, 1, 2, 2, 2, 2, 2, 2, 2, 26, 12, 12, 12,
            13, 0, 0, 0, 0, 0, 0, 0, 0, 1, 2, 2, 2, 26, 12, 12, 12, 12, 12, 4, 22, 22, 22, 22, 6,
            13, 8, 8, 8, 8, 8, 1, 2, 2, 26, 12, 12, 12, 12, 12, 4, 22, 22, 22, 23, 0, 0, 0, 0, 11,
            13, 0, 0, 0, 0, 0, 11, 12, 12, 12, 12, 12, 4, 22, 22, 23, 0, 0, 0, 0, 0, 0, 0, 0, 11,
            13, 0, 0, 0, 0, 0, 21, 22, 22, 22, 22, 22, 23, 0, 0, 0, 0, 0, 0, 0, 0, 0, 0, 0, 11,
            13, 0, 0, 0, 0, 0, 0, 0, 0, 0, 0, 0, 0, 0, 0, 0, 0, 0, 0, 0, 0, 0, 0, 0, 11,
            13, 8, 8, 9, 0, 0, 0, 0, 0, 0, 0, 0, 0, 0, 1, 2, 2, 2, 2, 3, 0, 0, 0, 7, 11,
            13, 0, 0, 0, 0, 0, 0, 0, 0, 0, 0, 0, 0, 0, 11, 4, 22, 22, 22, 23, 0, 0, 0, 0, 11,
            13, 0, 0, 0, 0, 0, 0, 0, 0, 0, 0, 0, 0, 1, 26, 13, 0, 0, 0, 0, 0, 0, 0, 1, 26,
            13, 9, 0, 0, 0, 0, 0, 0, 0, 1, 2, 2, 2, 26, 4, 23, 0, 0, 0, 0, 0, 0, 7, 21, 6,
            13, 0, 0, 0, 1, 2, 2, 2, 2, 26, 4, 22, 22, 22, 23, 0, 0, 0, 0, 0, 0, 0, 0, 0, 11,
            24, 2, 2, 2, 26, 4, 22, 22, 22, 22, 23, 0, 0, 0, 0, 0, 0, 0, 0, 0, 0, 0, 0, 0, 11,
            4, 22, 22, 22, 22, 23, 0, 0, 0, 0, 0, 0, 0, 0, 0, 0, 0, 0, 0, 1, 3, 0, 0, 0, 11,
            13, 0, 0, 0, 0, 0, 0, 0, 0, 0, 0, 0, 0, 0, 1, 3, 0, 0, 0, 11, 13, 0, 0, 0, 11,
            13, 0, 0, 0, 0, 0, 0, 0, 0, 1, 3, 0, 0, 0, 11, 13, 0, 0, 0, 11, 13, 0, 0, 0, 11,
            13, 8, 8, 8, 32, 34, 8, 8, 8, 21, 23, 8, 8, 8, 21, 23, 8, 8, 8, 21, 23, 8, 8, 8, 11],
         "height":25,
         "id":1,
         "name":"Tiles",
         "opacity":1,
         "type":"tilelayer",
         "visible":true,
         "width":25,
         "x":0,
         "y":0
        }, 
        {
         "draworder":"topdown",
         "id":2,
         "name":"Objects",
         "objects":[
                {
                 "height":800,
                 "id":5,
                 "name":"",
                 "rotation":0,
                 "type":"Wall",
                 "visible":true,
                 "width":32,
                 "x":0,
                 "y":0
                }, 
                {
                 "height":800,
                 "id":6,
                 "name":"",
                 "rotation":0,
                 "type":"Wall",
                 "visible":true,
                 "width":32,
                 "x":768,
                 "y":0
                }, 
                {
                 "height":64,
                 "id":126,
                 "name":"",
                 "rotation":0,
                 "type":"Wall",
                 "visible":true,
                 "width":416,
                 "x":224,
                 "y":160
                }, 
                {
                 "height":96,
                 "id":127,
                 "name":"",
                 "rotation":0,
                 "type":"Wall",
                 "visible":true,
                 "width":96,
                 "x":64,
                 "y":128
                }, 
                {
                 "height":96,
                 "id":128,
                 "name":"",
                 "rotation":0,
                 "type":"Wall",
                 "visible":true,
                 "width":96,
                 "x":672,
                 "y":256
                }, 
                {
                 "height":64,
                 "id":129,
                 "name":"",
                 "rotation":0,
                 "type":"Wall",
                 "visible":true,
                 "width":256,
                 "x":416,
                 "y":288
                }, 
                {
                 "height":31.1131811830461,
                 "id":130,
                 "name":"",
                 "rotation":0,
                 "type":"Wall",
                 "visible":true,
                 "width":124.922217047042,
                 "x":291.077782952958,
                 "y":320.886818816954
                }, 
                {
                 "height":96,
                 "id":131,
                 "name":"",
                 "rotation":0,
                 "type":"Wall",
                 "visible":true,
                 "width":224,
                 "x":192,
                 "y":352
                }, 
                {
                 "height":32,
                 "id":132,
                 "name":"",
                 "rotation":0,
                 "type":"Wall",
                 "visible":true,
                 "width":224,
                 "x":416,
                 "y":352
                }, 
                {
                 "height":32,
                 "id":133,
                 "name":"",
                 "rotation":0,
                 "type":"Wall",
                 "visible":true,
                 "width":96,
                 "x":416,
                 "y":384
                }, 
                {
                 "height":64,
                 "id":134,
                 "name":"",
                 "rotation":0,
                 "type":"Wall",
                 "visible":true,
                 "width":192,
                 "x":448,
                 "y":480
                }, 
                {
                 "height":64,
                 "id":135,
                 "name":"",
                 "rotation":0,
                 "type":"Wall",
                 "visible":true,
                 "width":96,
                 "x":416,
                 "y":544
                }, 
                {
                 "height":32,
                 "id":136,
                 "name":"",
                 "rotation":0,
                 "type":"Wall",
                 "visible":true,
                 "width":128,
                 "x":288,
                 "y":576
                }, 
                {
                 "height":32,
                 "id":137,
                 "name":"",
                 "rotation":0,
                 "type":"Wall",
                 "visible":true,
                 "width":352,
                 "x":128,
                 "y":608
                }, 
                {
                 "height":32,
                 "id":138,
                 "name":"",
                 "rotation":0,
                 "type":"Wall",
                 "visible":true,
                 "width":320,
                 "x":32,
                 "y":640
                }, 
                {
                 "height":32,
                 "id":139,
                 "name":"",
                 "rotation":0,
                 "type":"Wall",
                 "visible":true,
                 "width":160,
                 "x":32,
                 "y":672
                }, 
                {
                 "height":32,
                 "id":140,
                 "name":"",
                 "rotation":0,
                 "type":"Wall",
                 "visible":true,
                 "width":64,
                 "x":128,
                 "y":768
                }, 
                {
                 "height":64,
                 "id":141,
                 "name":"",
                 "rotation":0,
                 "type":"Wall",
                 "visible":true,
                 "width":64,
                 "x":288,
                 "y":736
                }, 
                {
                 "height":96,
                 "id":142,
                 "name":"",
                 "rotation":0,
                 "type":"Wall",
                 "visible":true,
                 "width":64,
                 "x":448,
                 "y":704
                }, 
                {
                 "height":128,
                 "id":143,
                 "name":"",
                 "rotation":0,
                 "type":"Wall",
                 "visible":true,
                 "width":64,
                 "x":608,
                 "y":672
                }, 
                {
                 "height":64,
                 "id":144,
                 "name":"",
                 "rotation":0,
                 "type":"Wall",
                 "visible":true,
                 "width":32,
                 "x":736,
                 "y":544
                }, 
                {
                 "height":32,
                 "id":145,
                 "name":"",
                 "rotation":0,
                 "type":"Wall",
                 "visible":true,
                 "width":32,
                 "x":192,
                 "y":64
                }, 
                {
                 "height":32,
                 "id":146,
                 "name":"",
                 "rotation":0,
                 "type":"Wall",
                 "visible":true,
                 "width":32,
                 "x":288,
                 "y":64
                }, 
                {
                 "height":32,
                 "id":151,
                 "name":"",
                 "rotation":0,
                 "type":"Wall",
                 "visible":true,
                 "width":32,
                 "x":288,
                 "y":64
                }, 
                {
                 "height":32,
                 "id":147,
                 "name":"",
                 "rotation":0,
                 "type":"Wall",
                 "visible":true,
                 "width":32,
                 "x":384,
                 "y":64
                },
            
                {
                 "height":32,
                 "id":148,
                 "name":"",
                 "rotation":0,
                 "type":"Wall",
                 "visible":true,
                 "width":32,
                 "x":480,
                 "y":64
                }, 
                {
                 "height":32,
                 "id":149,
                 "name":"",
                 "rotation":0,
                 "type":"Wall",
                 "visible":true,
                 "width":32,
                 "x":576,
                 "y":64
                }, 
                {
                 "height":32,
                 "id":150,
                 "name":"",
                 "rotation":0,
                 "type":"Wall",
                 "visible":true,
                 "width":32,
                 "x":672,
                 "y":64
                }, 
                {
                 "height":32,
                 "id":152,
                 "name":"",
                 "properties":[
                        {
                         "name":"sides",
                         "type":"int",
                         "value":2
                        }],
                 "rotation":0,
                 "type":"Wall",
                 "visible":true,
                 "width":160,
                 "x":32,
                 "y":352
                }, 
                {
                 "height":32,
                 "id":153,
                 "name":"",
                 "properties":[
                        {
                         "name":"sides",
                         "type":"int",
                         "value":2
                        }],
                 "rotation":0,
                 "type":"Wall",
                 "visible":true,
                 "width":96,
                 "x":32,
                 "y":480
                }, 
                {
                 "height":32,
                 "id":154,
                 "name":"",
                 "properties":[
                        {
                         "name":"sides",
                         "type":"int",
                         "value":2
                        }],
                 "rotation":0,
                 "type":"Wall",
                 "visible":true,
                 "width":32,
                 "x":32,
                 "y":576
                }, 
                {
                 "height":32,
                 "id":155,
                 "name":"",
                 "properties":[
                        {
                         "name":"sides",
                         "type":"int",
                         "value":2
                        }],
                 "rotation":0,
                 "type":"Wall",
                 "visible":true,
                 "width":32,
                 "x":704,
                 "y":576
                }, 
                {
                 "height":32,
                 "id":156,
                 "name":"",
                 "properties":[
                        {
                         "name":"sides",
                         "type":"int",
                         "value":2
                        }],
                 "rotation":0,
                 "type":"Wall",
                 "visible":true,
                 "width":736,
                 "x":32,
                 "y":768
                }, 
                {
                 "height":32,
                 "id":157,
                 "name":"",
                 "rotation":0,
                 "type":"EnemySpawn",
                 "visible":true,
                 "width":416,
                 "x":224,
                 "y":128
                }, 
                {
                 "height":32,
                 "id":158,
                 "name":"",
                 "rotation":0,
                 "type":"EnemySpawn",
                 "visible":true,
                 "width":416,
                 "x":224,
                 "y":96
                }, 
                {
                 "height":32,
                 "id":159,
                 "name":"",
                 "rotation":0,
                 "type":"EnemySpawn",
                 "visible":true,
                 "width":256,
                 "x":416,
                 "y":256
                }, 
                {
                 "height":32,
                 "id":160,
                 "name":"",
                 "rotation":0,
                 "type":"EnemySpawn",
                 "visible":true,
                 "width":256,
                 "x":32,
                 "y":320
                }, 
                {
                 "height":32,
                 "id":161,
                 "name":"",
                 "rotation":0,
                 "type":"EnemySpawn",
                 "visible":true,
                 "width":192,
                 "x":448,
                 "y":448
                }, 
                {
                 "height":32,
                 "id":162,
                 "name":"",
                 "rotation":0,
                 "type":"EnemySpawn",
                 "visible":true,
                 "width":288,
                 "x":128,
                 "y":544
                }, 
                {
                 "height":192,
                 "id":163,
                 "name":"",
                 "rotation":0,
                 "type":"WaterFall",
                 "visible":true,
                 "width":32,
                 "x":416,
                 "y":-32
                }, 
                {
                 "height":192,
                 "id":164,
                 "name":"",
                 "rotation":0,
                 "type":"WaterFall",
                 "visible":true,
                 "width":32,
                 "x":352,
                 "y":-32
                }, 
                {
                 "height":192,
                 "id":165,
                 "name":"",
                 "rotation":0,
                 "type":"WaterFall",
                 "visible":true,
                 "width":32,
                 "x":224,
                 "y":160
                }, 
                {
                 "height":128,
                 "id":166,
                 "name":"",
                 "rotation":0,
                 "type":"WaterFall",
                 "visible":true,
                 "width":32,
                 "x":608,
                 "y":160
                }, 
                {
                 "height":256,
                 "id":167,
                 "name":"",
                 "rotation":0,
                 "type":"WaterFall",
                 "visible":true,
                 "width":32,
                 "x":160,
                 "y":352
                }, 
                {
                 "height":480,
                 "id":168,
                 "name":"",
                 "rotation":0,
                 "type":"WaterFall",
                 "visible":true,
                 "width":32,
                 "x":576,
                 "y":288
                }, 
                {
                 "height":160,
                 "id":169,
                 "name":"",
                 "rotation":0,
                 "type":"WaterFall",
                 "visible":true,
                 "width":32,
                 "x":192,
                 "y":608
                }, 
                {
                 "height":0,
                 "id":170,
                 "name":"",
                 "polyline":[
                        {
                         "x":0,
                         "y":0
                        }, 
                        {
                         "x":171.401956217979,
                         "y":2.79459711224968
                        }, 
                        {
                         "x":251.513740102469,
                         "y":-35.3982300884956
                        }, 
                        {
                         "x":417.326502095948,
                         "y":-63.3442012109921
                        }, 
                        {
                         "x":569.166278528179,
                         "y":-96.8793665579879
                        }, 
                        {
                         "x":653.004191895668,
                         "y":-202.142524452725
                        }, 
                        {
                         "x":686.539357242664,
                         "y":-244.061481136469
                        }, 
                        {
                         "x":650.209594783419,
                         "y":-302.748020493712
                        }, 
                        {
                         "x":530.973451327434,
                         "y":-288.775034932464
                        }, 
                        {
                         "x":393.106660456451,
                         "y":-283.185840707965
                        }, 
                        {
                         "x":311.131811830461,
                         "y":-262.692128551467
                        }, 
                        {
                         "x":299.953423381463,
                         "y":-189.101071262226
                        }, 
                        {
                         "x":198.416394969725,
                         "y":-190.032603632976
                        }, 
                        {
                         "x":78.2487191429902,
                         "y":-149.045179319981
                        }, 
                        {
                         "x":-10.2468560782487,
                         "y":-186.306474149977
                        }, 
                        {
                         "x":16.7675826734979,
                         "y":-295.295761527713
                        }, 
                        {
                         "x":39.1243595714951,
                         "y":-431.299487657196
                        }, 
                        {
                         "x":176.991150442478,
                         "y":-420.121099208198
                        }, 
                        {
                         "x":219.841639496973,
                         "y":-457.382394038193
                        }, 
                        {
                         "x":320.44713553796,
                         "y":-446.204005589194
                        }, 
                        {
                         "x":353.050768514206,
                         "y":-485.328365160689
                        }, 
                        {
                         "x":581.276199347927,
                         "y":-478.80763856544
                        }, 
                        {
                         "x":593.386120167676,
                         "y":-509.548206800186
                        }, 
                        {
                         "x":657.661853749418,
                         "y":-515.137401024686
                        }, 
                        {
                         "x":604.564508616674,
                         "y":-605.496040987424
                        },
                    
                        {
                         "x":502.095947834187,
                         "y":-613.879832324173
                        }, 
                        {
                         "x":342.803912435957,
                         "y":-607.359105728924
                        }, 
                        {
                         "x":249.650675360969,
                         "y":-612.016767582674
                        }, 
                        {
                         "x":175.128085700978,
                         "y":-608.290638099674
                        }, 
                        {
                         "x":121.099208197485,
                         "y":-609.222170470424
                        }, 
                        {
                         "x":119.236143455985,
                         "y":-426.641825803447
                        }, 
                        {
                         "x":137.866790870983,
                         "y":-427.573358174197
                        }, 
                        {
                         "x":143.455985095482,
                         "y":-596.180717279925
                        }, 
                        {
                         "x":129.482999534234,
                         "y":-598.975314392175
                        }, 
                        {
                         "x":130.414531904984,
                         "y":-438.751746623195
                        }],
                 "rotation":0,
                 "type":"RuneLine",
                 "visible":true,
                 "width":0,
                 "x":65.2072659524919,
                 "y":748.020493712157
                }, 
                {
                 "height":0,
                 "id":171,
                 "name":"",
                 "polyline":[
                        {
                         "x":0,
                         "y":0
                        }, 
                        {
                         "x":-89.4271075919888,
                         "y":-3.72612948299953
                        }, 
                        {
                         "x":-11.1783884489986,
                         "y":-67.0703306939916
                        }, 
                        {
                         "x":47.5081509082441,
                         "y":-73.5910572892408
                        }, 
                        {
                         "x":94.0847694457383,
                         "y":-95.947834187238
                        }, 
                        {
                         "x":144.387517466232,
                         "y":-64.275733581742
                        }, 
                        {
                         "x":184.443409408477,
                         "y":-97.8108989287378
                        }, 
                        {
                         "x":236.60922217047,
                         "y":-61.4811364694923
                        }, 
                        {
                         "x":275.733581741966,
                         "y":-102.468560782487
                        }, 
                        {
                         "x":332.557056357708,
                         "y":-67.0703306939916
                        }, 
                        {
                         "x":371.681415929204,
                         "y":-97.8108989287378
                        }, 
                        {
                         "x":423.847228691197,
                         "y":-61.4811364694923
                        }, 
                        {
                         "x":473.218444340941,
                         "y":-101.537028411737
                        }, 
                        {
                         "x":524.452724732184,
                         "y":-61.4811364694923
                        }],
                 "rotation":0,
                 "type":"RuneLine",
                 "visible":true,
                 "width":0,
                 "x":162.08663251048,
                 "y":115.510013972986
                }, 
                {
                 "height":32,
                 "id":172,
                 "name":"",
                 "properties":[
                        {
                         "name":"sides",
                         "type":"int",
                         "value":2
                        }],
                 "rotation":0,
                 "type":"Wall",
                 "visible":true,
                 "width":32,
                 "x":736,
                 "y":480
                }],
         "opacity":1,
         "type":"objectgroup",
         "visible":true,
         "x":0,
         "y":0
        }],
 "nextlayerid":4,
 "nextobjectid":173,
 "orientation":"orthogonal",
 "renderorder":"right-down",
 "tiledversion":"1.8.4",
 "tileheight":32,
 "tilesets":[
        {
         "firstgid":1,
         "source":"test-tileset.json"
        }],
 "tilewidth":32,
 "type":"map",
 "version":"1.8",
 "width":25
}