<?xml version="1.0" encoding="utf-8"?>
<!-- Generator: Adobe Illustrator 20.1.0, SVG Export Plug-In . SVG Version: 6.00 Build 0)  -->
<svg version="1.1" id="Layer_1" xmlns="http://www.w3.org/2000/svg" xmlns:xlink="http://www.w3.org/1999/xlink" x="0px" y="0px"
	 viewBox="0 0 1792 1792" style="enable-background:new 0 0 1792 1792;" xml:space="preserve">
<path d="M631.5,966.8l266.5-266.5c5.9-5.9,13.7-9.3,22-9.3c17.1,0,31.3,14.2,31.3,31.3v145.1h227.4c17.1,0,31.3,14.2,31.3,31.3
	v180.1c0,17.1-14.2,31.3-31.3,31.3H951.3v145.1c0,17.1-14.2,31.3-31.3,31.3c-8.3,0-16.2-3.4-22-9.3l-266.5-266.5
	c-5.9-5.9-9.3-13.7-9.3-22C622.1,980.5,625.6,972.7,631.5,966.8z M1341.6,1309.8h-258.4c-28.7,0-52-23.3-52-52s23.3-52,52-52h226.3
	V762.1h-225.8c-28.7,0-52-23.3-52-52s23.3-52,52-52H1353c33.4,0,60.5,27.1,60.5,60.5v519.3
	C1413.5,1277.6,1381.2,1309.8,1341.6,1309.8z M1435.6,1630.5h-1079c-57.3,0-111.2-22.3-151.7-62.8c-40.5-40.5-62.8-94.4-62.8-151.7
	V317c0-68.7,55.9-124.5,124.5-124.5h518.8c68.7,0,124.5,55.9,124.5,124.5v105.5h525.7c57.3,0,111.2,22.3,151.7,62.8
	s62.8,94.4,62.8,151.7v779c0,57.3-22.3,111.2-62.8,151.7S1492.9,1630.5,1435.6,1630.5z M270.1,320.5V1416
	c0,47.7,38.8,86.5,86.5,86.5h1079c47.7,0,86.5-38.8,86.5-86.5V637c0-47.7-38.8-86.5-86.5-86.5H847.7c-36.3,0-65.8-29.5-65.8-65.8
	V320.5H270.1z"/>
</svg>
