<?xml version="1.0" encoding="UTF-8" standalone="no"?>
<svg xmlns="http://www.w3.org/2000/svg" version="1.1" viewBox="0 0 100 100" height="100%" width="100%">
  <g transform="translate(0,-952.36216)">
    <path transform="translate(0,952.36216)" d="M 40 0 L 40 40 L 0 40 L 0 60 L 40 60 L 40 100 L 60 100 L 60 60 L 100 60 L 100 40 L 60 40 L 60 0 L 40 0 z " />
  </g>
</svg>
