{
  "users": [
    {
      "name": "Wendel Santos",
      "email": "wendel@teste.com",
      "id": 1
    },
    {
      "name": "Larisse Castro",
      "email": "larisse@teste.com",
      "id": 2
    }
  ]
}