%YAML 1.1
%TAG !u! tag:unity3d.com,2011:
--- !u!1001 &3422430567760434684
PrefabInstance:
  m_ObjectHideFlags: 0
  serializedVersion: 2
  m_Modification:
    m_TransformParent: {fileID: 0}
    m_Modifications:
    - target: {fileID: 683665610373081309, guid: bc9441cc2d6004844bc2b88991c59fa8,
        type: 3}
      propertyPath: m_Name
      value: Tower 3
      objectReference: {fileID: 0}
    - target: {fileID: 683665610373081307, guid: bc9441cc2d6004844bc2b88991c59fa8,
        type: 3}
      propertyPath: m_LocalPosition.x
      value: 0
      objectReference: {fileID: 0}
    - target: {fileID: 683665610373081307, guid: bc9441cc2d6004844bc2b88991c59fa8,
        type: 3}
      propertyPath: m_LocalPosition.y
      value: 0
      objectReference: {fileID: 0}
    - target: {fileID: 683665610373081307, guid: bc9441cc2d6004844bc2b88991c59fa8,
        type: 3}
      propertyPath: m_LocalPosition.z
      value: 0
      objectReference: {fileID: 0}
    - target: {fileID: 683665610373081307, guid: bc9441cc2d6004844bc2b88991c59fa8,
        type: 3}
      propertyPath: m_LocalRotation.x
      value: 0
      objectReference: {fileID: 0}
    - target: {fileID: 683665610373081307, guid: bc9441cc2d6004844bc2b88991c59fa8,
        type: 3}
      propertyPath: m_LocalRotation.y
      value: 0
      objectReference: {fileID: 0}
    - target: {fileID: 683665610373081307, guid: bc9441cc2d6004844bc2b88991c59fa8,
        type: 3}
      propertyPath: m_LocalRotation.z
      value: 0
      objectReference: {fileID: 0}
    - target: {fileID: 683665610373081307, guid: bc9441cc2d6004844bc2b88991c59fa8,
        type: 3}
      propertyPath: m_LocalRotation.w
      value: 1
      objectReference: {fileID: 0}
    - target: {fileID: 683665610373081307, guid: bc9441cc2d6004844bc2b88991c59fa8,
        type: 3}
      propertyPath: m_RootOrder
      value: 0
      objectReference: {fileID: 0}
    - target: {fileID: 683665610373081307, guid: bc9441cc2d6004844bc2b88991c59fa8,
        type: 3}
      propertyPath: m_LocalEulerAnglesHint.x
      value: 0
      objectReference: {fileID: 0}
    - target: {fileID: 683665610373081307, guid: bc9441cc2d6004844bc2b88991c59fa8,
        type: 3}
      propertyPath: m_LocalEulerAnglesHint.y
      value: 0
      objectReference: {fileID: 0}
    - target: {fileID: 683665610373081307, guid: bc9441cc2d6004844bc2b88991c59fa8,
        type: 3}
      propertyPath: m_LocalEulerAnglesHint.z
      value: 0
      objectReference: {fileID: 0}
    - target: {fileID: 8454866598398111800, guid: bc9441cc2d6004844bc2b88991c59fa8,
        type: 3}
      propertyPath: _shootDistance
      value: 4
      objectReference: {fileID: 0}
    - target: {fileID: 8454866598398111800, guid: bc9441cc2d6004844bc2b88991c59fa8,
        type: 3}
      propertyPath: _bulletSplashRadius
      value: 2
      objectReference: {fileID: 0}
    - target: {fileID: 8454866598398111800, guid: bc9441cc2d6004844bc2b88991c59fa8,
        type: 3}
      propertyPath: _towerPlace
      value: 
      objectReference: {fileID: 2738808938127211808}
    - target: {fileID: 8454866598398111800, guid: bc9441cc2d6004844bc2b88991c59fa8,
        type: 3}
      propertyPath: _towerHead
      value: 
      objectReference: {fileID: 2738808936924668606}
    - target: {fileID: 683665611301320514, guid: bc9441cc2d6004844bc2b88991c59fa8,
        type: 3}
      propertyPath: m_Sprite
      value: 
      objectReference: {fileID: 21300000, guid: 7fb4c8edb6d91b04b8efc88228bfef6b,
        type: 3}
    m_RemovedComponents: []
  m_SourcePrefab: {fileID: 100100000, guid: bc9441cc2d6004844bc2b88991c59fa8, type: 3}
--- !u!212 &2738808938127211808 stripped
SpriteRenderer:
  m_CorrespondingSourceObject: {fileID: 683665610373081308, guid: bc9441cc2d6004844bc2b88991c59fa8,
    type: 3}
  m_PrefabInstance: {fileID: 3422430567760434684}
  m_PrefabAsset: {fileID: 0}
--- !u!212 &2738808936924668606 stripped
SpriteRenderer:
  m_CorrespondingSourceObject: {fileID: 683665611301320514, guid: bc9441cc2d6004844bc2b88991c59fa8,
    type: 3}
  m_PrefabInstance: {fileID: 3422430567760434684}
  m_PrefabAsset: {fileID: 0}
