{
  "project_info": {
    "project_number": "105575796020",
    "project_id": "fir-prepare",
    "storage_bucket": "fir-prepare.appspot.com"
  },
  "client": [
    {
      "client_info": {
        "mobilesdk_app_id": "1:105575796020:android:dfe2fe6a425e7aac7fe961",
        "android_client_info": {
          "package_name": "com.wenda.firebase"
        }
      },
      "oauth_client": [
        {
          "client_id": "105575796020-ps5k0vuvv384ddnhu95iqp70fq6fmrij.apps.googleusercontent.com",
          "client_type": 3
        }
      ],
      "api_key": [
        {
          "current_key": "AIzaSyCtC62eqmJV6dkHvsXc8YjuWRkLcW5G2PQ"
        }
      ],
      "services": {
        "appinvite_service": {
          "other_platform_oauth_client": [
            {
              "client_id": "105575796020-ps5k0vuvv384ddnhu95iqp70fq6fmrij.apps.googleusercontent.com",
              "client_type": 3
            }
          ]
        }
      }
    }
  ],
  "configuration_version": "1"
}