%YAML 1.1
%TAG !u! tag:unity3d.com,2011:
--- !u!1045 &1
EditorBuildSettings:
  m_ObjectHideFlags: 0
  serializedVersion: 2
  m_Scenes:
  - enabled: 0
    path: 
    guid: 00000000000000000000000000000000
  - enabled: 1
    path: Assets/Scenes/Main.unity
    guid: 33690cca17cd79c46a84354a8cd3e40f
  - enabled: 1
    path: Assets/Scenes/Level 1.unity
    guid: 3abf28f7268e8ec4ba3776efd25e4ea1
  m_configObjects: {}
