-0.1 0.0278889
-0.2 0.0448889
-0.3 0.051
-0.4 0.0462222
-0.5 0.0305556
-0.6 0.004
-0.7 -0.0334444
-0.8 -0.0817778
-0.9 -0.141
-0.9 -0.211111
-0.8 -0.292111
-0.7 -0.384
-0.6 -0.486778
-0.5 -0.600444
-0.4 -0.725
-0.3 -0.860444
-0.2 -0.860444
-0.1 -0.725
-2.77556e-17 -0.600444
0.1 -0.486778
0.2 -0.384
0.3 -0.292111
0.4 -0.211111
0.5 -0.141
0.6 -0.0817778
0.7 -0.0334444
0.8 0.004
0.9 0.0305556
0.9 0.0462222
0.8 0.051
0.7 0.0448889
0.6 0.0278889
0.5 4.68375e-17
0.4 -0.0387778
0.3 -0.0884444
0.2 -0.149
0.1 -0.220444
2.77556e-17 -0.302778
-0.1 -0.396
-0.2 -0.500111
-0.3 -0.615111
-0.4 -0.741
-0.5 -0.877778
-0.6 -0.877778
-0.7 -0.741
-0.8 -0.615111
-0.9 -0.500111
-0.9 -0.396
-0.8 -0.302778
-0.7 -0.220444
-0.6 -0.149
-0.5 -0.0884444
-0.4 -0.0387778
-0.3 1.73472e-18
-0.2 0.0278889
-0.1 0.0448889
-2.77556e-17 0.051
0.1 0.0462222
0.2 0.0305556
0.3 0.004
0.4 -0.0334444
0.5 -0.0817778
0.6 -0.141
0.7 -0.211111
0.8 -0.292111
0.9 -0.384
0.9 -0.486778
0.8 -0.600444
0.7 -0.725
0.6 -0.860444
0.5 -0.860444
0.4 -0.725
0.3 -0.600444
0.2 -0.486778
0.1 -0.384
2.77556e-17 -0.292111
-0.1 -0.211111
-0.2 -0.141
-0.3 -0.0817778
-0.4 -0.0334444
-0.5 0.004
-0.6 0.0305556
-0.7 0.0462222
-0.8 0.051
-0.9 0.0448889
-0.9 0.0278889
-0.8 4.68375e-17
-0.7 -0.0387778
-0.6 -0.0884444
-0.5 -0.149
-0.4 -0.220444
-0.3 -0.302778
-0.2 -0.396
-0.1 -0.500111
-2.77556e-17 -0.615111
0.1 -0.741
0.2 -0.877778
0.3 -0.877778
0.4 -0.741
0.5 -0.615111
0.6 -0.500111
0.7 -0.396
0.8 -0.302778
0.9 -0.220444
0.9 -0.149
0.8 -0.0884444
0.7 -0.0387778
0.6 1.73472e-18
0.5 0.0278889
0.4 0.0448889
0.3 0.051
0.2 0.0462222
0.1 0.0305556
2.77556e-17 0.004
-0.1 -0.0334444
-0.2 -0.0817778
-0.3 -0.141
-0.4 -0.211111
-0.5 -0.292111
-0.6 -0.384
-0.7 -0.486778
-0.8 -0.600444
-0.9 -0.725
-0.9 -0.860444
-0.8 -0.860444
-0.7 -0.725
-0.6 -0.600444
-0.5 -0.486778
-0.4 -0.384
-0.3 -0.292111
-0.2 -0.211111
-0.1 -0.141
-2.77556e-17 -0.0817778
0.1 -0.0334444
0.2 0.004
0.3 0.0305556
0.4 0.0462222
0.5 0.051
0.6 0.0448889
0.7 0.0278889
0.8 4.68375e-17
0.9 -0.0387778
0.9 -0.0884444
0.8 -0.149
0.7 -0.220444
0.6 -0.302778
0.5 -0.396
0.4 -0.500111
0.3 -0.615111
0.2 -0.741
0.1 -0.877778
2.77556e-17 -0.877778
-0.1 -0.741
-0.2 -0.615111
-0.3 -0.500111
-0.4 -0.396
-0.5 -0.302778
-0.6 -0.220444
-0.7 -0.149
-0.8 -0.0884444
-0.9 -0.0387778
-0.9 1.73472e-18
-0.8 0.0278889
-0.7 0.0448889
-0.6 0.051
-0.5 0.0462222
-0.4 0.0305556
-0.3 0.004
-0.2 -0.0334444
-0.1 -0.0817778
-2.77556e-17 -0.141
0.1 -0.211111
0.2 -0.292111
0.3 -0.384
0.4 -0.486778
0.5 -0.600444
0.6 -0.725
0.7 -0.860444
0.8 -0.860444
0.9 -0.725
0.9 -0.600444
0.8 -0.486778
0.7 -0.384
0.6 -0.292111
0.5 -0.211111
0.4 -0.141
0.3 -0.0817778
0.2 -0.0334444
0.1 0.004
2.77556e-17 0.0305556
-0.1 0.0462222
-0.2 0.051
-0.3 0.0448889
-0.4 0.0278889
-0.5 4.68375e-17
-0.6 -0.0387778
-0.7 -0.0884444
-0.8 -0.149
-0.9 -0.220444
-0.9 -0.302778
-0.8 -0.396
-0.7 -0.500111
-0.6 -0.615111
-0.5 -0.741
-0.4 -0.877778
-0.3 -0.877778
-0.2 -0.741
-0.1 -0.615111
-2.77556e-17 -0.500111
0.1 -0.396
0.2 -0.302778
0.3 -0.220444
0.4 -0.149
0.5 -0.0884444
0.6 -0.0387778
0.7 1.73472e-18
0.8 0.0278889
0.9 0.0448889
0.9 0.051
0.8 0.0462222
0.7 0.0305556
0.6 0.004
0.5 -0.0334444
0.4 -0.0817778
0.3 -0.141
0.2 -0.211111
0.1 -0.292111
2.77556e-17 -0.384
-0.1 -0.486778
-0.2 -0.600444
-0.3 -0.725
-0.4 -0.860444
-0.5 -0.860444
-0.6 -0.725
-0.7 -0.600444
-0.8 -0.486778
-0.9 -0.384
-0.9 -0.292111
-0.8 -0.211111
-0.7 -0.141
-0.6 -0.0817778
-0.5 -0.0334444
-0.4 0.004
-0.3 0.0305556
-0.2 0.0462222
-0.1 0.051
-2.77556e-17 0.0448889
0.1 0.0278889
0.2 4.68375e-17
0.3 -0.0387778
0.4 -0.0884444
0.5 -0.149
0.6 -0.220444
0.7 -0.302778
0.8 -0.396
0.9 -0.500111
0.9 -0.615111
0.8 -0.741
0.7 -0.877778
0.6 -0.877778
0.5 -0.741
0.4 -0.615111
0.3 -0.500111
0.2 -0.396
0.1 -0.302778
2.77556e-17 -0.220444
-0.1 -0.149
-0.2 -0.0884444
-0.3 -0.0387778
-0.4 1.73472e-18
-0.5 0.0278889
-0.6 0.0448889
-0.7 0.051
-0.8 0.0462222
-0.9 0.0305556
-0.9 0.004
-0.8 -0.0334444
-0.7 -0.0817778
-0.6 -0.141
-0.5 -0.211111
-0.4 -0.292111
-0.3 -0.384
-0.2 -0.486778
-0.1 -0.600444
-2.77556e-17 -0.725
0.1 -0.860444
0.2 -0.860444
0.3 -0.725
0.4 -0.600444
0.5 -0.486778
0.6 -0.384
0.7 -0.292111
0.8 -0.211111
0.9 -0.141
0.9 -0.0817778
0.8 -0.0334444
0.7 0.004
0.6 0.0305556
0.5 0.0462222
0.4 0.051
0.3 0.0448889
0.2 0.0278889
0.1 4.68375e-17
2.77556e-17 -0.0387778
-0.1 -0.0884444
-0.2 -0.149
-0.3 -0.220444
-0.4 -0.302778
-0.5 -0.396
-0.6 -0.500111
-0.7 -0.615111
-0.8 -0.741
-0.9 -0.877778
-0.9 -0.877778
-0.8 -0.741
-0.7 -0.615111
-0.6 -0.500111
-0.5 -0.396
-0.4 -0.302778
-0.3 -0.220444
-0.2 -0.149
-0.1 -0.0884444
-2.77556e-17 -0.0387778
0.1 1.73472e-18
0.2 0.0278889
0.3 0.0448889
0.4 0.051
0.5 0.0462222
0.6 0.0305556
0.7 0.004
0.8 -0.0334444
0.9 -0.0817778
0.9 -0.141
0.8 -0.211111
0.7 -0.292111
0.6 -0.384
0.5 -0.486778
0.4 -0.600444
0.3 -0.725
0.2 -0.860444
0.1 -0.860444
2.77556e-17 -0.725
-0.1 -0.600444
-0.2 -0.486778
-0.3 -0.384
-0.4 -0.292111
-0.5 -0.211111
-0.6 -0.141
-0.7 -0.0817778
-0.8 -0.0334444
-0.9 0.004
-0.9 0.0305556
-0.8 0.0462222
-0.7 0.051
-0.6 0.0448889
-0.5 0.0278889
-0.4 4.68375e-17
-0.3 -0.0387778
-0.2 -0.0884444
-0.1 -0.149
-2.77556e-17 -0.220444
0.1 -0.302778
0.2 -0.396
0.3 -0.500111
0.4 -0.615111
0.5 -0.741
0.6 -0.877778
0.7 -0.877778
0.8 -0.741
0.9 -0.615111
0.9 -0.500111
0.8 -0.396
0.7 -0.302778
0.6 -0.220444
0.5 -0.149
0.4 -0.0884444
0.3 -0.0387778
0.2 1.73472e-18
0.1 0.0278889
2.77556e-17 0.0448889
-0.1 0.051
-0.2 0.0462222
-0.3 0.0305556
-0.4 0.004
-0.5 -0.0334444
-0.6 -0.0817778
-0.7 -0.141
-0.8 -0.211111
-0.9 -0.292111
-0.9 -0.384
-0.8 -0.486778
-0.7 -0.600444
-0.6 -0.725
-0.5 -0.860444
-0.4 -0.860444
-0.3 -0.725
-0.2 -0.600444
-0.1 -0.486778
-2.77556e-17 -0.384
0.1 -0.292111
0.2 -0.211111
0.3 -0.141
0.4 -0.0817778
0.5 -0.0334444
0.6 0.004
0.7 0.0305556
0.8 0.0462222
0.9 0.051
0.9 0.0448889
0.8 0.0278889
0.7 4.68375e-17
0.6 -0.0387778
0.5 -0.0884444
0.4 -0.149
0.3 -0.220444
0.2 -0.302778
0.1 -0.396
2.77556e-17 -0.500111
-0.1 -0.615111
-0.2 -0.741
-0.3 -0.877778
-0.4 -0.877778
-0.5 -0.741
-0.6 -0.615111
-0.7 -0.500111
-0.8 -0.396
-0.9 -0.302778
-0.9 -0.220444
-0.8 -0.149
-0.7 -0.0884444
-0.6 -0.0387778
-0.5 1.73472e-18
-0.4 0.0278889
-0.3 0.0448889
-0.2 0.051
-0.1 0.0462222
-2.77556e-17 0.0305556
0.1 0.004
0.2 -0.0334444
0.3 -0.0817778
0.4 -0.141
0.5 -0.211111
0.6 -0.292111
0.7 -0.384
0.8 -0.486778
0.9 -0.600444
0.9 -0.725
0.8 -0.860444
0.7 -0.860444
0.6 -0.725
0.5 -0.600444
0.4 -0.486778
0.3 -0.384
0.2 -0.292111
0.1 -0.211111
2.77556e-17 -0.141
-0.1 -0.0817778
-0.2 -0.0334444
-0.3 0.004
-0.4 0.0305556
-0.5 0.0462222
-0.6 0.051
-0.7 0.0448889
-0.8 0.0278889
-0.9 4.68375e-17
-0.9 -0.0387778
-0.8 -0.0884444
-0.7 -0.149
-0.6 -0.220444
-0.5 -0.302778
-0.4 -0.396
-0.3 -0.500111
-0.2 -0.615111
-0.1 -0.741
-2.77556e-17 -0.877778
0.1 -0.877778
0.2 -0.741
0.3 -0.615111
0.4 -0.500111
0.5 -0.396
0.6 -0.302778
0.7 -0.220444
0.8 -0.149
0.9 -0.0884444
0.9 -0.0387778
0.8 1.73472e-18
0.7 0.0278889
0.6 0.0448889
0.5 0.051
0.4 0.0462222
0.3 0.0305556
0.2 0.004
0.1 -0.0334444
2.77556e-17 -0.0817778
-0.1 -0.141
-0.2 -0.211111
-0.3 -0.292111
-0.4 -0.384
-0.5 -0.486778
-0.6 -0.600444
-0.7 -0.725
-0.8 -0.860444
-0.9 -0.860444
-0.9 -0.725
-0.8 -0.600444
-0.7 -0.486778
-0.6 -0.384
-0.5 -0.292111
-0.4 -0.211111
-0.3 -0.141
-0.2 -0.0817778
-0.1 -0.0334444
-2.77556e-17 0.004
0.1 0.0305556
0.2 0.0462222
0.3 0.051
0.4 0.0448889
0.5 0.0278889
0.6 4.68375e-17
0.7 -0.0387778
0.8 -0.0884444
0.9 -0.149
0.9 -0.220444
0.8 -0.302778
0.7 -0.396
0.6 -0.500111
0.5 -0.615111
0.4 -0.741
0.3 -0.877778
0.2 -0.877778
0.1 -0.741
2.77556e-17 -0.615111
-0.1 -0.500111
-0.2 -0.396
-0.3 -0.302778
-0.4 -0.220444
-0.5 -0.149
-0.6 -0.0884444
-0.7 -0.0387778
-0.8 1.73472e-18
-0.9 0.0278889
-0.9 0.0448889
-0.8 0.051
-0.7 0.0462222
-0.6 0.0305556
-0.5 0.004
-0.4 -0.0334444
-0.3 -0.0817778
-0.2 -0.141
-0.1 -0.211111
-2.77556e-17 -0.292111
0.1 -0.384
0.2 -0.486778
0.3 -0.600444
0.4 -0.725
0.5 -0.860444
0.6 -0.860444
0.7 -0.725
0.8 -0.600444
0.9 -0.486778
0.9 -0.384
0.8 -0.292111
0.7 -0.211111
0.6 -0.141
0.5 -0.0817778
0.4 -0.0334444
0.3 0.004
0.2 0.0305556
0.1 0.0462222
2.77556e-17 0.051
-0.1 0.0448889
-0.2 0.0278889
-0.3 4.68375e-17
-0.4 -0.0387778
-0.5 -0.0884444
-0.6 -0.149
-0.7 -0.220444
-0.8 -0.302778
-0.9 -0.396
-0.9 -0.500111
-0.8 -0.615111
-0.7 -0.741
-0.6 -0.877778
-0.5 -0.877778
-0.4 -0.741
-0.3 -0.615111
-0.2 -0.500111
-0.1 -0.396
-2.77556e-17 -0.302778
0.1 -0.220444
0.2 -0.149
0.3 -0.0884444
0.4 -0.0387778
0.5 1.73472e-18
0.6 0.0278889
0.7 0.0448889
0.8 0.051
0.9 0.0462222
0.9 0.0305556
0.8 0.004
0.7 -0.0334444
0.6 -0.0817778
0.5 -0.141
0.4 -0.211111
0.3 -0.292111
0.2 -0.384
0.1 -0.486778
2.77556e-17 -0.600444
-0.1 -0.725
-0.2 -0.860444
-0.3 -0.860444
-0.4 -0.725
-0.5 -0.600444
-0.6 -0.486778
-0.7 -0.384
-0.8 -0.292111
-0.9 -0.211111
-0.9 -0.141
-0.8 -0.0817778
-0.7 -0.0334444
-0.6 0.004
-0.5 0.0305556
-0.4 0.0462222
-0.3 0.051
-0.2 0.0448889
-0.1 0.0278889
-2.77556e-17 4.68375e-17
0.1 -0.0387778
0.2 -0.0884444
0.3 -0.149
0.4 -0.220444
0.5 -0.302778
0.6 -0.396
0.7 -0.500111
0.8 -0.615111
0.9 -0.741
0.9 -0.877778
0.8 -0.877778
0.7 -0.741
0.6 -0.615111
0.5 -0.500111
0.4 -0.396
0.3 -0.302778
0.2 -0.220444
0.1 -0.149
2.77556e-17 -0.0884444
-0.1 -0.0387778
-0.2 1.73472e-18
-0.3 0.0278889
-0.4 0.0448889
-0.5 0.051
-0.6 0.0462222
-0.7 0.0305556
-0.8 0.004
-0.9 -0.0334444
-0.9 -0.0817778
-0.8 -0.141
-0.7 -0.211111
-0.6 -0.292111
-0.5 -0.384
-0.4 -0.486778
-0.3 -0.600444
-0.2 -0.725
-0.1 -0.860444
-2.77556e-17 -0.860444
0.1 -0.725
0.2 -0.600444
0.3 -0.486778
0.4 -0.384
0.5 -0.292111
0.6 -0.211111
0.7 -0.141
0.8 -0.0817778
0.9 -0.0334444
0.9 0.004
0.8 0.0305556
0.7 0.0462222
0.6 0.051
0.5 0.0448889
0.4 0.0278889
0.3 4.68375e-17
0.2 -0.0387778
0.1 -0.0884444
2.77556e-17 -0.149
-0.1 -0.220444
-0.2 -0.302778
-0.3 -0.396
-0.4 -0.500111
-0.5 -0.615111
-0.6 -0.741
-0.7 -0.877778
-0.8 -0.877778
-0.9 -0.741
-0.9 -0.615111
-0.8 -0.500111
-0.7 -0.396
-0.6 -0.302778
-0.5 -0.220444
-0.4 -0.149
-0.3 -0.0884444
-0.2 -0.0387778
-0.1 1.73472e-18
-2.77556e-17 0.0278889
0.1 0.0448889
0.2 0.051
0.3 0.0462222
0.4 0.0305556
0.5 0.004
0.6 -0.0334444
0.7 -0.0817778
0.8 -0.141
0.9 -0.211111
0.9 -0.292111
0.8 -0.384
0.7 -0.486778
0.6 -0.600444
0.5 -0.725
0.4 -0.860444
0.3 -0.860444
0.2 -0.725
0.1 -0.600444
2.77556e-17 -0.486778
-0.1 -0.384
-0.2 -0.292111
-0.3 -0.211111
-0.4 -0.141
-0.5 -0.0817778
-0.6 -0.0334444
-0.7 0.004
-0.8 0.0305556
-0.9 0.0462222
-0.9 0.051
-0.8 0.0448889
-0.7 0.0278889
-0.6 4.68375e-17
-0.5 -0.0387778
-0.4 -0.0884444
-0.3 -0.149
-0.2 -0.220444
-0.1 -0.302778
-2.77556e-17 -0.396
0.1 -0.500111
0.2 -0.615111
0.3 -0.741
0.4 -0.877778
0.5 -0.877778
0.6 -0.741
0.7 -0.615111
0.8 -0.500111
0.9 -0.396
0.9 -0.302778
0.8 -0.220444
0.7 -0.149
0.6 -0.0884444
0.5 -0.0387778
0.4 1.73472e-18
0.3 0.0278889
0.2 0.0448889
0.1 0.051
2.77556e-17 0.0462222
-0.1 0.0305556
-0.2 0.004
-0.3 -0.0334444
-0.4 -0.0817778
-0.5 -0.141
-0.6 -0.211111
-0.7 -0.292111
-0.8 -0.384
-0.9 -0.486778
-0.9 -0.600444
-0.8 -0.725
-0.7 -0.860444
-0.6 -0.860444
-0.5 -0.725
-0.4 -0.600444
-0.3 -0.486778
-0.2 -0.384
-0.1 -0.292111
-2.77556e-17 -0.211111
0.1 -0.141
0.2 -0.0817778
0.3 -0.0334444
0.4 0.004
0.5 0.0305556
0.6 0.0462222
0.7 0.051
0.8 0.0448889
0.9 0.0278889
0.9 4.68375e-17
0.8 -0.0387778
0.7 -0.0884444
0.6 -0.149
0.5 -0.220444
0.4 -0.302778
0.3 -0.396
0.2 -0.500111
0.1 -0.615111
2.77556e-17 -0.741
-0.1 -0.877778
-0.2 -0.877778
-0.3 -0.741
-0.4 -0.615111
-0.5 -0.500111
-0.6 -0.396
-0.7 -0.302778
-0.8 -0.220444
-0.9 -0.149
-0.9 -0.0884444
-0.8 -0.0387778
-0.7 1.73472e-18
-0.6 0.0278889
-0.5 0.0448889
-0.4 0.051
-0.3 0.0462222
-0.2 0.0305556
-0.1 0.004
-2.77556e-17 -0.0334444
0.1 -0.0817778
0.2 -0.141
0.3 -0.211111
0.4 -0.292111
0.5 -0.384
0.6 -0.486778
0.7 -0.600444
0.8 -0.725
0.9 -0.860444
0.9 -0.860444
0.8 -0.725
0.7 -0.600444
0.6 -0.486778
0.5 -0.384
0.4 -0.292111
0.3 -0.211111
0.2 -0.141
0.1 -0.0817778
2.77556e-17 -0.0334444
-0.1 0.004
-0.2 0.0305556
-0.3 0.0462222
-0.4 0.051
-0.5 0.0448889
-0.6 0.0278889
-0.7 4.68375e-17
-0.8 -0.0387778
-0.9 -0.0884444
-0.9 -0.149
-0.8 -0.220444
-0.7 -0.302778
-0.6 -0.396
-0.5 -0.500111
-0.4 -0.615111
-0.3 -0.741
-0.2 -0.877778
-0.1 -0.877778
-2.77556e-17 -0.741
0.1 -0.615111
0.2 -0.500111
0.3 -0.396
0.4 -0.302778
0.5 -0.220444
0.6 -0.149
0.7 -0.0884444
0.8 -0.0387778
0.9 1.73472e-18
0.9 0.0278889
0.8 0.0448889
0.7 0.051
0.6 0.0462222
0.5 0.0305556
0.4 0.004
0.3 -0.0334444
0.2 -0.0817778
0.1 -0.141
2.77556e-17 -0.211111
-0.1 -0.292111
-0.2 -0.384
-0.3 -0.486778
-0.4 -0.600444
-0.5 -0.725
-0.6 -0.860444
-0.7 -0.860444
-0.8 -0.725
-0.9 -0.600444
-0.9 -0.486778
-0.8 -0.384
-0.7 -0.292111
-0.6 -0.211111
-0.5 -0.141
-0.4 -0.0817778
-0.3 -0.0334444
-0.2 0.004
-0.1 0.0305556
-2.77556e-17 0.0462222
0.1 0.051
0.2 0.0448889
0.3 0.0278889
0.4 4.68375e-17
0.5 -0.0387778
0.6 -0.0884444
0.7 -0.149
0.8 -0.220444
0.9 -0.302778
0.9 -0.396
0.8 -0.500111
0.7 -0.615111
0.6 -0.741
0.5 -0.877778
0.4 -0.877778
0.3 -0.741
0.2 -0.615111
0.1 -0.500111
2.77556e-17 -0.396
-0.1 -0.302778
-0.2 -0.220444
-0.3 -0.149
-0.4 -0.0884444
-0.5 -0.0387778
-0.6 1.73472e-18
-0.7 0.0278889
-0.8 0.0448889
-0.9 0.051
-0.9 0.0462222
-0.8 0.0305556
-0.7 0.004
-0.6 -0.0334444
-0.5 -0.0817778
-0.4 -0.141
-0.3 -0.211111
-0.2 -0.292111
-0.1 -0.384
-2.77556e-17 -0.486778
0.1 -0.600444
0.2 -0.725
0.3 -0.860444
0.4 -0.860444
0.5 -0.725
0.6 -0.600444
0.7 -0.486778
0.8 -0.384
0.9 -0.292111
0.9 -0.211111
0.8 -0.141
0.7 -0.0817778
0.6 -0.0334444
0.5 0.004
0.4 0.0305556
0.3 0.0462222
0.2 0.051
0.1 0.0448889
2.77556e-17 0.0278889
-0.1 4.68375e-17
-0.2 -0.0387778
-0.3 -0.0884444
-0.4 -0.149
-0.5 -0.220444
-0.6 -0.302778
-0.7 -0.396
-0.8 -0.500111
-0.9 -0.615111
-0.9 -0.741
-0.8 -0.877778
-0.7 -0.877778
-0.6 -0.741
-0.5 -0.615111
-0.4 -0.500111
-0.3 -0.396
-0.2 -0.302778
-0.1 -0.220444
-2.77556e-17 -0.149
0.1 -0.0884444
0.2 -0.0387778
0.3 1.73472e-18
0.4 0.0278889
0.5 0.0448889
0.6 0.051
0.7 0.0462222
0.8 0.0305556
0.9 0.004
0.9 -0.0334444
0.8 -0.0817778
0.7 -0.141
0.6 -0.211111
0.5 -0.292111
0.4 -0.384
0.3 -0.486778
0.2 -0.600444
0.1 -0.725
2.77556e-17 -0.860444
-0.1 -0.860444
-0.2 -0.725
-0.3 -0.600444
-0.4 -0.486778
-0.5 -0.384
-0.6 -0.292111
-0.7 -0.211111
-0.8 -0.141
-0.9 -0.0817778
-0.9 -0.0334444
-0.8 0.004
-0.7 0.0305556
