<svg width="512" height="512" viewBox="0 0 512 512" fill="none" xmlns="http://www.w3.org/2000/svg">
<g clip-path="url(#clip0)">
<path d="M158.87 0.149988C157.78 0.0499876 156.69 -1.24206e-05 155.61 -1.24206e-05C148.331 -0.0797333 141.231 2.26064 135.427 6.65354C129.622 11.0464 125.441 17.243 123.54 24.27L0.549995 491.63C-0.0796541 494.024 -0.153564 496.531 0.333914 498.958C0.821392 501.385 1.85735 503.669 3.36261 505.634C4.86788 507.6 6.80259 509.195 9.01888 510.299C11.2352 511.402 13.6743 511.984 16.15 512C17.6374 511.995 19.1174 511.79 20.55 511.39L488.15 381.73C503.87 377.38 513.64 362.06 511.77 345.84C490.89 165.08 340.78 17.32 158.87 0.149988ZM38.49 473.21L133 113.91C281.3 127.91 381.38 226.54 397.45 373.66L38.49 473.21ZM428.65 365C409.38 206.37 301.13 99.81 141.26 82.67L154.5 32.36C154.808 32.099 155.207 31.9697 155.61 32H155.86C321.53 47.63 460.86 184.13 479.6 350.89L428.65 365ZM192 176C182.507 176 173.226 178.815 165.333 184.089C157.439 189.364 151.287 196.86 147.654 205.631C144.021 214.402 143.07 224.053 144.922 233.364C146.774 242.675 151.346 251.228 158.059 257.941C164.772 264.654 173.325 269.226 182.636 271.078C191.947 272.93 201.598 271.979 210.369 268.346C219.14 264.713 226.636 258.561 231.911 250.667C237.185 242.774 240 233.493 240 224C239.987 211.274 234.925 199.072 225.927 190.073C216.928 181.075 204.726 176.013 192 176ZM192 240C188.835 240 185.742 239.062 183.111 237.303C180.48 235.545 178.429 233.047 177.218 230.123C176.007 227.199 175.69 223.982 176.307 220.879C176.925 217.775 178.449 214.924 180.686 212.686C182.924 210.449 185.775 208.925 188.879 208.307C191.982 207.69 195.199 208.007 198.123 209.218C201.047 210.429 203.545 212.48 205.304 215.111C207.062 217.742 208 220.835 208 224C208 228.243 206.314 232.313 203.314 235.314C200.313 238.314 196.243 240 192 240ZM144 320C134.507 320 125.226 322.815 117.333 328.089C109.439 333.364 103.287 340.86 99.6538 349.631C96.0208 358.402 95.0702 368.053 96.9223 377.364C98.7744 386.675 103.346 395.228 110.059 401.941C116.772 408.654 125.325 413.226 134.636 415.078C143.947 416.93 153.598 415.979 162.369 412.346C171.14 408.713 178.636 402.561 183.911 394.667C189.185 386.774 192 377.493 192 368C191.987 355.274 186.925 343.072 177.927 334.073C168.928 325.075 156.726 320.013 144 320ZM144 384C140.835 384 137.742 383.062 135.111 381.304C132.48 379.545 130.429 377.047 129.218 374.123C128.007 371.199 127.69 367.982 128.307 364.879C128.925 361.775 130.449 358.924 132.686 356.686C134.924 354.449 137.775 352.925 140.879 352.307C143.982 351.69 147.199 352.007 150.123 353.218C153.047 354.429 155.545 356.48 157.304 359.111C159.062 361.742 160 364.836 160 368C160 372.243 158.314 376.313 155.314 379.314C152.313 382.314 148.243 384 144 384ZM240 320C240 329.493 242.815 338.774 248.089 346.667C253.364 354.561 260.86 360.713 269.631 364.346C278.402 367.979 288.053 368.93 297.364 367.078C306.675 365.226 315.228 360.654 321.941 353.941C328.654 347.228 333.226 338.675 335.078 329.364C336.93 320.053 335.979 310.402 332.346 301.631C328.713 292.86 322.561 285.364 314.667 280.089C306.774 274.815 297.493 272 288 272C275.274 272.013 263.072 277.075 254.073 286.073C245.075 295.072 240.013 307.274 240 320ZM304 320C304 323.164 303.062 326.258 301.304 328.889C299.545 331.52 297.047 333.571 294.123 334.782C291.199 335.993 287.982 336.31 284.879 335.693C281.775 335.075 278.924 333.551 276.686 331.314C274.449 329.076 272.925 326.225 272.307 323.121C271.69 320.018 272.007 316.801 273.218 313.877C274.429 310.953 276.48 308.455 279.111 306.696C281.742 304.938 284.835 304 288 304C292.243 304 296.313 305.686 299.314 308.686C302.314 311.687 304 315.757 304 320Z" fill="black"/>
</g>
<defs>
<clipPath id="clip0">
<rect width="512" height="512" fill="white"/>
</clipPath>
</defs>
</svg>
