{
  "referencedata": {
    "location_types": {
      "host": {
        "types": [
          "School",
          "Public",
          "Temple"
        ],
        "location_templates": {
          "school_class": {
            "name": "string",
            "description": "string",
            "host_type": "School"
          },
          "bmich_hall": {
            "name": "string",
            "description": "string",
            "host_type": "Public"
          }
        }
      }
    },
    "course_types": {
      "TEMPLATE": {
        "id": "TEMPLATE",
        "name": "Template Course"
      },
      "MASTER": {
        "id": "MASTER",
        "name": "Master Course"
      },
      "STANDARD": {
        "id": "STANDARD",
        "name": "Standard Course"
      }
    },
    "course_states": {
      "ACTIVE": {
        "id": "ACTIVE",
        "name": "Active State"
      },
      "INACTIVE": {
        "id": "INACTIVE",
        "name": "Inactive State"
      },
      "DELETED": {
        "id": "DELETED",
        "name": "Deleted State"
      }
    }
  }
}
