{

  "hosts": {
    "host1": {
      "name": "Nalanda College",
      "description": "Nalanda College, Colombo 10",
      "locations": {
        "location1": {
          "name":"7A",
          "description":"Class 7 A",
          "grade":7,
          "shortName":"String: Short name for the location as a quick reference ex:(BMICH,6A,) - Indexed",
          "parentLocation":"String: document Id of the parent location - Indexed",
          "locationType": "String: Location type ex:(Ministry,School,ClassRoom,PublicVenue,) - Indexed",
          "createdAt" :"DateTime:Created Datetime in UTC format - Indexed",
          "updatedAt" :"DateTime:Last updated Datetime in UTC format - Indexed"
        },"location2": {
          "name":"7B",
          "description":"Class 7 B",
          "grade":7,
          "shortName":"String: Short name for the location as a quick reference ex:(BMICH,6A,) - Indexed",
          "parentLocation":"String: document Id of the parent location - Indexed",
          "locationType": "String: Location type ex:(Ministry,School,ClassRoom,PublicVenue,) - Indexed",
          "createdAt" :"DateTime:Created Datetime in UTC format - Indexed",
          "updatedAt" :"DateTime:Last updated Datetime in UTC format - Indexed"
        },
        "location3": {
          "name":"7C",
          "description":"Class 7 C",
          "grade":7,
          "shortName":"String: Short name for the location as a quick reference ex:(BMICH,6A,) - Indexed",
          "parentLocation":"String: document Id of the parent location - Indexed",
          "locationType": "String: Location type ex:(Ministry,School,ClassRoom,PublicVenue,) - Indexed",
          "createdAt" :"DateTime:Created Datetime in UTC format - Indexed",
          "updatedAt" :"DateTime:Last updated Datetime in UTC format - Indexed"
        }
      }
    },
    "host2": {
      "name": "Ananda College",
      "description": "Ananda College, Colombo 10",
      "locations": {
        "location1": {
          "name":"7A",
          "description":"Class 7 A",
          "grade":7,
          "shortName":"String: Short name for the location as a quick reference ex:(BMICH,6A,) - Indexed",
          "parentLocation":"String: document Id of the parent location - Indexed",
          "locationType": "String: Location type ex:(Ministry,School,ClassRoom,PublicVenue,) - Indexed",
          "createdAt" :"DateTime:Created Datetime in UTC format - Indexed",
          "updatedAt" :"DateTime:Last updated Datetime in UTC format - Indexed"
        },
        "location2": {
          "name":"7B",
          "description":"Class 7 B",
          "grade":7,
          "shortName":"String: Short name for the location as a quick reference ex:(BMICH,6A,) - Indexed",
          "parentLocation":"String: document Id of the parent location - Indexed",
          "locationType": "String: Location type ex:(Ministry,School,ClassRoom,PublicVenue,) - Indexed",
          "createdAt" :"DateTime:Created Datetime in UTC format - Indexed",
          "updatedAt" :"DateTime:Last updated Datetime in UTC format - Indexed"
        },
        "location3": {
          "name":"7C",
          "description":"Class 7 C",
          "grade":7,
          "shortName":"String: Short name for the location as a quick reference ex:(BMICH,6A,) - Indexed",
          "parentLocation":"String: document Id of the parent location - Indexed",
          "locationType": "String: Location type ex:(Ministry,School,ClassRoom,PublicVenue,) - Indexed",
          "createdAt" :"DateTime:Created Datetime in UTC format - Indexed",
          "updatedAt" :"DateTime:Last updated Datetime in UTC format - Indexed"
        }
      }
    },
    "host3": {
      "name": "Royal College",
      "description": "",
      "locations": {
        "location1": {
          "name":"7A",
          "description":"Class 7 A",
          "grade":7,
          "shortName":"String: Short name for the location as a quick reference ex:(BMICH,6A,) - Indexed",
          "parentLocation":"String: document Id of the parent location - Indexed",
          "locationType": "String: Location type ex:(Ministry,School,ClassRoom,PublicVenue,) - Indexed",
          "createdAt" :"DateTime:Created Datetime in UTC format - Indexed",
          "updatedAt" :"DateTime:Last updated Datetime in UTC format - Indexed"
        },
        "location2": {
          "name":"7B",
          "description":"Class 7 B",
          "grade":7,
          "shortName":"String: Short name for the location as a quick reference ex:(BMICH,6A,) - Indexed",
          "parentLocation":"String: document Id of the parent location - Indexed",
          "locationType": "String: Location type ex:(Ministry,School,ClassRoom,PublicVenue,) - Indexed",
          "createdAt" :"DateTime:Created Datetime in UTC format - Indexed",
          "updatedAt" :"DateTime:Last updated Datetime in UTC format - Indexed"
        },
        "location3": {
          "name":"7C",
          "description":"Class 7 C",
          "grade":7,
          "shortName":"String: Short name for the location as a quick reference ex:(BMICH,6A,) - Indexed",
          "parentLocation":"String: document Id of the parent location - Indexed",
          "locationType": "String: Location type ex:(Ministry,School,ClassRoom,PublicVenue,) - Indexed",
          "createdAt" :"DateTime:Created Datetime in UTC format - Indexed",
          "updatedAt" :"DateTime:Last updated Datetime in UTC format - Indexed"
        }
      }
    }
  }
}
