{
  "name": "Community Classic",
  "authors": "Community",
  "scripts": [
    {
      "name": "Anti-AFK",
      "description": "Community script to stay online, forever... almost.",
      "game": "classic",
      "type": "bot",
      "main": "antiafk/main.lua"
    },
    {
      "name": "Fishing",
      "description": "Buddy for your fishes.",
      "game": "classic",
      "type": "bot",
      "main": "fishing/main.lua"
    }
  ]
}