<?xml version="1.0" encoding="utf-8"?>
<!-- Generator: Adobe Illustrator 16.0.0, SVG Export Plug-In . SVG Version: 6.00 Build 0)  -->
<!DOCTYPE svg PUBLIC "-//W3C//DTD SVG 1.1//EN" "http://www.w3.org/Graphics/SVG/1.1/DTD/svg11.dtd">
<svg version="1.1" id="Layer_1" xmlns="http://www.w3.org/2000/svg" xmlns:xlink="http://www.w3.org/1999/xlink" x="0px" y="0px"
	 width="242.686px" height="248.174px" viewBox="0 0 242.686 248.174" enable-background="new 0 0 242.686 248.174"
	 xml:space="preserve">
<g>
	<path fill="#ED1C24" d="M5.145,0.164l0.012-0.003c0,0,0-0.002,0.002-0.002l0.014-0.008L5.206,0.13
		c0.003-0.001,0.006-0.003,0.009-0.006l0.014-0.012l0.016-0.016c0.002-0.003,0.007-0.008,0.007-0.012L5.242,0.089L5.24,0.09
		C5.234,0.095,5.23,0.1,5.225,0.104H5.224c0,0,0-0.002-0.001-0.003l-0.01,0.007L5.199,0.116c0.016-0.012,0.029-0.025,0.047-0.039
		l0.015-0.014C5.263,0.06,5.267,0.055,5.267,0.052L5.259,0.059L5.25,0.069c-0.001,0-0.002,0.002-0.004,0.002H5.244
		c0-0.002-0.002-0.002-0.002-0.002H5.238c0.002,0,0.004-0.002,0.006-0.004l0.014-0.013l0.008-0.01
		C5.268,0.039,5.27,0.034,5.271,0.03l0.012-0.02l0.004-0.006c0-0.001,0.001-0.003,0-0.004L5.286,0.002l-0.05,0.062
		c0,0-0.002,0-0.002,0.002H5.23h0.002l0.004-0.004l0.019-0.022c0.004-0.007,0.009-0.013,0.01-0.019H5.264L5.259,0.022
		c-0.021,0.02-0.036,0.041-0.06,0.058L5.146,0.114C5.142,0.116,5.138,0.118,5.132,0.121L5.126,0.124
		C5.124,0.125,5.122,0.126,5.12,0.127L5.098,0.139C5.096,0.14,5.094,0.141,5.091,0.141L5.085,0.144L5.056,0.155L5.042,0.161l0,0l0,0
		c0.001,0,0.003,0,0.004,0l0.01-0.004l0.082-0.035c0.002,0,0.004-0.001,0.005-0.001L5.142,0.122
		C5.115,0.138,5.085,0.151,5.058,0.163L5.041,0.169c-0.001,0-0.001,0-0.001,0.001H5.039H5.038H5.037H5.035l0,0H5.033l-0.01,0.002
		C4.96,0.192,4.898,0.213,4.837,0.237L4.811,0.249C4.804,0.252,4.794,0.256,4.789,0.262v0.001l0.004-0.001
		c0.025-0.01,0.051-0.021,0.076-0.028L4.832,0.248C4.83,0.249,4.826,0.25,4.824,0.251L4.816,0.254
		C4.813,0.255,4.808,0.257,4.804,0.259L4.787,0.266C4.783,0.267,4.781,0.269,4.779,0.271v0.002l0.012-0.002
		c0.005-0.002,0.011-0.006,0.016-0.008L4.802,0.266L4.798,0.269c0,0,0.004,0,0.005-0.002l0.008-0.002l0.129-0.043l0.004-0.001
		c0.014-0.003,0.025-0.006,0.039-0.009l0,0L4.908,0.237c-0.004,0-0.008,0.002-0.012,0.002L4.884,0.243L4.82,0.264L4.818,0.265
		L4.82,0.264c0.031-0.01,0.063-0.02,0.094-0.03l0.015-0.004c0.004,0,0.009-0.002,0.013-0.004l0.014-0.004
		c0.021-0.005,0.042-0.01,0.063-0.016l0.057-0.018l0.012-0.005l0.07-0.026C5.15,0.162,5.146,0.163,5.145,0.164L5.145,0.164z
		 M5.161,0.14L5.123,0.162C5.12,0.163,5.117,0.164,5.115,0.164L5.104,0.168C5.102,0.169,5.098,0.17,5.095,0.171l0.007-0.003
		L5.161,0.14L5.161,0.14z M5.054,0.182l0.011-0.004l0.021-0.009c0,0-0.001,0-0.001,0.001l0.013-0.004L5.057,0.182l0,0H5.054
		L5.054,0.182z M5.084,0.169l0.021-0.01h0.002c-0.004,0.004-0.01,0.006-0.015,0.008L5.064,0.179L5.058,0.181H5.055l0,0L5.029,0.19
		C5.023,0.192,5.017,0.194,5.011,0.196H5.004L4.998,0.198C4.98,0.204,4.964,0.21,4.947,0.214l0.017-0.006c0,0,0,0,0.002,0
		l0.188-0.076L5.122,0.149C5.109,0.157,5.098,0.162,5.084,0.169L5.084,0.169z"/>
	<polygon fill="#ED1C24" points="5.277,0.028 5.275,0.03 5.288,0.009 5.289,0.007 5.292,0.002 5.293,0 5.293,0 5.293,0.001 
		5.29,0.011 5.283,0.022 5.277,0.03 	"/>
	<polygon fill="#ED1C24" points="5.262,0.053 5.265,0.048 5.267,0.046 5.266,0.049 5.264,0.053 5.262,0.053 5.262,0.053 	"/>
	<polygon fill="#ED1C24" points="5.078,0.159 5.109,0.146 5.156,0.122 5.205,0.09 5.205,0.091 5.197,0.097 5.189,0.103 5.179,0.11 
		5.166,0.118 5.154,0.125 5.145,0.132 5.13,0.138 5.123,0.142 5.117,0.146 5.109,0.149 5.104,0.151 5.097,0.155 5.09,0.157 
		5.083,0.159 5.078,0.162 5.074,0.163 5.072,0.163 5.074,0.161 	"/>
	<path fill="#ED1C24" d="M4.924,0.211L4.867,0.229L4.859,0.233c-0.002,0-0.004,0-0.004,0.002l0.004-0.002h0.004
		c0.012-0.004,0.021-0.008,0.033-0.011l0.051-0.016l0.037-0.013h-0.01L4.924,0.211L4.924,0.211z"/>
	<path fill="#ED1C24" d="M146.473,155.612l-3.754,4.259c-0.174,0.352-0.34,0.704-0.498,1.063l-1.436,7.164l-0.689,2.931
		c-1.15,3.229-2.407,5.463-4.121,8.424l-4.152,9.367l-1.613,6.603c-0.106,0.353-0.219,0.705-0.33,1.06l2.599,14.468
		c1.36-1.414,1.454-1.671,2.601-3.671l0.354-0.911c0.893-3.092,1.212-5.994,1.861-9.009l0.33-0.545
		c0.854-0.084,1.371,0.616,2.211,0.553l1.617-4.606l1.348-2.547c4.576-11.854,14.207-24.197,15.125-37.541l1.439-3.708
		c0.219-0.281,0.432-0.549,0.65-0.816l0.615-0.664l2.01-3.953c0.473-1.036,1.098-2.713,1.82-3.404l-0.25,2.775l-0.236,1.096
		c-0.098,0.392-0.195,0.783-0.299,1.176l-0.354,1.248c-0.137,0.434-0.271,0.868-0.408,1.304l-0.459,1.351
		c-0.164,0.463-0.334,0.926-0.502,1.389l-0.541,1.41c-0.193,0.474-0.388,0.947-0.58,1.423l-8.396,16.792
		c-0.75,1.174-1.472,2.266-2.253,3.393l-1.411,1.807l-1.479,2.627c-3.813,11.342-3.111,21.359-9.32,32.76l-1.164,3.719
		c-0.834,2.675-0.029,4.912,0.809,6.238l0.855,1.359c0.464,0.434,0.576,0.375,1.244-0.104l0.666-3.51l1.199-5.926
		c0.793-0.771,1.229-0.771,1.938-0.882l3.041-0.938l1.375-0.479c-0.34,0.946-1.17,1.991-1.67,2.905l-1.963,5.938l2.25,5.479
		c1.439,0.949,2.822,1.141,3.554,3.263l-0.457,3.916l3.485,0.964c0.117-0.16,0.222-0.316,0.322-0.498l-0.041-9.761
		c0.016-3.817,0.217-7.716,0.992-12.015l0.402-1.035l1.557-0.551c0.207-0.104,0.48-0.336,0.668-0.361l-0.105,0.398
		c-0.196,0.6-0.354,1.16-0.516,1.754l4.545,11.17c0.6-0.229,1.203-0.494,1.815-0.797l1.425-1.578
		c1.471-3.672,1.323-6.656,1.641-9.92l2.437-11.396l1.474-3.022c3.842-9.479,5.987-18.146,10.914-27.521
		c2.813-5.127,0.838-6.24,2.555-10.826l0.555-1.653c0.893-2.803,1.697-5.593,2.592-8.396l0.579-1.726
		c0.207-0.581,0.418-1.165,0.632-1.746l6.164-20.625c0.043-0.298,0.066-0.563,0.057-0.823l-0.863,0.644
		c-2.291,3.957-3.268,11.407-4.771,15.642l-11.684,32.793c-0.213,0.24-0.424,0.475-0.641,0.693l-0.16-0.057
		c0.156-1.344,0.83-3.077,1.332-4.51l3.678-9.955l11.705-32.922c0.138-0.486,0.27-0.972,0.386-1.455l0.293-1.205
		c0.071-0.166,0.146-0.332,0.226-0.496l0.271-0.44c0.454-0.604,0.896-1.024,1.384-1.481l2.368-4.164
		c10.478-23.141,19.211-46.457,31.021-69.151l7.832-13.957c-0.205-1.2-0.33-1.286-0.965-1.957l-0.99,0.595
		c-5.99,5.635-11.352,13.328-16.582,21.053l1.603-2.832c3.155-5.262,6.546-10.195,9.75-15.396l1.466-2.511l2.557-3.35
		c0.791-0.832,1.396-1.283,1.922-2.529l-0.555-3.121l-1.299-0.178c-0.92-0.127-2.4,2.221-3.436,3.521l-2.059,2.523
		c0.217-0.752,0.438-1.141,0.809-1.938l0.514-1.817c-0.746-0.636-2.568,1.026-3.671,1.984l-4.056,4.046
		c-1.391,1.62-2.771,3.261-4.148,4.927l-4.166,5.655c-7.148,10.696-12.986,21.438-18.83,33.265l-0.957,1.769
		c-1.99,3.414-4.039,6.765-6.095,10.112l-3.737,5.99l12.023-27.271c1.404-2.66,2.773-5.141,4.27-7.732l4.855-7.264l16.197-22.857
		c0.228-0.41,0.432-0.805,0.615-1.232l-1.07,0.785c-8.485,9.416-17.596,22.832-24.182,35.34l-2.785,5.865
		c-0.939,1.854-1.885,3.703-2.836,5.548l-17.906,31.579l-1.902,3.615c-0.605,1.188-1.215,2.377-1.816,3.565l-1.742,3.524
		c-0.562,1.164-1.119,2.328-1.676,3.494l-1.611,3.471c-0.521,1.15-1.043,2.305-1.561,3.457l-1.516,3.453
		c-0.491,1.151-0.98,2.304-1.473,3.455l-1.373,3.168c-0.455,0.98-0.912,1.961-1.375,2.938l-1.361,2.703
		c-0.438,0.825-0.885,1.649-1.332,2.47l-1.291,2.237c-0.408,0.67-0.82,1.338-1.232,2.004l-1.164,1.772
		c-0.359,0.52-0.719,1.037-1.08,1.552l-3.701,5.505c-0.438,0.62-0.928,1.229-1.35,1.876L146.473,155.612L146.473,155.612z
		 M176.088,124.212l-6.344,16.034c-0.472,1.135-0.941,2.272-1.414,3.407l-1.238,2.881l-0.385,0.681
		c0.293-2.231,1.465-5.385,2.225-7.756l4.52-13.069c0.391-0.833,0.657-1.152,1.203-1.322l1.163-0.445
		C175.912,124.489,176.002,124.354,176.088,124.212L176.088,124.212z M192.822,87.868l-6.816,15.128
		c-2.416,5.299-5.49,13.167-8.776,17.714l1.271-5.206l0.621-1.591c1.418-2.911,3.25-5.291,4.625-8.236l0.615-1.658l0.957-2.549
		c2.997-7.001,6.516-14.568,10.27-21.211l-2.66,7.21C192.891,87.604,192.854,87.737,192.822,87.868L192.822,87.868z
		 M192.813,109.836l-0.259,0.173c-0.93,1.648-1.653,3.457-2.37,5.199l-1.862,4.729l-3.127,7.26
		c-0.757-1.189,0.275-5.291,1.053-7.527l2.113-6.1c0.893-2.004,1.325-2.512,2.538-3.934l0.282-0.134
		c0.408-0.067,0.746-0.004,1.087,0.112L192.813,109.836L192.813,109.836z M144.735,228.873l0.262-0.438l1.047,3.271
		c0.115,1.252,0.185,2.381,0.527,3.4l0.45,0.674l0.789,0.938c0.088,0.154,0.224,0.354,0.125,0.68l-0.151,0.172l-0.416,0.145
		c-1.16,0.043-2.383-0.365-2.881-1.594l-0.871-2.928c-0.236-0.975-0.547-2.055,0.057-3.551L144.735,228.873L144.735,228.873z
		 M142.309,220.92l0.791,2.594c-0.143,0.111-0.299,0.264-0.395,0.205l-0.926-0.561c-0.357-0.379-0.541-0.711-0.572-1.473
		l1.067-0.764c0.009-0.002,0.017-0.002,0.022-0.004C142.303,220.92,142.305,220.92,142.309,220.92L142.309,220.92L142.309,220.92z
		 M181.555,138.2l-0.6,1.412c-1.808,4.094-3.767,8.123-5.629,12.193l-1.677,3.836l-1.272,3.079
		c-0.383,0.951-0.764,1.904-1.144,2.854l-4.03,10.539c-0.369,0.938-0.742,1.871-1.123,2.808l-9.275,22.379
		c0.039-0.146,0.07-0.211,0.123-0.356l12.908-36.25l1.996-5.383l0.93-2.424c0.316-0.803,0.636-1.607,0.955-2.41l0.972-2.379
		c0.323-0.777,0.649-1.554,0.978-2.328l0.973-2.257c0.318-0.72,0.64-1.44,0.957-2.159l0.933-2.043
		c0.298-0.634,0.597-1.27,0.894-1.902C180.442,133.374,182.188,135.707,181.555,138.2L181.555,138.2z M199.711,95.858l1.324-3.449
		c0.444-1.072,0.893-2.144,1.346-3.213l1.349-2.976c0.44-0.915,0.884-1.828,1.327-2.739l1.279-2.508
		c1.101-2.078,2.223-4.133,3.348-6.189l1.13-2.045c0.472-0.838,0.944-1.676,1.418-2.512l7.774-13.209
		c0.324-0.558,0.648-1.117,0.974-1.675l1.22-5.127c-0.136,0.036-0.271,0.092-0.41,0.167l-0.978,1.332l-0.858,1.454
		c-2.242,3.649-4.576,7.194-6.873,10.774l-0.918,1.502c-3.484,5.961-6.791,12.147-9.816,18.425l-0.854,1.903
		c-1.855,4.379-3.554,8.781-5.17,13.19L199.711,95.858L199.711,95.858z"/>
	<path fill="#ED1C24" d="M160.111,85.758l0.305-0.028C160.313,85.737,160.213,85.749,160.111,85.758L160.111,85.758z
		 M160.416,85.729l0.062-0.006C160.457,85.724,160.436,85.728,160.416,85.729L160.416,85.729z M163.238,85.461l1.273-0.122
		c0.354-0.098,0.703-0.204,1.054-0.316l7.218-4.248l2.746-1.599c4.432-2.157,8.982-3.354,13.479-5.181l4.142-2.121l5.873-3.557
		c0.315-0.176,0.636-0.351,0.95-0.522l7.992-6.033c1.506-1.403,3.775-3.276,4.271-5.649l-3.918,0.498l-0.875,0.42
		c-2.856,1.606-5.604,3.557-8.411,5.313l-0.561,0.181c-0.309-0.563,0.25-1.313-0.018-1.84l-4.556,2.336l-10.823,4.829
		c9.354-5.389,18.213-12.229,28.094-15.827l7.633-5.189c1.209-1.106,3.572-3.023,4.041-4.881l-3.983,2.244l-4.976,3.297
		c-0.655,0.352-1.131,0.57-1.803,0.455l-0.492-1.02c-0.274-0.686-0.543-0.838-1.067-1.169l-0.698-0.481
		c0.598-0.627,1.836-0.774,2.563-1.027l7.429-3.737l6.095-5.7c1.355-1.771,2.475-3.721,3.891-5.438l6.705-4.913l2.207-2.182
		c0.396-0.586,0.967-1.477,0.812-2.258c-0.278-0.131-0.271-0.08-0.591,0.02l-29.061,20.092c-0.438,0.229-0.871,0.452-1.316,0.643
		c-0.422-0.547-0.715-0.607-1.278-0.771l0.522-0.328c0.772-0.408,1.543-0.835,2.31-1.268l10.965-7.969
		c2.429-2.101,5.321-4.483,6.755-7.844l-0.402-1.016l-2.002,0.363c-11.351,5.73-21.787,14.479-33.242,19.918l-29.25,13.756
		c-1.355,0.486-2.719,0.959-4.08,1.418l-2.857,0.949c-6.576,2.502-12.959,5.85-19.507,8.5l-19.002,6.672
		c-0.273,0.146-0.546,0.297-0.809,0.477l1.705,0.005c15.084-4.343,30.154-13.384,45.26-16.251l-1.299,0.906
		c-15.603,7.6-31.611,12.918-47.382,19.645l-0.648,0.321c-0.284,0.116-0.563,0.222-0.853,0.317l-0.504,0.121
		c-0.155,0.021-0.313,0.045-0.467,0.063l-1.491-0.04l-4.535,0.967c-26.85,7.698-53.645,15.997-80.456,24.01l-11.649,2.988
		c-3.171,0.871-6.914,1.584-9.712,3.926l0.166,1.035l1.665-0.094c10.73-1.643,21.432-3.98,32.137-6.055l-20.863,5.126
		c-1.148,0.315-2.301,0.638-3.451,0.959l-3.449,1.054l-6.964,1.578c-1.354,0.273-2.521,0.473-3.532,1.794L0,117.103l4.896-0.019
		c2.107-0.413,4.317-1.216,6.426-1.374l-2.154,0.898l-1.752,0.939c0.248,0.52,1.38,0.375,1.832,0.371l3-0.176l6.25-0.719
		c2.228-0.326,4.453-0.662,6.677-1.006l6.999-1.25c12.084-2.392,24.099-5.248,36.117-8.343l1.855-0.413
		c5.512-1.063,11.037-1.99,16.562-2.855l0.524-0.066l-35.52,9.826c-2.678,0.494-5.338,0.939-8.02,1.34l-27.103,5.092
		c-0.44,0.141-0.882,0.29-1.316,0.467l1.38,0.006c13.426-1.795,27.058-4.207,40.387-7.467l5.902-1.633
		c1.885-0.467,3.77-0.93,5.653-1.382l32.793-6.522l30.369-8.608l31.658-8.759C163.357,85.452,163.297,85.458,163.238,85.461
		L163.238,85.461z M175.723,71.13l-24.405,10.889c-1.265,0.252-2.528,0.485-3.8,0.682l-4.786,1.523
		c-1.254,0.434-2.771,1.172-4.052,1.176l2.964-1.748l31.215-11.896C173.813,71.536,174.766,71.327,175.723,71.13L175.723,71.13z
		 M119.971,88.104l24.666-8.826l0.814-0.229c-7.158,4.095-15.295,6.738-22.775,9.444c-0.449,0.132-1.031,0.379-1.464,0.113
		l-0.499-0.514C120.436,88.012,120.262,88.048,119.971,88.104L119.971,88.104z M81.581,98.866l15.812-4.438
		c6.17-1.724,12.66-4.14,18.899-4.893l-5.34,2.365l-1.668,0.559c-2.679,0.712-5.379,1.013-8.064,1.652l-2.507,0.807l-2.624,0.882
		c-1.191,0.354-2.387,0.705-3.581,1.052l-18.693,4.682l7.371-2.502C81.316,98.979,81.449,98.923,81.581,98.866L81.581,98.866z
		 M102.564,85.728l0.222,0.067c3.515-0.739,7.059-2.024,10.515-3.241l7.729-2.438c-1.563,1.945-5.534,3.148-7.572,4l-10.693,3.019
		l-0.188-0.108c-0.155-0.248-0.179-0.48-0.112-0.799l0.067-0.324C102.539,85.858,102.569,85.772,102.564,85.728L102.564,85.728z"/>
	<path fill="#ED1C24" d="M231.32,31.71l-0.054,0.016c-0.063,0.016-0.125,0.036-0.188,0.055l-0.107,0.031
		c-0.023,0.004-0.053,0.016-0.079,0.022l8.397-7.224c0.33-0.336,0.658-0.681,0.979-1.027l1.62-1.771
		c0.218-0.211,0.462-0.459,0.729-0.539l0.067,0.028l-0.039,0.319c-0.702,1.658-1.92,3.152-3.095,4.265l-4.323,3.858
		c-1.104,0.934-2.343,2.093-3.646,2.349L231.32,31.71L231.32,31.71z"/>
	<path fill="#ED1C24" d="M221.754,40.551l2.035-2.06c0.432-0.404,0.67-0.631,1.141-0.779c-0.146,0.75-0.702,1.5-1.189,1.952
		l-1.273,1.179c-0.487,0.268-0.473,0.132-0.709-0.268c0-0.002,0-0.004,0-0.006v-0.002v-0.002c0,0,0-0.005,0-0.006l-0.002-0.001
		L221.754,40.551L221.754,40.551z"/>
	<path fill="#ED1C24" d="M132.59,75.491l14.957-5.068l3.535-1.325c1.096-0.433,2.192-0.873,3.289-1.313l15.531-6.877l24.411-11.133
		c-0.168,0.092-0.241,0.127-0.414,0.213l-36.987,18.05l-3.271,1.458c-7.053,3.004-14.146,5.662-21.332,7.921l-1.863,0.493
		c-0.432,0.084-0.613,0.125-0.966-0.053c0.265-0.588,0.843-0.91,1.302-1.228L132.59,75.491L132.59,75.491z"/>
	<path fill="#ED1C24" d="M64.27,95.802l-23.854,5.348l-3.829,1.328c-0.459,0.209-1.622,0.633-1.796,1.28l2.271-0.217l15.51-3.208
		l22.707-5.314l16.007-5.072l-3.782-0.388L64.27,95.802L64.27,95.802z"/>
	<path fill="#008C49" d="M70.9,242.59l1.022,2.645c0.173,0.535,0.276,0.869,0.144,1.373l-1.437-1.777
		c-0.388-0.48-0.522-1.084-0.515-1.619l0.756-0.623C70.881,242.588,70.891,242.588,70.9,242.59L70.9,242.59L70.9,242.59z
		 M52.443,168.853l-0.457,1.021c-0.069,0.329-0.131,0.661-0.184,0.993l1.051,7.347l0.328,2.799c-0.004,5.806-2.072,11.396-2,17.216
		l0.346,6.081c-0.006,0.324-0.013,0.65-0.021,0.975l1.542,8.697c0.539,1.658,0.993,4.213,3.408,5.479l2.121-3.521l0.121-0.889
		c0.123-2.963-0.26-5.939-0.43-8.914l0.355-0.586c0.488,0.121,1.404,0.643,1.889,0.598l0.254-4.652l1.689-42.417
		c0.305-1.182,0.636-2.358,1.003-3.532l0.415-4.608c0.061-1.234-0.152-2.701,0.42-3.879l0.742,3.032l-1.814,30.562
		c-0.33,1.045-0.677,2.088-1.039,3.127l-0.498,2.695c0.06,11.209,3.198,22.371,0.064,33.418l0.38,8.324
		c0.349,1.396,0.628,4.049,2.438,5.184l3.146-1.715l0.218-1.994c0.33,0.354,0.699,0.895,1.066,1.889
		c0.576,1.564,1.025,3.047,1.438,4.297l-0.324,2.748c0.914,1.821,2.189,3.549,2.959,5.396c2.476,8.615,3.416,2.877,3.283-8.484
		c0.516-2.688,1-4.973,1.797-4.701l0.361,5.168c0.495,2.865,0.779,6.217,3.436,8.869l1.414,0.032l1.145-1.905
		c2.372-12.063,0.024-24.425,1.304-36.559l0.604-4.139c0.729-8.737-0.322-17.681,0.267-26.427l-1.17-3.934l-0.394-2.543
		c0.43-6.619-0.442-16.026-0.641-22.668l-0.118-18.992c-0.07-0.283-0.762-0.869-0.875-1.15l-0.035,1.893
		c-0.643,14.815,6.138,33.289,1.42,47.729l-0.357-1.414c-0.607-15.93,0.358-31.902-1.835-47.865l-0.146-0.662
		c-0.024-0.195-0.047-0.391-0.064-0.585l0.005-0.52c0.021-0.156,0.041-0.312,0.065-0.466l0.113-0.428
		c0.144-0.396,0.321-0.783,0.515-1.171l0.403-4.407c-0.529-26.961-5.408-53.977-13.562-80.908l-3.392-12.059
		c-1.082-3.354-1.948-7.143-4.986-10.256l-1.255,0.111l0.175,1.726c2.256,10.968,4.813,21.927,6.43,32.902L62.33,30.69
		c-0.355-1.189-0.719-2.381-1.084-3.569l-1.91-5.388l-2.131-7.267c-0.379-1.368-0.668-2.623-2.367-3.769l-1.354-0.42l0.267,5.071
		c0.589,2.2,1.61,4.478,1.851,6.677l-1.138-2.258l-1.19-1.854c-0.662,0.237-0.416,1.436-0.402,1.854l0.266,3.071l3.788,25.095
		L56.609,46.5l-1.685-4.151c-0.233-0.436-0.703-1.589-1.459-1.898l-2.271-13.313c-0.172-0.456-0.352-0.909-0.565-1.362l-0.011,1.394
		c1.998,13.419,3.791,26.839,5.772,40.257l0.997,5.805c1.469,12.375,0.771,24.563,0.155,36.857l-0.7,28.952l-4.417,29.854
		C52.43,168.877,52.438,168.862,52.443,168.853L52.443,168.853z M61.734,81.797c0.095,4.916-0.063,9.821-0.42,14.715l-0.058,0.498
		l-4.771-34.756c-0.254-2.632-0.47-5.256-0.648-7.886l-1.246-7.295l2.84,12.485L61.734,81.797L61.734,81.797z M67.003,96.881
		l-0.119-0.631c-0.231-3.867-0.425-7.735-0.539-11.595l1.323,7.287c0.031,0.133,0.064,0.266,0.104,0.396l0.61,33.646
		c-0.618-1.797-0.692-3.476-0.926-5.311l-0.095-1.626c0.055-2.579,0.576-5.12,0.65-7.698l-0.193-2.447l-0.271-2.571
		c-0.209-3.069-0.424-6.14-0.611-9.212L67.003,96.881L67.003,96.881z M68.723,129.61l0.096,24.127l-0.108,0.781
		c-1.517-7.412-1.179-15.115-1.479-22.525l0.428-1.35c0.203-0.146,0.563-0.218,0.798-0.355L68.723,129.61L68.723,129.61z
		 M77.621,114.004l-0.153,0.194c-0.245,3.41,0.083,6.898,0.306,10.332l0.032,7.586c-1.841-1.951-1.651-5.609-1.948-7.73
		l0.016-10.438l0.313-0.198c0.328-0.042,0.564-0.023,0.869,0.073l0.367,0.117C77.472,113.958,77.566,114.001,77.621,114.004
		L77.621,114.004z"/>
</g>
</svg>
