{
    "extends": [
        "tslint:recommended",
        "tslint-eslint-rules",
        "tslint-config-airbnb",
        "tslint-config-prettier",
        "tslint-plugin-prettier",
        "tslint-no-circular-imports",
        "tslint-no-unused-expression-chai"
    ],
    "linterOptions": {
        "exclude": [
            "build",
            "config",
            "public",
            "node_modules",
            "scripts"
        ]
    },
    "rules": {
        "array-type": [true, "array"],
        "import-name": false,
        "variable-name": [true, "ban-keywords", "check-format", "allow-pascal-case"],
        "no-duplicate-variable": true,
        "no-else-after-return": false,
        "no-param-reassign": [2, { "props": false }],
        "no-else-return": ["error", { "allowElseIf": true }],
        "no-unused-variable": [true, {"ignore-pattern": "^_"}],
        "jsx-no-multiline-js": false,
        "import/extensions": [
            "error",
            "always",
            {
                "js": "never",
                "ts": "never"
            }
        ],
        "indent": [true, "spaces", 4],
        "ter-indent": [
            true,
            4,
            {
                "MemberExpression": 1,
                "SwitchCase": 1
            }
        ],
        "object-literal-sort-keys": false,
        "no-debugger": true,
        "no-console": true,
        "max-file-line-count": [true, 500],
        "max-line-length": [
            true,
            {
                "limit": 120,
                "ignore-pattern": "^import |^export {(.*?)}"
            }
        ],
        "no-trailing-whitespace": true,
        "quotes": [
            "error",
            "single"
        ],
        "semi": [
            "error",
            "always"
        ],
        "no-multiple-empty-lines": [
            "error",
            {
                "max": 1,
                "maxBOF": 1
            }
        ],
        "prettier": [
            false,
            {
                "singleQuote": true,
                "trailingComma": "all",
                "tabWidth": 4,
                "useTabs": false,
                "bracketSpacing": true,
                "semi": true
            }
        ]
    },
    "rulesDirectory": [
        "node_modules/tslint-eslint-rules/dist/rules"
    ]
}
