# Blender MTL File: 'None'
# Material Count: 5

newmtl Wires
Ns 225.000000
Ka 1.000000 1.000000 1.000000
Kd 0.004979 0.800000 0.000000
Ks 0.500000 0.500000 0.500000
Ke 0.000000 0.000000 0.000000
Ni 1.450000
d 1.000000
illum 2

newmtl car
Ns 0.000000
Ka 1.000000 1.000000 1.000000
Kd 0.000000 0.000300 0.026895
Ks 0.100000 0.100000 0.100000
Ke 0.000000 0.000000 0.000000
Ni 1.450000
d 1.000000
illum 2

newmtl front_light
Ns 323.999994
Ka 1.000000 1.000000 1.000000
Kd 0.800000 0.800000 0.800000
Ks 0.500000 0.500000 0.500000
Ke 0.000000 0.000000 0.000000
Ni 1.000000
d 1.000000
illum 2

newmtl tires
Ns 52.562503
Ka 1.000000 1.000000 1.000000
Kd 0.021846 0.019711 0.021979
Ks 0.030000 0.030000 0.030000
Ke 0.000000 0.000000 0.000000
Ni 1.450000
d 1.000000
illum 2

newmtl window
Ns 323.999994
Ka 1.000000 1.000000 1.000000
Kd 0.800000 0.800000 0.800000
Ks 0.500000 0.500000 0.500000
Ke 0.000000 0.000000 0.000000
Ni 1.000000
d 1.000000
illum 2
