%YAML 1.1
%TAG !u! tag:unity3d.com,2011:
--- !u!1 &634637873285016353
GameObject:
  m_ObjectHideFlags: 0
  m_CorrespondingSourceObject: {fileID: 0}
  m_PrefabInstance: {fileID: 0}
  m_PrefabAsset: {fileID: 0}
  serializedVersion: 6
  m_Component:
  - component: {fileID: 8095997470063865974}
  - component: {fileID: 311716366768452458}
  - component: {fileID: 7602741308454063158}
  m_Layer: 0
  m_Name: Layer1
  m_TagString: Untagged
  m_Icon: {fileID: 0}
  m_NavMeshLayer: 0
  m_StaticEditorFlags: 0
  m_IsActive: 1
--- !u!4 &8095997470063865974
Transform:
  m_ObjectHideFlags: 0
  m_CorrespondingSourceObject: {fileID: 0}
  m_PrefabInstance: {fileID: 0}
  m_PrefabAsset: {fileID: 0}
  m_GameObject: {fileID: 634637873285016353}
  m_LocalRotation: {x: -0, y: -0, z: -0, w: 1}
  m_LocalPosition: {x: 0, y: 0, z: 0}
  m_LocalScale: {x: 1, y: 1, z: 1}
  m_Children: []
  m_Father: {fileID: 8462023511870639260}
  m_RootOrder: 0
  m_LocalEulerAnglesHint: {x: 0, y: 0, z: 0}
--- !u!1839735485 &311716366768452458
Tilemap:
  m_ObjectHideFlags: 0
  m_CorrespondingSourceObject: {fileID: 0}
  m_PrefabInstance: {fileID: 0}
  m_PrefabAsset: {fileID: 0}
  m_GameObject: {fileID: 634637873285016353}
  m_Enabled: 1
  m_Tiles:
  - first: {x: -1, y: -4, z: 0}
    second:
      serializedVersion: 2
      m_TileIndex: 25
      m_TileSpriteIndex: 25
      m_TileMatrixIndex: 0
      m_TileColorIndex: 0
      m_TileObjectToInstantiateIndex: 65535
      dummyAlignment: 0
      m_AllTileFlags: 1073741825
  - first: {x: 0, y: -4, z: 0}
    second:
      serializedVersion: 2
      m_TileIndex: 26
      m_TileSpriteIndex: 26
      m_TileMatrixIndex: 0
      m_TileColorIndex: 0
      m_TileObjectToInstantiateIndex: 65535
      dummyAlignment: 0
      m_AllTileFlags: 1073741825
  - first: {x: 1, y: -4, z: 0}
    second:
      serializedVersion: 2
      m_TileIndex: 27
      m_TileSpriteIndex: 27
      m_TileMatrixIndex: 0
      m_TileColorIndex: 0
      m_TileObjectToInstantiateIndex: 65535
      dummyAlignment: 0
      m_AllTileFlags: 1073741825
  - first: {x: 3, y: -4, z: 0}
    second:
      serializedVersion: 2
      m_TileIndex: 34
      m_TileSpriteIndex: 34
      m_TileMatrixIndex: 0
      m_TileColorIndex: 0
      m_TileObjectToInstantiateIndex: 65535
      dummyAlignment: 0
      m_AllTileFlags: 1073741825
  - first: {x: 4, y: -4, z: 0}
    second:
      serializedVersion: 2
      m_TileIndex: 35
      m_TileSpriteIndex: 35
      m_TileMatrixIndex: 0
      m_TileColorIndex: 0
      m_TileObjectToInstantiateIndex: 65535
      dummyAlignment: 0
      m_AllTileFlags: 1073741825
  - first: {x: 5, y: -4, z: 0}
    second:
      serializedVersion: 2
      m_TileIndex: 36
      m_TileSpriteIndex: 36
      m_TileMatrixIndex: 0
      m_TileColorIndex: 0
      m_TileObjectToInstantiateIndex: 65535
      dummyAlignment: 0
      m_AllTileFlags: 1073741825
  - first: {x: -1, y: -3, z: 0}
    second:
      serializedVersion: 2
      m_TileIndex: 22
      m_TileSpriteIndex: 22
      m_TileMatrixIndex: 0
      m_TileColorIndex: 0
      m_TileObjectToInstantiateIndex: 65535
      dummyAlignment: 0
      m_AllTileFlags: 1073741825
  - first: {x: 0, y: -3, z: 0}
    second:
      serializedVersion: 2
      m_TileIndex: 23
      m_TileSpriteIndex: 23
      m_TileMatrixIndex: 0
      m_TileColorIndex: 0
      m_TileObjectToInstantiateIndex: 65535
      dummyAlignment: 0
      m_AllTileFlags: 1073741825
  - first: {x: 1, y: -3, z: 0}
    second:
      serializedVersion: 2
      m_TileIndex: 24
      m_TileSpriteIndex: 24
      m_TileMatrixIndex: 0
      m_TileColorIndex: 0
      m_TileObjectToInstantiateIndex: 65535
      dummyAlignment: 0
      m_AllTileFlags: 1073741825
  - first: {x: 3, y: -3, z: 0}
    second:
      serializedVersion: 2
      m_TileIndex: 31
      m_TileSpriteIndex: 31
      m_TileMatrixIndex: 0
      m_TileColorIndex: 0
      m_TileObjectToInstantiateIndex: 65535
      dummyAlignment: 0
      m_AllTileFlags: 1073741825
  - first: {x: 4, y: -3, z: 0}
    second:
      serializedVersion: 2
      m_TileIndex: 32
      m_TileSpriteIndex: 32
      m_TileMatrixIndex: 0
      m_TileColorIndex: 0
      m_TileObjectToInstantiateIndex: 65535
      dummyAlignment: 0
      m_AllTileFlags: 1073741825
  - first: {x: 5, y: -3, z: 0}
    second:
      serializedVersion: 2
      m_TileIndex: 33
      m_TileSpriteIndex: 33
      m_TileMatrixIndex: 0
      m_TileColorIndex: 0
      m_TileObjectToInstantiateIndex: 65535
      dummyAlignment: 0
      m_AllTileFlags: 1073741825
  - first: {x: -1, y: -2, z: 0}
    second:
      serializedVersion: 2
      m_TileIndex: 19
      m_TileSpriteIndex: 19
      m_TileMatrixIndex: 0
      m_TileColorIndex: 0
      m_TileObjectToInstantiateIndex: 65535
      dummyAlignment: 0
      m_AllTileFlags: 1073741825
  - first: {x: 0, y: -2, z: 0}
    second:
      serializedVersion: 2
      m_TileIndex: 20
      m_TileSpriteIndex: 20
      m_TileMatrixIndex: 0
      m_TileColorIndex: 0
      m_TileObjectToInstantiateIndex: 65535
      dummyAlignment: 0
      m_AllTileFlags: 1073741825
  - first: {x: 1, y: -2, z: 0}
    second:
      serializedVersion: 2
      m_TileIndex: 21
      m_TileSpriteIndex: 21
      m_TileMatrixIndex: 0
      m_TileColorIndex: 0
      m_TileObjectToInstantiateIndex: 65535
      dummyAlignment: 0
      m_AllTileFlags: 1073741825
  - first: {x: 3, y: -2, z: 0}
    second:
      serializedVersion: 2
      m_TileIndex: 28
      m_TileSpriteIndex: 28
      m_TileMatrixIndex: 0
      m_TileColorIndex: 0
      m_TileObjectToInstantiateIndex: 65535
      dummyAlignment: 0
      m_AllTileFlags: 1073741825
  - first: {x: 4, y: -2, z: 0}
    second:
      serializedVersion: 2
      m_TileIndex: 29
      m_TileSpriteIndex: 29
      m_TileMatrixIndex: 0
      m_TileColorIndex: 0
      m_TileObjectToInstantiateIndex: 65535
      dummyAlignment: 0
      m_AllTileFlags: 1073741825
  - first: {x: 5, y: -2, z: 0}
    second:
      serializedVersion: 2
      m_TileIndex: 30
      m_TileSpriteIndex: 30
      m_TileMatrixIndex: 0
      m_TileColorIndex: 0
      m_TileObjectToInstantiateIndex: 65535
      dummyAlignment: 0
      m_AllTileFlags: 1073741825
  - first: {x: -1, y: 0, z: 0}
    second:
      serializedVersion: 2
      m_TileIndex: 7
      m_TileSpriteIndex: 7
      m_TileMatrixIndex: 0
      m_TileColorIndex: 0
      m_TileObjectToInstantiateIndex: 65535
      dummyAlignment: 0
      m_AllTileFlags: 1073741825
  - first: {x: 0, y: 0, z: 0}
    second:
      serializedVersion: 2
      m_TileIndex: 8
      m_TileSpriteIndex: 8
      m_TileMatrixIndex: 0
      m_TileColorIndex: 0
      m_TileObjectToInstantiateIndex: 65535
      dummyAlignment: 0
      m_AllTileFlags: 1073741825
  - first: {x: 1, y: 0, z: 0}
    second:
      serializedVersion: 2
      m_TileIndex: 9
      m_TileSpriteIndex: 9
      m_TileMatrixIndex: 0
      m_TileColorIndex: 0
      m_TileObjectToInstantiateIndex: 65535
      dummyAlignment: 0
      m_AllTileFlags: 1073741825
  - first: {x: 3, y: 0, z: 0}
    second:
      serializedVersion: 2
      m_TileIndex: 16
      m_TileSpriteIndex: 16
      m_TileMatrixIndex: 0
      m_TileColorIndex: 0
      m_TileObjectToInstantiateIndex: 65535
      dummyAlignment: 0
      m_AllTileFlags: 1073741825
  - first: {x: 4, y: 0, z: 0}
    second:
      serializedVersion: 2
      m_TileIndex: 17
      m_TileSpriteIndex: 17
      m_TileMatrixIndex: 0
      m_TileColorIndex: 0
      m_TileObjectToInstantiateIndex: 65535
      dummyAlignment: 0
      m_AllTileFlags: 1073741825
  - first: {x: 5, y: 0, z: 0}
    second:
      serializedVersion: 2
      m_TileIndex: 18
      m_TileSpriteIndex: 18
      m_TileMatrixIndex: 0
      m_TileColorIndex: 0
      m_TileObjectToInstantiateIndex: 65535
      dummyAlignment: 0
      m_AllTileFlags: 1073741825
  - first: {x: -3, y: 1, z: 0}
    second:
      serializedVersion: 2
      m_TileIndex: 0
      m_TileSpriteIndex: 0
      m_TileMatrixIndex: 0
      m_TileColorIndex: 0
      m_TileObjectToInstantiateIndex: 65535
      dummyAlignment: 0
      m_AllTileFlags: 1073741825
  - first: {x: -1, y: 1, z: 0}
    second:
      serializedVersion: 2
      m_TileIndex: 4
      m_TileSpriteIndex: 4
      m_TileMatrixIndex: 0
      m_TileColorIndex: 0
      m_TileObjectToInstantiateIndex: 65535
      dummyAlignment: 0
      m_AllTileFlags: 1073741825
  - first: {x: 0, y: 1, z: 0}
    second:
      serializedVersion: 2
      m_TileIndex: 5
      m_TileSpriteIndex: 5
      m_TileMatrixIndex: 0
      m_TileColorIndex: 0
      m_TileObjectToInstantiateIndex: 65535
      dummyAlignment: 0
      m_AllTileFlags: 1073741825
  - first: {x: 1, y: 1, z: 0}
    second:
      serializedVersion: 2
      m_TileIndex: 6
      m_TileSpriteIndex: 6
      m_TileMatrixIndex: 0
      m_TileColorIndex: 0
      m_TileObjectToInstantiateIndex: 65535
      dummyAlignment: 0
      m_AllTileFlags: 1073741825
  - first: {x: 3, y: 1, z: 0}
    second:
      serializedVersion: 2
      m_TileIndex: 13
      m_TileSpriteIndex: 13
      m_TileMatrixIndex: 0
      m_TileColorIndex: 0
      m_TileObjectToInstantiateIndex: 65535
      dummyAlignment: 0
      m_AllTileFlags: 1073741825
  - first: {x: 4, y: 1, z: 0}
    second:
      serializedVersion: 2
      m_TileIndex: 14
      m_TileSpriteIndex: 14
      m_TileMatrixIndex: 0
      m_TileColorIndex: 0
      m_TileObjectToInstantiateIndex: 65535
      dummyAlignment: 0
      m_AllTileFlags: 1073741825
  - first: {x: 5, y: 1, z: 0}
    second:
      serializedVersion: 2
      m_TileIndex: 15
      m_TileSpriteIndex: 15
      m_TileMatrixIndex: 0
      m_TileColorIndex: 0
      m_TileObjectToInstantiateIndex: 65535
      dummyAlignment: 0
      m_AllTileFlags: 1073741825
  - first: {x: -1, y: 2, z: 0}
    second:
      serializedVersion: 2
      m_TileIndex: 1
      m_TileSpriteIndex: 1
      m_TileMatrixIndex: 0
      m_TileColorIndex: 0
      m_TileObjectToInstantiateIndex: 65535
      dummyAlignment: 0
      m_AllTileFlags: 1073741825
  - first: {x: 0, y: 2, z: 0}
    second:
      serializedVersion: 2
      m_TileIndex: 2
      m_TileSpriteIndex: 2
      m_TileMatrixIndex: 0
      m_TileColorIndex: 0
      m_TileObjectToInstantiateIndex: 65535
      dummyAlignment: 0
      m_AllTileFlags: 1073741825
  - first: {x: 1, y: 2, z: 0}
    second:
      serializedVersion: 2
      m_TileIndex: 3
      m_TileSpriteIndex: 3
      m_TileMatrixIndex: 0
      m_TileColorIndex: 0
      m_TileObjectToInstantiateIndex: 65535
      dummyAlignment: 0
      m_AllTileFlags: 1073741825
  - first: {x: 3, y: 2, z: 0}
    second:
      serializedVersion: 2
      m_TileIndex: 10
      m_TileSpriteIndex: 10
      m_TileMatrixIndex: 0
      m_TileColorIndex: 0
      m_TileObjectToInstantiateIndex: 65535
      dummyAlignment: 0
      m_AllTileFlags: 1073741825
  - first: {x: 4, y: 2, z: 0}
    second:
      serializedVersion: 2
      m_TileIndex: 11
      m_TileSpriteIndex: 11
      m_TileMatrixIndex: 0
      m_TileColorIndex: 0
      m_TileObjectToInstantiateIndex: 65535
      dummyAlignment: 0
      m_AllTileFlags: 1073741825
  - first: {x: 5, y: 2, z: 0}
    second:
      serializedVersion: 2
      m_TileIndex: 12
      m_TileSpriteIndex: 12
      m_TileMatrixIndex: 0
      m_TileColorIndex: 0
      m_TileObjectToInstantiateIndex: 65535
      dummyAlignment: 0
      m_AllTileFlags: 1073741825
  - first: {x: -1, y: 4, z: 0}
    second:
      serializedVersion: 2
      m_TileIndex: 43
      m_TileSpriteIndex: 43
      m_TileMatrixIndex: 0
      m_TileColorIndex: 0
      m_TileObjectToInstantiateIndex: 65535
      dummyAlignment: 0
      m_AllTileFlags: 1073741825
  - first: {x: 0, y: 4, z: 0}
    second:
      serializedVersion: 2
      m_TileIndex: 44
      m_TileSpriteIndex: 44
      m_TileMatrixIndex: 0
      m_TileColorIndex: 0
      m_TileObjectToInstantiateIndex: 65535
      dummyAlignment: 0
      m_AllTileFlags: 1073741825
  - first: {x: 1, y: 4, z: 0}
    second:
      serializedVersion: 2
      m_TileIndex: 45
      m_TileSpriteIndex: 45
      m_TileMatrixIndex: 0
      m_TileColorIndex: 0
      m_TileObjectToInstantiateIndex: 65535
      dummyAlignment: 0
      m_AllTileFlags: 1073741825
  - first: {x: 3, y: 4, z: 0}
    second:
      serializedVersion: 2
      m_TileIndex: 52
      m_TileSpriteIndex: 52
      m_TileMatrixIndex: 0
      m_TileColorIndex: 0
      m_TileObjectToInstantiateIndex: 65535
      dummyAlignment: 0
      m_AllTileFlags: 1073741825
  - first: {x: 4, y: 4, z: 0}
    second:
      serializedVersion: 2
      m_TileIndex: 53
      m_TileSpriteIndex: 53
      m_TileMatrixIndex: 0
      m_TileColorIndex: 0
      m_TileObjectToInstantiateIndex: 65535
      dummyAlignment: 0
      m_AllTileFlags: 1073741825
  - first: {x: 5, y: 4, z: 0}
    second:
      serializedVersion: 2
      m_TileIndex: 54
      m_TileSpriteIndex: 54
      m_TileMatrixIndex: 0
      m_TileColorIndex: 0
      m_TileObjectToInstantiateIndex: 65535
      dummyAlignment: 0
      m_AllTileFlags: 1073741825
  - first: {x: -1, y: 5, z: 0}
    second:
      serializedVersion: 2
      m_TileIndex: 40
      m_TileSpriteIndex: 40
      m_TileMatrixIndex: 0
      m_TileColorIndex: 0
      m_TileObjectToInstantiateIndex: 65535
      dummyAlignment: 0
      m_AllTileFlags: 1073741825
  - first: {x: 0, y: 5, z: 0}
    second:
      serializedVersion: 2
      m_TileIndex: 41
      m_TileSpriteIndex: 41
      m_TileMatrixIndex: 0
      m_TileColorIndex: 0
      m_TileObjectToInstantiateIndex: 65535
      dummyAlignment: 0
      m_AllTileFlags: 1073741825
  - first: {x: 1, y: 5, z: 0}
    second:
      serializedVersion: 2
      m_TileIndex: 42
      m_TileSpriteIndex: 42
      m_TileMatrixIndex: 0
      m_TileColorIndex: 0
      m_TileObjectToInstantiateIndex: 65535
      dummyAlignment: 0
      m_AllTileFlags: 1073741825
  - first: {x: 3, y: 5, z: 0}
    second:
      serializedVersion: 2
      m_TileIndex: 49
      m_TileSpriteIndex: 49
      m_TileMatrixIndex: 0
      m_TileColorIndex: 0
      m_TileObjectToInstantiateIndex: 65535
      dummyAlignment: 0
      m_AllTileFlags: 1073741825
  - first: {x: 4, y: 5, z: 0}
    second:
      serializedVersion: 2
      m_TileIndex: 50
      m_TileSpriteIndex: 50
      m_TileMatrixIndex: 0
      m_TileColorIndex: 0
      m_TileObjectToInstantiateIndex: 65535
      dummyAlignment: 0
      m_AllTileFlags: 1073741825
  - first: {x: 5, y: 5, z: 0}
    second:
      serializedVersion: 2
      m_TileIndex: 51
      m_TileSpriteIndex: 51
      m_TileMatrixIndex: 0
      m_TileColorIndex: 0
      m_TileObjectToInstantiateIndex: 65535
      dummyAlignment: 0
      m_AllTileFlags: 1073741825
  - first: {x: -1, y: 6, z: 0}
    second:
      serializedVersion: 2
      m_TileIndex: 37
      m_TileSpriteIndex: 37
      m_TileMatrixIndex: 0
      m_TileColorIndex: 0
      m_TileObjectToInstantiateIndex: 65535
      dummyAlignment: 0
      m_AllTileFlags: 1073741825
  - first: {x: 0, y: 6, z: 0}
    second:
      serializedVersion: 2
      m_TileIndex: 38
      m_TileSpriteIndex: 38
      m_TileMatrixIndex: 0
      m_TileColorIndex: 0
      m_TileObjectToInstantiateIndex: 65535
      dummyAlignment: 0
      m_AllTileFlags: 1073741825
  - first: {x: 1, y: 6, z: 0}
    second:
      serializedVersion: 2
      m_TileIndex: 39
      m_TileSpriteIndex: 39
      m_TileMatrixIndex: 0
      m_TileColorIndex: 0
      m_TileObjectToInstantiateIndex: 65535
      dummyAlignment: 0
      m_AllTileFlags: 1073741825
  - first: {x: 3, y: 6, z: 0}
    second:
      serializedVersion: 2
      m_TileIndex: 46
      m_TileSpriteIndex: 46
      m_TileMatrixIndex: 0
      m_TileColorIndex: 0
      m_TileObjectToInstantiateIndex: 65535
      dummyAlignment: 0
      m_AllTileFlags: 1073741825
  - first: {x: 4, y: 6, z: 0}
    second:
      serializedVersion: 2
      m_TileIndex: 47
      m_TileSpriteIndex: 47
      m_TileMatrixIndex: 0
      m_TileColorIndex: 0
      m_TileObjectToInstantiateIndex: 65535
      dummyAlignment: 0
      m_AllTileFlags: 1073741825
  - first: {x: 5, y: 6, z: 0}
    second:
      serializedVersion: 2
      m_TileIndex: 48
      m_TileSpriteIndex: 48
      m_TileMatrixIndex: 0
      m_TileColorIndex: 0
      m_TileObjectToInstantiateIndex: 65535
      dummyAlignment: 0
      m_AllTileFlags: 1073741825
  m_AnimatedTiles: {}
  m_TileAssetArray:
  - m_RefCount: 1
    m_Data: {fileID: 11400000, guid: c13413467a8174345af86508edcf0269, type: 2}
  - m_RefCount: 1
    m_Data: {fileID: 11400000, guid: 3f8755b07df8bdc4e9bc66b16675adfb, type: 2}
  - m_RefCount: 1
    m_Data: {fileID: 11400000, guid: c59489f1fd47cc0409fe2c0abc54e164, type: 2}
  - m_RefCount: 1
    m_Data: {fileID: 11400000, guid: 7da55d714d03d1f47bce93ecbf94f440, type: 2}
  - m_RefCount: 1
    m_Data: {fileID: 11400000, guid: cc340dcb9ad672542a66ba88ebcf9fb9, type: 2}
  - m_RefCount: 1
    m_Data: {fileID: 11400000, guid: 9a3b45afa259f8442ab5afafb71f6f00, type: 2}
  - m_RefCount: 1
    m_Data: {fileID: 11400000, guid: dcf1e5d637d048b408444a76bca7860d, type: 2}
  - m_RefCount: 1
    m_Data: {fileID: 11400000, guid: 6953e917356e9384599179395c06a918, type: 2}
  - m_RefCount: 1
    m_Data: {fileID: 11400000, guid: ff88502d1ff6a6c4da146a7785d06ea3, type: 2}
  - m_RefCount: 1
    m_Data: {fileID: 11400000, guid: 0f23f2945aa22de44a4543487cf1545a, type: 2}
  - m_RefCount: 1
    m_Data: {fileID: 11400000, guid: 51f6182ad3114024387a8993ff355c05, type: 2}
  - m_RefCount: 1
    m_Data: {fileID: 11400000, guid: 915b17dbf12de834b9be35a2a8a8ec74, type: 2}
  - m_RefCount: 1
    m_Data: {fileID: 11400000, guid: fdbb5186515c52e459c75b04ad154967, type: 2}
  - m_RefCount: 1
    m_Data: {fileID: 11400000, guid: afa46f9977a724b47863f5fe3e3de59e, type: 2}
  - m_RefCount: 1
    m_Data: {fileID: 11400000, guid: 44c3825c5279ca644aec4f3ff04cca9b, type: 2}
  - m_RefCount: 1
    m_Data: {fileID: 11400000, guid: 85f13cc8cfed11140ab0e6fd761f45b5, type: 2}
  - m_RefCount: 1
    m_Data: {fileID: 11400000, guid: 9b286d30e3d32924cbb92d29304e9975, type: 2}
  - m_RefCount: 1
    m_Data: {fileID: 11400000, guid: d453b3fbbeab7e8478447beb2f2ce0cf, type: 2}
  - m_RefCount: 1
    m_Data: {fileID: 11400000, guid: 4e39b1c32e61fd14a8927e5926d7c228, type: 2}
  - m_RefCount: 1
    m_Data: {fileID: 11400000, guid: c5128dd1f87060e429b395e838fd724a, type: 2}
  - m_RefCount: 1
    m_Data: {fileID: 11400000, guid: 7b6add4de0e3076468b5f33be1a2a529, type: 2}
  - m_RefCount: 1
    m_Data: {fileID: 11400000, guid: ffa5f8f09e8282649947374f9660c8de, type: 2}
  - m_RefCount: 1
    m_Data: {fileID: 11400000, guid: 1f045b0a13f7c634cba63274e7f06052, type: 2}
  - m_RefCount: 1
    m_Data: {fileID: 11400000, guid: fa7958f6036be5f4e8d2af37bc06cc9f, type: 2}
  - m_RefCount: 1
    m_Data: {fileID: 11400000, guid: 03c2750c9fa75e54e9850d76a4056edd, type: 2}
  - m_RefCount: 1
    m_Data: {fileID: 11400000, guid: ed303e43482717c4fa53b383e491a0f4, type: 2}
  - m_RefCount: 1
    m_Data: {fileID: 11400000, guid: c9974cca6c2a9cd43a7ee975ca6412aa, type: 2}
  - m_RefCount: 1
    m_Data: {fileID: 11400000, guid: 4b1dfc2c5312f19449369cbceac406a1, type: 2}
  - m_RefCount: 1
    m_Data: {fileID: 11400000, guid: ffb5e5e29d2f1b24dbc18ee22701ea58, type: 2}
  - m_RefCount: 1
    m_Data: {fileID: 11400000, guid: 0bb81323d6fdfb444b581b133985e570, type: 2}
  - m_RefCount: 1
    m_Data: {fileID: 11400000, guid: f5233cf3db6c87a45bac968eff845f5a, type: 2}
  - m_RefCount: 1
    m_Data: {fileID: 11400000, guid: 52301bc2be54213469857d6776654153, type: 2}
  - m_RefCount: 1
    m_Data: {fileID: 11400000, guid: eb6f776cbb1383847abae4fbf77c348f, type: 2}
  - m_RefCount: 1
    m_Data: {fileID: 11400000, guid: af89049fedce599478fc44c78fb51ee0, type: 2}
  - m_RefCount: 1
    m_Data: {fileID: 11400000, guid: a84aabfdfd73ea1489388a2cdf04e6bc, type: 2}
  - m_RefCount: 1
    m_Data: {fileID: 11400000, guid: 358b80b6025437b4b9bb7897cf8b13bf, type: 2}
  - m_RefCount: 1
    m_Data: {fileID: 11400000, guid: bf98d252212372843970f2fdf286536c, type: 2}
  - m_RefCount: 1
    m_Data: {fileID: 11400000, guid: b47b3f6b0c3bd0845a4f4a7a5d1bfd0e, type: 2}
  - m_RefCount: 1
    m_Data: {fileID: 11400000, guid: 6eec1bb9db033c243a0ca82f52ac0bec, type: 2}
  - m_RefCount: 1
    m_Data: {fileID: 11400000, guid: c5944a27f0579c64ca4edda370d877f5, type: 2}
  - m_RefCount: 1
    m_Data: {fileID: 11400000, guid: ccd869f59850e8641a431705cb7a4683, type: 2}
  - m_RefCount: 1
    m_Data: {fileID: 11400000, guid: a566cf72c495cc64bb9c7979afa26b15, type: 2}
  - m_RefCount: 1
    m_Data: {fileID: 11400000, guid: 922acef5e7b96a3438c4050f342d84a1, type: 2}
  - m_RefCount: 1
    m_Data: {fileID: 11400000, guid: 584fd43899860c244a8525a9e6d6c539, type: 2}
  - m_RefCount: 1
    m_Data: {fileID: 11400000, guid: f53e074fb8577e74ba0f8f9d809ec6b7, type: 2}
  - m_RefCount: 1
    m_Data: {fileID: 11400000, guid: f212c0996a5703f49b705e12b7fceb32, type: 2}
  - m_RefCount: 1
    m_Data: {fileID: 11400000, guid: d9a40120e2e20e841828974a6f4431d7, type: 2}
  - m_RefCount: 1
    m_Data: {fileID: 11400000, guid: 538c9d08b8ef5714398364478b8de71f, type: 2}
  - m_RefCount: 1
    m_Data: {fileID: 11400000, guid: 570609425d93adc4c87df8c5239b23ca, type: 2}
  - m_RefCount: 1
    m_Data: {fileID: 11400000, guid: 0a814f179ef530e4981c1e75ffb177d7, type: 2}
  - m_RefCount: 1
    m_Data: {fileID: 11400000, guid: 4f00715f4ea233145ac295104527aa6e, type: 2}
  - m_RefCount: 1
    m_Data: {fileID: 11400000, guid: 2f9750d4966e5c846bafd16520e9039e, type: 2}
  - m_RefCount: 1
    m_Data: {fileID: 11400000, guid: 4eaaa9459e1674945a0c02b381c8ac13, type: 2}
  - m_RefCount: 1
    m_Data: {fileID: 11400000, guid: c50c6f02a7fd92146ba9e8d89177498e, type: 2}
  - m_RefCount: 1
    m_Data: {fileID: 11400000, guid: 92223ca2b14598c4ebf060520b7b0f3d, type: 2}
  m_TileSpriteArray:
  - m_RefCount: 1
    m_Data: {fileID: 21300000, guid: 7dcfb88fa65dc8d42948eb138c663c06, type: 3}
  - m_RefCount: 1
    m_Data: {fileID: -8782233188917232318, guid: 0f2ac147ff121e740af773413c1daf76,
      type: 3}
  - m_RefCount: 1
    m_Data: {fileID: -1188908986143349998, guid: 0f2ac147ff121e740af773413c1daf76,
      type: 3}
  - m_RefCount: 1
    m_Data: {fileID: 4282214546219698364, guid: 0f2ac147ff121e740af773413c1daf76,
      type: 3}
  - m_RefCount: 1
    m_Data: {fileID: -8167701438036380033, guid: 0f2ac147ff121e740af773413c1daf76,
      type: 3}
  - m_RefCount: 1
    m_Data: {fileID: 26713980818622677, guid: 0f2ac147ff121e740af773413c1daf76, type: 3}
  - m_RefCount: 1
    m_Data: {fileID: 5000856049214160346, guid: 0f2ac147ff121e740af773413c1daf76,
      type: 3}
  - m_RefCount: 1
    m_Data: {fileID: 8432399904259013238, guid: 0f2ac147ff121e740af773413c1daf76,
      type: 3}
  - m_RefCount: 1
    m_Data: {fileID: -2181822983326053736, guid: 0f2ac147ff121e740af773413c1daf76,
      type: 3}
  - m_RefCount: 1
    m_Data: {fileID: 7434502941098977043, guid: 0f2ac147ff121e740af773413c1daf76,
      type: 3}
  - m_RefCount: 1
    m_Data: {fileID: 21300000, guid: 7f66f11c22105f54d83df1487efd7d2f, type: 3}
  - m_RefCount: 1
    m_Data: {fileID: 21300002, guid: 7f66f11c22105f54d83df1487efd7d2f, type: 3}
  - m_RefCount: 1
    m_Data: {fileID: 21300004, guid: 7f66f11c22105f54d83df1487efd7d2f, type: 3}
  - m_RefCount: 1
    m_Data: {fileID: 21300006, guid: 7f66f11c22105f54d83df1487efd7d2f, type: 3}
  - m_RefCount: 1
    m_Data: {fileID: 21300008, guid: 7f66f11c22105f54d83df1487efd7d2f, type: 3}
  - m_RefCount: 1
    m_Data: {fileID: 21300010, guid: 7f66f11c22105f54d83df1487efd7d2f, type: 3}
  - m_RefCount: 1
    m_Data: {fileID: 21300012, guid: 7f66f11c22105f54d83df1487efd7d2f, type: 3}
  - m_RefCount: 1
    m_Data: {fileID: 21300014, guid: 7f66f11c22105f54d83df1487efd7d2f, type: 3}
  - m_RefCount: 1
    m_Data: {fileID: 21300016, guid: 7f66f11c22105f54d83df1487efd7d2f, type: 3}
  - m_RefCount: 1
    m_Data: {fileID: 21300000, guid: 763e8b853867b714d9a548dbcf002d27, type: 3}
  - m_RefCount: 1
    m_Data: {fileID: 21300002, guid: 763e8b853867b714d9a548dbcf002d27, type: 3}
  - m_RefCount: 1
    m_Data: {fileID: 21300004, guid: 763e8b853867b714d9a548dbcf002d27, type: 3}
  - m_RefCount: 1
    m_Data: {fileID: 21300006, guid: 763e8b853867b714d9a548dbcf002d27, type: 3}
  - m_RefCount: 1
    m_Data: {fileID: 21300008, guid: 763e8b853867b714d9a548dbcf002d27, type: 3}
  - m_RefCount: 1
    m_Data: {fileID: 21300010, guid: 763e8b853867b714d9a548dbcf002d27, type: 3}
  - m_RefCount: 1
    m_Data: {fileID: 21300012, guid: 763e8b853867b714d9a548dbcf002d27, type: 3}
  - m_RefCount: 1
    m_Data: {fileID: 21300014, guid: 763e8b853867b714d9a548dbcf002d27, type: 3}
  - m_RefCount: 1
    m_Data: {fileID: 21300016, guid: 763e8b853867b714d9a548dbcf002d27, type: 3}
  - m_RefCount: 1
    m_Data: {fileID: 21300000, guid: a2eb4a293b5c4d74d9ef9514879082b4, type: 3}
  - m_RefCount: 1
    m_Data: {fileID: 21300002, guid: a2eb4a293b5c4d74d9ef9514879082b4, type: 3}
  - m_RefCount: 1
    m_Data: {fileID: 21300004, guid: a2eb4a293b5c4d74d9ef9514879082b4, type: 3}
  - m_RefCount: 1
    m_Data: {fileID: 21300006, guid: a2eb4a293b5c4d74d9ef9514879082b4, type: 3}
  - m_RefCount: 1
    m_Data: {fileID: 21300008, guid: a2eb4a293b5c4d74d9ef9514879082b4, type: 3}
  - m_RefCount: 1
    m_Data: {fileID: 21300010, guid: a2eb4a293b5c4d74d9ef9514879082b4, type: 3}
  - m_RefCount: 1
    m_Data: {fileID: 21300012, guid: a2eb4a293b5c4d74d9ef9514879082b4, type: 3}
  - m_RefCount: 1
    m_Data: {fileID: 21300014, guid: a2eb4a293b5c4d74d9ef9514879082b4, type: 3}
  - m_RefCount: 1
    m_Data: {fileID: 21300016, guid: a2eb4a293b5c4d74d9ef9514879082b4, type: 3}
  - m_RefCount: 1
    m_Data: {fileID: 21300000, guid: 66fb840badda1cc4db2344d489c19b4f, type: 3}
  - m_RefCount: 1
    m_Data: {fileID: 21300002, guid: 66fb840badda1cc4db2344d489c19b4f, type: 3}
  - m_RefCount: 1
    m_Data: {fileID: 21300004, guid: 66fb840badda1cc4db2344d489c19b4f, type: 3}
  - m_RefCount: 1
    m_Data: {fileID: 21300006, guid: 66fb840badda1cc4db2344d489c19b4f, type: 3}
  - m_RefCount: 1
    m_Data: {fileID: 21300008, guid: 66fb840badda1cc4db2344d489c19b4f, type: 3}
  - m_RefCount: 1
    m_Data: {fileID: 21300010, guid: 66fb840badda1cc4db2344d489c19b4f, type: 3}
  - m_RefCount: 1
    m_Data: {fileID: 21300012, guid: 66fb840badda1cc4db2344d489c19b4f, type: 3}
  - m_RefCount: 1
    m_Data: {fileID: 21300014, guid: 66fb840badda1cc4db2344d489c19b4f, type: 3}
  - m_RefCount: 1
    m_Data: {fileID: 21300016, guid: 66fb840badda1cc4db2344d489c19b4f, type: 3}
  - m_RefCount: 1
    m_Data: {fileID: 21300000, guid: ac63383d3b71ecb44be7ef7365442d0d, type: 3}
  - m_RefCount: 1
    m_Data: {fileID: 21300002, guid: ac63383d3b71ecb44be7ef7365442d0d, type: 3}
  - m_RefCount: 1
    m_Data: {fileID: 21300004, guid: ac63383d3b71ecb44be7ef7365442d0d, type: 3}
  - m_RefCount: 1
    m_Data: {fileID: 21300006, guid: ac63383d3b71ecb44be7ef7365442d0d, type: 3}
  - m_RefCount: 1
    m_Data: {fileID: 21300008, guid: ac63383d3b71ecb44be7ef7365442d0d, type: 3}
  - m_RefCount: 1
    m_Data: {fileID: 21300010, guid: ac63383d3b71ecb44be7ef7365442d0d, type: 3}
  - m_RefCount: 1
    m_Data: {fileID: 21300012, guid: ac63383d3b71ecb44be7ef7365442d0d, type: 3}
  - m_RefCount: 1
    m_Data: {fileID: 21300014, guid: ac63383d3b71ecb44be7ef7365442d0d, type: 3}
  - m_RefCount: 1
    m_Data: {fileID: 21300016, guid: ac63383d3b71ecb44be7ef7365442d0d, type: 3}
  m_TileMatrixArray:
  - m_RefCount: 55
    m_Data:
      e00: 1
      e01: 0
      e02: 0
      e03: 0
      e10: 0
      e11: 1
      e12: 0
      e13: 0
      e20: 0
      e21: 0
      e22: 1
      e23: 0
      e30: 0
      e31: 0
      e32: 0
      e33: 1
  m_TileColorArray:
  - m_RefCount: 55
    m_Data: {r: 1, g: 1, b: 1, a: 1}
  m_TileObjectToInstantiateArray: []
  m_AnimationFrameRate: 1
  m_Color: {r: 1, g: 1, b: 1, a: 1}
  m_Origin: {x: -3, y: -4, z: 0}
  m_Size: {x: 9, y: 11, z: 1}
  m_TileAnchor: {x: 0.5, y: 0.5, z: 0}
  m_TileOrientation: 0
  m_TileOrientationMatrix:
    e00: 1
    e01: 0
    e02: 0
    e03: 0
    e10: 0
    e11: 1
    e12: 0
    e13: 0
    e20: 0
    e21: 0
    e22: 1
    e23: 0
    e30: 0
    e31: 0
    e32: 0
    e33: 1
--- !u!483693784 &7602741308454063158
TilemapRenderer:
  m_ObjectHideFlags: 0
  m_CorrespondingSourceObject: {fileID: 0}
  m_PrefabInstance: {fileID: 0}
  m_PrefabAsset: {fileID: 0}
  m_GameObject: {fileID: 634637873285016353}
  m_Enabled: 1
  m_CastShadows: 0
  m_ReceiveShadows: 0
  m_DynamicOccludee: 0
  m_MotionVectors: 1
  m_LightProbeUsage: 0
  m_ReflectionProbeUsage: 0
  m_RayTracingMode: 0
  m_RayTraceProcedural: 0
  m_RenderingLayerMask: 1
  m_RendererPriority: 0
  m_Materials:
  - {fileID: 10754, guid: 0000000000000000f000000000000000, type: 0}
  m_StaticBatchInfo:
    firstSubMesh: 0
    subMeshCount: 0
  m_StaticBatchRoot: {fileID: 0}
  m_ProbeAnchor: {fileID: 0}
  m_LightProbeVolumeOverride: {fileID: 0}
  m_ScaleInLightmap: 1
  m_ReceiveGI: 1
  m_PreserveUVs: 0
  m_IgnoreNormalsForChartDetection: 0
  m_ImportantGI: 0
  m_StitchLightmapSeams: 1
  m_SelectedEditorRenderState: 0
  m_MinimumChartSize: 4
  m_AutoUVMaxDistance: 0.5
  m_AutoUVMaxAngle: 89
  m_LightmapParameters: {fileID: 0}
  m_SortingLayerID: 0
  m_SortingLayer: 0
  m_SortingOrder: 0
  m_ChunkSize: {x: 32, y: 32, z: 32}
  m_ChunkCullingBounds: {x: 0, y: 0, z: 0}
  m_MaxChunkCount: 16
  m_MaxFrameAge: 16
  m_SortOrder: 0
  m_Mode: 0
  m_DetectChunkCullingBounds: 0
  m_MaskInteraction: 0
--- !u!1 &1956291549668863694
GameObject:
  m_ObjectHideFlags: 0
  m_CorrespondingSourceObject: {fileID: 0}
  m_PrefabInstance: {fileID: 0}
  m_PrefabAsset: {fileID: 0}
  serializedVersion: 6
  m_Component:
  - component: {fileID: 8462023511870639260}
  - component: {fileID: 5235386553454406033}
  m_Layer: 31
  m_Name: GamePAlette
  m_TagString: Untagged
  m_Icon: {fileID: 0}
  m_NavMeshLayer: 0
  m_StaticEditorFlags: 0
  m_IsActive: 1
--- !u!4 &8462023511870639260
Transform:
  m_ObjectHideFlags: 0
  m_CorrespondingSourceObject: {fileID: 0}
  m_PrefabInstance: {fileID: 0}
  m_PrefabAsset: {fileID: 0}
  m_GameObject: {fileID: 1956291549668863694}
  m_LocalRotation: {x: 0, y: 0, z: 0, w: 1}
  m_LocalPosition: {x: 0, y: 0, z: 0}
  m_LocalScale: {x: 1, y: 1, z: 1}
  m_Children:
  - {fileID: 8095997470063865974}
  m_Father: {fileID: 0}
  m_RootOrder: 0
  m_LocalEulerAnglesHint: {x: 0, y: 0, z: 0}
--- !u!156049354 &5235386553454406033
Grid:
  m_ObjectHideFlags: 0
  m_CorrespondingSourceObject: {fileID: 0}
  m_PrefabInstance: {fileID: 0}
  m_PrefabAsset: {fileID: 0}
  m_GameObject: {fileID: 1956291549668863694}
  m_Enabled: 1
  m_CellSize: {x: 1, y: 1, z: 0}
  m_CellGap: {x: 0, y: 0, z: 0}
  m_CellLayout: 0
  m_CellSwizzle: 0
--- !u!114 &7449321029727527560
MonoBehaviour:
  m_ObjectHideFlags: 0
  m_CorrespondingSourceObject: {fileID: 0}
  m_PrefabInstance: {fileID: 0}
  m_PrefabAsset: {fileID: 0}
  m_GameObject: {fileID: 0}
  m_Enabled: 1
  m_EditorHideFlags: 0
  m_Script: {fileID: 12395, guid: 0000000000000000e000000000000000, type: 0}
  m_Name: Palette Settings
  m_EditorClassIdentifier: 
  cellSizing: 0
