{
    "/build/js/webpack/crap.workaround.js": "/build/js/webpack/crap.workaround.js",
    "/build/js/drowl_child.js": "/build/js/drowl_child.js",
    "/build/js/drowl_child.global.js": "/build/js/drowl_child.global.js",
    "/build/js/drowl_child.functions.js": "/build/js/drowl_child.functions.js",
    "/build/js/bootstrap/init.js": "/build/js/bootstrap/init.js",
    "/build/css/animations/drowl_child.animations.css": "/build/css/animations/drowl_child.animations.css",
    "/build/css/base/utilities.css": "/build/css/base/utilities.css",
    "/build/css/base/typography.css": "/build/css/base/typography.css",
    "/build/css/base/helpers.css": "/build/css/base/helpers.css",
    "/build/css/base/elements.css": "/build/css/base/elements.css",
    "/build/css/drowl_child.bootstrap.css": "/build/css/drowl_child.bootstrap.css",
    "/build/css/page/header.css": "/build/css/page/header.css",
    "/build/css/page/footer.css": "/build/css/page/footer.css",
    "/build/css/page/content.css": "/build/css/page/content.css",
    "/build/css/navigation/navbar.css": "/build/css/navigation/navbar.css",
    "/build/css/navigation/nav.css": "/build/css/navigation/nav.css",
    "/build/css/navigation/misc.css": "/build/css/navigation/misc.css",
    "/build/css/navigation/mega-menu.css": "/build/css/navigation/mega-menu.css",
    "/build/css/navigation/language-switcher.css": "/build/css/navigation/language-switcher.css",
    "/build/css/libraries/slick.css": "/build/css/libraries/slick.css",
    "/build/css/layouts/misc.css": "/build/css/layouts/misc.css",
    "/build/css/forms/misc.css": "/build/css/forms/misc.css",
    "/build/css/user/user-login.css": "/build/css/user/user-login.css",
    "/build/css/user/user.css": "/build/css/user/user.css",
    "/build/css/entities/views.css": "/build/css/entities/views.css",
    "/build/css/entities/tokens.css": "/build/css/entities/tokens.css",
    "/build/css/entities/paragraphs.css": "/build/css/entities/paragraphs.css",
    "/build/css/entities/nodes.css": "/build/css/entities/nodes.css",
    "/build/css/entities/misc.css": "/build/css/entities/misc.css",
    "/build/css/entities/media.css": "/build/css/entities/media.css",
    "/build/css/entities/fields.css": "/build/css/entities/fields.css",
    "/build/css/entities/blocks.css": "/build/css/entities/blocks.css",
    "/build/css/components/tabs-accordion.css": "/build/css/components/tabs-accordion.css",
    "/build/css/components/slider.css": "/build/css/components/slider.css",
    "/build/css/components/misc.css": "/build/css/components/misc.css",
    "/build/css/components/media-objects.css": "/build/css/components/media-objects.css",
    "/build/css/components/list-styles.css": "/build/css/components/list-styles.css",
    "/build/css/components/icons.css": "/build/css/components/icons.css",
    "/build/css/components/cards.css": "/build/css/components/cards.css",
    "/build/css/components/buttons.css": "/build/css/components/buttons.css",
    "/build/css/components/box-styles.css": "/build/css/components/box-styles.css",
    "/build/css/components/alerts.css": "/build/css/components/alerts.css",
    "/build/css/base/css_variables.css": "/build/css/base/css_variables.css",
    "/build/assets/images/gears_cogs_wartungsmodus_maintenance_mode.svg": "/build/assets/images/gears_cogs_wartungsmodus_maintenance_mode.svg",
    "/build/assets/images/mail_headerimage.png": "/build/assets/images/mail_headerimage.png",
    "/build/assets/images/mail_headerimage.psd": "/build/assets/images/mail_headerimage.psd",
    "/build/assets/images/user_login_default_image.afdesign": "/build/assets/images/user_login_default_image.afdesign",
    "/build/assets/images/user_login_default_image.webp": "/build/assets/images/user_login_default_image.webp",
    "/build/assets/favicons/apple-touch-icon.png": "/build/assets/favicons/apple-touch-icon.png",
    "/build/assets/favicons/favicon-96x96.png": "/build/assets/favicons/favicon-96x96.png",
    "/build/assets/favicons/favicon.ico": "/build/assets/favicons/favicon.ico",
    "/build/assets/favicons/favicon.svg": "/build/assets/favicons/favicon.svg",
    "/build/assets/favicons/site.webmanifest": "/build/assets/favicons/site.webmanifest",
    "/build/assets/favicons/web-app-manifest-192x192.png": "/build/assets/favicons/web-app-manifest-192x192.png",
    "/build/assets/favicons/web-app-manifest-512x512.png": "/build/assets/favicons/web-app-manifest-512x512.png",
    "/build/fonts/Read Me.txt": "/build/fonts/Read Me.txt",
    "/build/fonts/demo.html": "/build/fonts/demo.html",
    "/build/fonts/selection.json": "/build/fonts/selection.json",
    "/build/fonts/style.css": "/build/fonts/style.css",
    "/build/fonts/style.scss": "/build/fonts/style.scss",
    "/build/fonts/variables.scss": "/build/fonts/variables.scss",
    "/build/fonts/demo.css": "/build/fonts/demo.css",
    "/build/fonts/demo.js": "/build/fonts/demo.js",
    "/build/fonts/ico.svg": "/build/fonts/ico.svg",
    "/build/fonts/ico.ttf": "/build/fonts/ico.ttf",
    "/build/fonts/ico.woff": "/build/fonts/ico.woff",
    "/build/fonts/ico.woff2": "/build/fonts/ico.woff2",
    "/build/fonts/poppins-v20-latin-300.woff2": "/build/fonts/poppins-v20-latin-300.woff2",
    "/build/fonts/poppins-v20-latin-600.woff2": "/build/fonts/poppins-v20-latin-600.woff2",
    "/libraries/hoverintent/hoverintent.min.js": "/libraries/hoverintent/hoverintent.min.js"
}
