<svg class="svg" width="11" height="21" viewBox="0 0 11 21" fill="none" xmlns="http://www.w3.org/2000/svg">
    <path d="M0.0651445 10.15L9.05233 0.15C9.25204 -0.05 9.55162 -0.05 9.75133 0.15C9.95105 0.35 9.95105 0.65 9.75133 0.85L1.16358 10.45L9.85119 20.15C10.0509 20.35 10.0509 20.65 9.85119 20.85C9.65148 21.05 9.3519 21.05 9.15219 20.85L0.165003 10.85C-0.0347128 10.55 -0.0347128 10.35 0.0651445 10.15Z"
          fill="black" fill-opacity="0.28"/>
    <path d="M10.0514 0.15L1.06417 10.15C0.964314 10.35 0.964314 10.55 1.16403 10.85L10.1512 20.85C10.3509 21.05 10.6505 21.05 10.8502 20.85C11.0499 20.65 11.0499 20.35 10.8502 20.15L2.1626 10.45L10.7504 0.85C10.9501 0.65 10.9501 0.35 10.7504 0.15C10.5506 -0.05 10.2511 -0.05 10.0514 0.15Z"
          fill="white"/>
</svg>
