<svg class="svg svgArrowRight" width="4.25" height="7.125" viewBox="0 0 4.25 7.125"
     xmlns="http://www.w3.org/2000/svg">
    <path d="M0.55 7.15C0.35 7.15 0.25 7.05 0.15 6.95C-0.05 6.75 -0.05 6.35 0.15 6.15L2.75 3.55L0.15 0.95C-0.05 0.75 -0.05 0.35 0.15 0.15C0.35 -0.05 0.75 -0.05 0.95 0.15L3.95 3.15C4.15 3.35 4.15 3.75 3.95 3.95L0.95 6.95C0.85 7.05 0.75 7.15 0.55 7.15Z"/>
</svg>
