<svg class="svg" width="13" height="14" viewBox="0 0 13 14" fill="#CECECE" xmlns="http://www.w3.org/2000/svg">
    <path d="M12.5103 7.82458C12.7852 7.40941 12.9225 6.9524 12.9225 6.45322C12.9225 5.87544 12.7096 5.37361 12.2834 4.94692C11.857 4.52067 11.3522 4.30759 10.7689 4.30759H9.28817C9.55733 3.75237 9.69214 3.21385 9.69214 2.6923C9.69214 2.03603 9.59372 1.51445 9.39758 1.12743C9.20124 0.740283 8.91514 0.455716 8.53931 0.273341C8.16339 0.0910547 7.74006 0 7.26894 0C6.98275 0 6.73045 0.103755 6.51171 0.311354C6.27058 0.546888 6.09669 0.849844 5.99016 1.22004C5.88358 1.59013 5.798 1.94495 5.73356 2.28429C5.66911 2.62361 5.56945 2.86339 5.43491 3.0036C5.16 3.30087 4.85996 3.65993 4.53464 4.08055C3.96816 4.81523 3.5839 5.24997 3.38208 5.38463H1.07689C0.779623 5.38463 0.525789 5.48995 0.31545 5.70011C0.105199 5.91048 0 6.16429 0 6.46158V11.846C0 12.1433 0.105081 12.397 0.31545 12.6074C0.525907 12.8177 0.779623 12.923 1.07689 12.923H3.49974C3.62315 12.923 4.01009 13.0351 4.66073 13.2595C5.35066 13.5007 5.95781 13.6844 6.48218 13.8106C7.00662 13.9369 7.53806 14 8.07655 14H8.85877H9.16181C9.95261 14 10.5892 13.7741 11.0716 13.3225C11.5538 12.871 11.7923 12.2554 11.7868 11.4758C12.1233 11.0439 12.2915 10.5447 12.2915 9.9783C12.2915 9.85498 12.2832 9.7344 12.2663 9.6165C12.4794 9.24084 12.5861 8.83699 12.5861 8.40509C12.5861 8.20315 12.5609 8.00954 12.5103 7.82458ZM11.6651 7.14349C11.5445 7.40145 11.3944 7.53326 11.2149 7.5388C11.299 7.63419 11.3692 7.76753 11.4253 7.93844C11.4814 8.10956 11.5092 8.26514 11.5092 8.40544C11.5092 8.79226 11.3608 9.12607 11.0635 9.40642C11.1645 9.58582 11.215 9.77942 11.215 9.98685C11.215 10.1944 11.166 10.4005 11.0677 10.6052C10.9697 10.8097 10.8364 10.957 10.6682 11.0467C10.6962 11.2149 10.7101 11.372 10.7101 11.5178C10.7101 12.4544 10.1716 12.9228 9.09463 12.9228H8.07694C7.34202 12.9228 6.38305 12.7182 5.19949 12.3086C5.17141 12.2974 5.09019 12.2679 4.9555 12.2203C4.8208 12.1727 4.72129 12.1376 4.65676 12.1152C4.59222 12.0926 4.49415 12.0604 4.36226 12.0184C4.23039 11.9763 4.12395 11.9454 4.04256 11.9258C3.96129 11.9063 3.86868 11.888 3.76501 11.8712C3.66128 11.8544 3.57291 11.846 3.50001 11.846H3.23079V6.46179H3.50001C3.58974 6.46179 3.68928 6.43648 3.79866 6.38612C3.90801 6.33561 4.02026 6.25991 4.13521 6.15892C4.25022 6.05794 4.3581 5.9584 4.45912 5.86018C4.5601 5.76205 4.67226 5.63867 4.7957 5.4901C4.91908 5.3414 5.01582 5.22227 5.08598 5.13251C5.15605 5.04278 5.24437 4.92774 5.35095 4.78753C5.45748 4.64736 5.52204 4.5632 5.54447 4.53511C5.8529 4.15377 6.06884 3.89859 6.19222 3.76952C6.42219 3.52841 6.58903 3.22133 6.69279 2.84833C6.79666 2.47527 6.88217 2.12331 6.94924 1.79245C7.01649 1.46156 7.12319 1.22311 7.2692 1.07727C7.80751 1.07727 8.16658 1.20902 8.346 1.47267C8.5254 1.73626 8.61516 2.14294 8.61516 2.6926C8.61516 3.02349 8.48044 3.47358 8.21116 4.04283C7.942 4.61214 7.80751 5.05946 7.80751 5.38475H10.7689C11.0496 5.38475 11.2991 5.49266 11.5177 5.70872C11.7365 5.92463 11.8461 6.17557 11.8461 6.4617C11.846 6.65798 11.7857 6.88518 11.6651 7.14349Z"/>
</svg>
