<svg width="60" height="60" viewBox="-5 -5 60 60" fill="none" xmlns="http://www.w3.org/2000/svg">
<path d="M25 0C11.2145 0 0 11.2153 0 25C0 38.7847 11.2145 50 25 50C38.7855 50 50 38.7847 50 25C50 11.2153 38.7855 0 25 0ZM39.3815 43.4226L38.4508 42.1419L37.1468 43.0903L38.0823 44.3774C36.5105 45.4419 34.8024 46.3202 32.9903 46.9806L32.496 45.4597L30.9621 45.9581L31.4548 47.4742C29.6508 47.9927 27.7597 48.3 25.8073 48.3669V46.7742H24.1944V48.3669C22.2419 48.3 20.35 47.9935 18.5468 47.4742L19.0395 45.9581L17.5056 45.4597L17.0113 46.9806C15.1992 46.3202 13.4919 45.4419 11.9194 44.3774L12.8548 43.0903L11.5508 42.1419L10.6202 43.4226C9.11452 42.2444 7.75726 40.8871 6.57903 39.3815L7.85968 38.4508L6.91129 37.146L5.62419 38.0815C4.55968 36.5097 3.68145 34.8016 3.02097 32.9903L4.54194 32.496L4.04274 30.9621L2.52661 31.4548C2.00726 29.65 1.7 27.7589 1.63306 25.8065H3.22581V24.1935H1.63306C1.7 22.2411 2.00645 20.35 2.52581 18.546L4.04194 19.0387L4.54113 17.5048L3.02016 17.0105C3.68064 15.1992 4.55887 13.4911 5.62339 11.9194L6.91048 12.8548L7.85887 11.55L6.57823 10.6194C7.75645 9.11371 9.11371 7.75645 10.6194 6.57823L11.55 7.85887L12.854 6.91048L11.9185 5.62339C13.4903 4.55887 15.1984 3.68064 17.0105 3.02016L17.5048 4.54113L19.0387 4.04274L18.546 2.52661C20.3492 2.00726 22.2411 1.7 24.1935 1.63306V3.22581H25.8065V1.63306C27.7589 1.7 29.6508 2.00645 31.454 2.52581L30.9613 4.04194L32.4952 4.54032L32.9895 3.01935C34.8016 3.67984 36.5089 4.55806 38.0815 5.62258L37.146 6.90968L38.45 7.85807L39.3806 6.57742C40.8863 7.75565 42.2435 9.1129 43.4218 10.6185L42.1411 11.5492L43.0895 12.854L44.3766 11.9185C45.4411 13.4903 46.3194 15.1984 46.9798 17.0097L45.4589 17.504L45.9581 19.0379L47.4742 18.5452C47.9927 20.3492 48.3 22.2403 48.3669 24.1927H46.7742V25.8056H48.3669C48.3 27.7581 47.9935 29.6492 47.4742 31.4532L45.9581 30.9605L45.4589 32.4944L46.9798 32.9887C46.3194 34.8 45.4411 36.5081 44.3766 38.0798L43.0895 37.1444L42.1411 38.4492L43.4218 39.3798C42.2444 40.8871 40.8871 42.2444 39.3815 43.4226Z" fill="#FFBB25"/>
<path d="M28.225 25C28.225 23.221 26.7783 21.7742 24.9992 21.7742C23.2202 21.7742 21.7734 23.221 21.7734 25C21.7734 26.779 23.2202 28.2258 24.9992 28.2258C26.7783 28.2258 28.225 26.779 28.225 25ZM23.3863 25C23.3863 24.1105 24.1097 23.3871 24.9992 23.3871C25.8888 23.3871 26.6121 24.1105 26.6121 25C26.6121 25.8895 25.8888 26.6129 24.9992 26.6129C24.1097 26.6129 23.3863 25.8895 23.3863 25Z" fill="#FFBB25"/>
<path d="M21.0076 29.7984C21.453 29.7984 21.8141 29.4373 21.8141 28.9919C21.8141 28.5465 21.453 28.1855 21.0076 28.1855C20.5622 28.1855 20.2012 28.5465 20.2012 28.9919C20.2012 29.4373 20.5622 29.7984 21.0076 29.7984Z" fill="#FFBB25"/>
<path d="M28.992 29.7984C29.4374 29.7984 29.7984 29.4373 29.7984 28.9919C29.7984 28.5465 29.4374 28.1855 28.992 28.1855C28.5466 28.1855 28.1855 28.5465 28.1855 28.9919C28.1855 29.4373 28.5466 29.7984 28.992 29.7984Z" fill="#FFBB25"/>
<path d="M28.992 21.8145C29.4374 21.8145 29.7984 21.4534 29.7984 21.0081C29.7984 20.5627 29.4374 20.2016 28.992 20.2016C28.5466 20.2016 28.1855 20.5627 28.1855 21.0081C28.1855 21.4534 28.5466 21.8145 28.992 21.8145Z" fill="#FFBB25"/>
<path d="M21.0076 21.8145C21.453 21.8145 21.8141 21.4534 21.8141 21.0081C21.8141 20.5627 21.453 20.2016 21.0076 20.2016C20.5622 20.2016 20.2012 20.5627 20.2012 21.0081C20.2012 21.4534 20.5622 21.8145 21.0076 21.8145Z" fill="#FFBB25"/>
<path d="M25.0011 4.83871C13.8842 4.83871 4.83984 13.8831 4.83984 25C4.83984 36.1169 13.8842 45.1613 25.0011 45.1613C36.1181 45.1613 45.1624 36.1169 45.1624 25C45.1624 13.8831 36.1181 4.83871 25.0011 4.83871ZM43.5495 25C43.5495 26.4879 43.3689 27.9331 43.0366 29.3202L34.4931 26.8766C34.6124 26.2686 34.6786 25.6419 34.6786 25C34.6786 24.3581 34.6124 23.7315 34.4923 23.1234L43.0358 20.6798C43.3689 22.0669 43.5495 23.5121 43.5495 25ZM6.45275 25C6.45275 23.5121 6.63339 22.0669 6.96565 20.6798L15.5092 23.1234C15.3898 23.7315 15.3237 24.3581 15.3237 25C15.3237 25.6419 15.3898 26.2686 15.51 26.8766L6.96646 29.3202C6.63339 27.9331 6.45275 26.4879 6.45275 25ZM18.6382 17.7266L12.2495 11.5492C14.3415 9.56533 16.8915 8.06291 19.7253 7.22097L21.8826 15.8484C20.6761 16.2605 19.5786 16.9032 18.6382 17.7266ZM17.5116 18.8806C16.856 19.6815 16.335 20.5919 15.9608 21.575L7.41081 19.129C8.21242 16.7347 9.48742 14.5565 11.1277 12.7073L17.5116 18.8806ZM15.9616 28.425C16.3358 29.4081 16.8568 30.3194 17.5124 31.1194L11.1286 37.2927C9.48823 35.4436 8.21242 33.2653 7.41162 30.871L15.9616 28.425ZM18.6382 32.2734C19.5777 33.0968 20.6753 33.7395 21.8818 34.1516L19.7245 42.779C16.8906 41.9363 14.3406 40.4347 12.2487 38.4508L18.6382 32.2734ZM16.9366 25C16.9366 20.5532 20.5544 16.9355 25.0011 16.9355C29.4479 16.9355 33.0656 20.5532 33.0656 25C33.0656 29.4468 29.4479 33.0645 25.0011 33.0645C20.5544 33.0645 16.9366 29.4468 16.9366 25ZM32.4906 18.8806L38.8745 12.7073C40.5148 14.5565 41.7906 16.7347 42.5915 19.129L34.0406 21.575C33.6673 20.5919 33.1455 19.6815 32.4906 18.8806ZM31.364 17.7266C30.4245 16.9032 29.3269 16.2605 28.1205 15.8484L30.2777 7.22097C33.1116 8.06371 35.6616 9.56533 37.7536 11.5492L31.364 17.7266ZM31.364 32.2734L37.7527 38.4508C35.6608 40.4347 33.1108 41.9371 30.2769 42.779L28.1197 34.1516C29.3261 33.7395 30.4237 33.0968 31.364 32.2734ZM32.4906 31.1194C33.1463 30.3186 33.6673 29.4081 34.0415 28.425L42.5923 30.871C41.7906 33.2653 40.5156 35.4436 38.8753 37.2927L32.4906 31.1194ZM28.714 6.82581L26.5552 15.4597C26.0479 15.3766 25.531 15.3226 25.0011 15.3226C24.4713 15.3226 23.9544 15.3766 23.4471 15.4589L21.2882 6.82581C22.4882 6.58065 23.7302 6.45162 25.0011 6.45162C26.2721 6.45162 27.514 6.58065 28.714 6.82581ZM21.2882 43.1742L23.4471 34.5403C23.9544 34.6234 24.4713 34.6774 25.0011 34.6774C25.531 34.6774 26.0479 34.6234 26.5552 34.5411L28.714 43.175C27.514 43.4194 26.2721 43.5484 25.0011 43.5484C23.7302 43.5484 22.4882 43.4194 21.2882 43.1742Z" fill="#FFBB25"/>
</svg>
