<svg width="100" height="100" viewBox="0 0 100 100" fill="none" xmlns="http://www.w3.org/2000/svg">
<path d="M50.0002 48.3333C47.2432 48.3333 45.0002 50.5763 45.0002 53.3333C45.0002 56.0904 47.2432 58.3333 50.0002 58.3333C52.7573 58.3333 55.0003 56.0904 55.0003 53.3333C55.0003 50.5763 52.7573 48.3333 50.0002 48.3333ZM50.0002 55C49.0807 55 48.3336 54.2521 48.3336 53.3333C48.3336 52.4146 49.0807 51.6667 50.0002 51.6667C50.9198 51.6667 51.6669 52.4146 51.6669 53.3333C51.6669 54.2521 50.9198 55 50.0002 55Z" fill="#494949"/>
<path d="M87.6806 86.18C95.6413 77.0662 100 65.4906 100 53.3333C100 25.7633 77.57 3.33331 50 3.33331C22.43 3.33331 0 25.7633 0 53.3333C0 65.1968 4.15208 76.512 11.7546 85.5225C9.73792 86.4412 8.33333 88.4766 8.33333 90.8333C8.33333 94.0495 10.9506 96.6666 14.1667 96.6666H84.1667C87.3829 96.6666 90 94.0493 90 90.8333C90 88.9348 89.0885 87.246 87.6806 86.18ZM84.1667 93.3333H28.1142L29.72 90.9243L26.9465 89.0754L24.1081 93.3333H14.1667C12.7881 93.3333 11.6667 92.2118 11.6667 90.8333C11.6667 89.4548 12.7881 88.3333 14.1667 88.3333H15.0196H20V85H15.7558C13.9206 83.0175 12.2696 80.9045 10.8227 78.6766L14.2577 76.3866L12.4087 73.6131L9.11354 75.81C5.6125 69.4643 3.63292 62.3668 3.37292 55H8.33333V51.6666H3.37562C3.64146 44.1456 5.68771 37.0721 9.11708 30.8589L12.409 33.0535L14.2579 30.28L10.8387 28.0006C14.4246 22.4764 19.1431 17.7579 24.6673 14.1721L26.9467 17.5912L29.7202 15.7423L27.5256 12.4504C33.7388 9.02123 40.8123 6.97477 48.3333 6.70894V9.99998H51.6667V6.70894C59.1877 6.97477 66.2613 9.02102 72.4744 12.4504L70.2798 15.7423L73.0533 17.5912L75.3327 14.1721C80.8569 17.7579 85.5754 22.4764 89.1612 28.0006L85.7421 30.28L87.591 33.0535L90.8829 30.8589C94.3121 37.0721 96.3585 44.1456 96.6244 51.6666H91.6667V55H96.6277C96.3679 62.3696 94.3921 69.4683 90.891 75.8133L87.591 73.6133L85.7421 76.3868L89.1723 78.6737C87.7269 80.8991 86.0929 83.0193 84.26 85.0002H73.3333V88.3335H84.1667C84.3181 88.3335 84.4662 88.3548 84.6094 88.3814C84.6533 88.3887 84.6973 88.3952 84.7396 88.3993C85.8431 88.6598 86.6667 89.6518 86.6667 90.8335C86.6667 92.2118 85.5452 93.3333 84.1667 93.3333Z" fill="#494949"/>
<path d="M50.0003 18.3333C30.7017 18.3333 15.0002 34.034 15.0002 53.3333C15.0002 72.6327 30.7017 88.3333 50.0003 88.3333C69.2988 88.3333 85.0003 72.6327 85.0003 53.3333C85.0003 34.034 69.2988 18.3333 50.0003 18.3333ZM76.4273 35.9298C78.5544 39.1492 80.109 42.7744 80.9469 46.6667H70.5959C70.2117 45.4752 69.7234 44.3221 69.1392 43.2177L76.4273 35.9298ZM56.6669 22.3867C60.5592 23.2246 64.1844 24.7792 67.4038 26.9063L60.1159 34.1942C59.0107 33.6098 57.8567 33.1223 56.6669 32.7375V22.3867ZM43.3336 22.3867V32.7383C42.1438 33.1225 40.9898 33.61 39.8846 34.1942L32.5967 26.9063C35.8161 24.7792 39.4413 23.2246 43.3336 22.3867ZM23.5732 35.9298L30.8611 43.2177C30.2767 44.3221 29.7886 45.4752 29.4044 46.6667H19.0536C19.8915 42.7744 21.4461 39.1492 23.5732 35.9298ZM23.5732 70.7369C21.4461 67.5175 19.8915 63.8923 19.0536 60H29.4046C29.7888 61.1906 30.2771 62.3438 30.8613 63.449L23.5732 70.7369ZM43.3336 84.28C39.4413 83.4421 35.8161 81.8875 32.5967 79.7604L39.8846 72.4725C40.9898 73.0569 42.1438 73.5444 43.3336 73.9283V84.28ZM56.6669 84.28V73.9283C57.8567 73.5442 59.0107 73.0567 60.1159 72.4725L67.4038 79.7604C64.1844 81.8875 60.5592 83.4421 56.6669 84.28ZM76.4273 70.7369L69.1394 63.449C69.7238 62.3438 70.2119 61.1906 70.5961 60H80.9471C80.109 63.8923 78.5544 67.5175 76.4273 70.7369ZM69.3444 56.6667C68.5844 56.6667 67.9203 57.181 67.7298 57.9175C67.2807 59.6623 66.5775 61.3256 65.64 62.8598C65.2396 63.5165 65.339 64.3629 65.8842 64.9073L74.4332 73.4563C73.1373 75.0267 71.6938 76.4704 70.1232 77.7663L61.5742 69.2173C61.029 68.6713 60.1842 68.5711 59.5267 68.9731C57.9902 69.9115 56.3284 70.6146 54.5853 71.0638C53.848 71.2533 53.3336 71.9175 53.3336 72.6775V84.821C52.2375 84.9363 51.1263 85.0002 50.0003 85.0002C48.8742 85.0002 47.763 84.9363 46.6669 84.821V72.6775C46.6669 71.9175 46.1525 71.2533 45.4153 71.0638C43.6721 70.6146 42.0102 69.9115 40.4738 68.9731C39.8146 68.5711 38.9698 68.6713 38.4263 69.2173L29.8773 77.7663C28.3069 76.4704 26.8632 75.0269 25.5673 73.4563L34.1163 64.9073C34.6615 64.3629 34.7609 63.5165 34.3605 62.8598C33.423 61.3258 32.7198 59.6623 32.2707 57.9175C32.0802 57.181 31.4161 56.6667 30.6561 56.6667H18.5127C18.3975 55.5706 18.3336 54.4594 18.3336 53.3333C18.3336 52.2073 18.3975 51.0961 18.5127 50H30.6563C31.4163 50 32.0805 49.4856 32.2709 48.7492C32.72 47.0027 33.4232 45.3402 34.3607 43.8069C34.7611 43.1502 34.6617 42.3038 34.1165 41.7594L25.5675 33.2104C26.8634 31.64 28.3069 30.1963 29.8775 28.9004L38.4265 37.4494C38.7471 37.7708 39.1752 37.9377 39.6048 37.9377C39.9044 37.9377 40.2038 37.8579 40.474 37.6936C42.0105 36.7552 43.6723 36.0521 45.4155 35.6029C46.1528 35.4133 46.6671 34.7492 46.6671 33.9892V21.8458C47.7632 21.7306 48.8744 21.6667 50.0005 21.6667C51.1265 21.6667 52.2378 21.7306 53.3338 21.8458V33.9886C53.3338 34.7486 53.8482 35.4127 54.5838 35.6023C56.3286 36.0523 57.9919 36.7563 59.5269 37.6938C59.7971 37.8581 60.0965 37.9379 60.3961 37.9379C60.8259 37.9379 61.2538 37.7711 61.5744 37.4496L70.1234 28.9006C71.6938 30.1965 73.1375 31.64 74.4334 33.2106L65.8844 41.7596C65.3392 42.304 65.2398 43.1504 65.6403 43.8071C66.5778 45.3402 67.2809 47.0029 67.73 48.7494C67.9205 49.4858 68.5846 50.0002 69.3446 50.0002H81.4882C81.6034 51.0963 81.6673 52.2075 81.6673 53.3336C81.6673 54.4596 81.6034 55.5708 81.4882 56.6669H69.3444V56.6667Z" fill="#494949"/>
<path d="M49.9996 38.3333C41.7282 38.3333 34.9996 45.0627 34.9996 53.3333C34.9996 61.604 41.7282 68.3334 49.9996 68.3334C58.2711 68.3334 64.9996 61.604 64.9996 53.3333C64.9996 45.0627 58.2711 38.3333 49.9996 38.3333ZM49.9996 65C43.5673 65 38.333 59.7665 38.333 53.3333C38.333 46.9002 43.5673 41.6667 49.9996 41.6667C56.4319 41.6667 61.6663 46.9002 61.6663 53.3333C61.6663 59.7665 56.4319 65 49.9996 65Z" fill="#494949"/>
</svg>
