<svg xmlns="http://www.w3.org/2000/svg" width="38" height="41.594" viewBox="0 0 38 41.594">
  <g transform="translate(0 0)">
    <path d="M18,0A18.255,18.255,0,0,1,36,18.5,18.255,18.255,0,0,1,18,37c-2.157,0-3.758-.295-6.9-.12C5.013,32.425,0,26.5,0,18.5A18.255,18.255,0,0,1,18,0Z" transform="translate(1 0)" fill="#7d519e"/>
    <path d="M24.224,18.428a1.224,1.224,0,0,0,0,.442.52.52,0,0,0,.988,0,1.066,1.066,0,0,0,0-.26h0v-1.17a6.212,6.212,0,0,0-3.327-4.861,7.8,7.8,0,0,0-3.067-.806.52.52,0,0,0-.624.494.494.494,0,0,0,.494.572h.806a6.264,6.264,0,0,1,1.767.52,5.485,5.485,0,0,1,2.209,2.079,5.822,5.822,0,0,1,.754,2.989Z" fill="#fff"/>
    <path d="M19.572,14.348a.572.572,0,0,0-.6.442.546.546,0,0,0,.442.624h.39a2.938,2.938,0,0,1,.468.182,1.766,1.766,0,0,1,.52.26,1.949,1.949,0,0,1,.78,1.222,5.193,5.193,0,0,1,0,.624.6.6,0,0,0,.65.572.442.442,0,0,0,.416-.364,1.247,1.247,0,0,0,0-.442,3.2,3.2,0,0,0-3.067-3.119Z" fill="#fff"/>
    <path d="M25.16,23.965a19.387,19.387,0,0,0-1.767-1.248,1.534,1.534,0,0,0-1.819,0,2.964,2.964,0,0,0-.52.6,1.689,1.689,0,0,1-1.092.832,2.287,2.287,0,0,1-1.17-.286h0a9.071,9.071,0,0,1-5.25-5.666,1.143,1.143,0,0,1,0-1.014,2.1,2.1,0,0,1,.416-.416h0l.442-.338a1.611,1.611,0,0,0,.442-2.183,19.49,19.49,0,0,0-2.417-3.379,1.222,1.222,0,0,0-1.559-.364,5.408,5.408,0,0,0-1.949,1.455,2.6,2.6,0,0,0-.754,2.469l.13.312c.364.884.728,1.741,1.144,2.6A23.6,23.6,0,0,0,13.178,22.9a25.212,25.212,0,0,0,9.461,6.342l.728.234h.728a2.081,2.081,0,0,0,.676-.234,5.38,5.38,0,0,0,2.287-2.6,1.3,1.3,0,0,0-.39-1.611,16.04,16.04,0,0,0-1.507-1.066Z" fill="#fff"/>
    <path d="M27.551,17.129a9.487,9.487,0,0,0-9.357-7.85H17.96a.572.572,0,0,0-.546.65c0,.39.442.442.78.468h.494a7.794,7.794,0,0,1,1.092.13,8.317,8.317,0,0,1,6.706,6.966,5.391,5.391,0,0,0,.156,1.586v.39c0,.13.208.65.572.65a.572.572,0,0,0,.52-.676v-.208a19.325,19.325,0,0,0-.182-2.105Z" fill="#fff"/>
    <path d="M22.951,0h-7.8A15.049,15.049,0,0,0,0,15.05v7.122a15.1,15.1,0,0,0,9.487,14.01v4.627a.754.754,0,0,0,.468.7.728.728,0,0,0,.442.078.832.832,0,0,0,.52-.208l.65-.572.546-.52,3.327-3.015h7.538A15.075,15.075,0,0,0,38,22.223V15.05A15.075,15.075,0,0,0,22.951,0ZM35.375,22.171a12.45,12.45,0,0,1-12.424,12.45H14.4l-.754.676-1.56,1.43V34.413L10.4,33.79A12.5,12.5,0,0,1,2.6,22.171V15.05A12.45,12.45,0,0,1,15.023,2.6h7.927A12.45,12.45,0,0,1,35.375,15.05Z" fill="#fff"/>
  </g>
</svg>
