<svg class="svg" width="24" height="25" viewBox="0 0 24 25" fill="none" xmlns="http://www.w3.org/2000/svg">
<path fill-rule="evenodd" clip-rule="evenodd" d="M24 12.3309C24 18.9583 18.6274 24.3309 12 24.3309C5.37258 24.3309 0 18.9583 0 12.3309C0 5.70352 5.37258 0.330933 12 0.330933C18.6274 0.330933 24 5.70352 24 12.3309ZM4.50977 11.6568L10.7985 18.0244L10.936 18.1692L19.4898 10.0175L17.7667 8.2096L11.0247 14.7782L6.22529 9.91888L4.50977 11.6568Z" fill="#669ED9"/>
</svg>
