<svg xmlns="http://www.w3.org/2000/svg" fill="#fff"  width="38" height="38.044" viewBox="0 0 38 38.044">
  <g transform="translate(-832 -906)">
    <path d="M35.4,19.022A16.4,16.4,0,1,1,19,2.6,16.41,16.41,0,0,1,35.4,19.022Zm2.6,0A19,19,0,1,1,19,0,19.011,19.011,0,0,1,38,19.022Z" transform="translate(832 906)" fill-rule="evenodd"/>
    <path d="M18.32,9.535c2.7-2.16.539-5.53-2.442-5.11,1.474-3.843-4.56-6.236-6.452-2.7-2.582-2.985-6.869.137-4.576,3.3C.388,3.836-1.865,9.536,1.917,10.809c-1.892,1.742-.425,4.651,2.266,4.338-2.318,4.244,4.953,6.986,6.369,2.692a2.681,2.681,0,0,0,4.584-2.289c4.094,1.887,6.773-4.193,3.184-6.015Zm-10.379.544a1.714,1.714,0,1,1,1.713,1.662,1.691,1.691,0,0,1-1.713-1.662Zm9-4.248a1.379,1.379,0,0,1,.892,2.246,2.135,2.135,0,0,1-1.544.892c-1.107.131-3.085.353-3.778.43a2.768,2.768,0,0,0-.231-.6c.151-.144,1.944-1.858,2.977-2.677l.007-.005a1.8,1.8,0,0,1,1.678-.283ZM11.184,1.748a2.329,2.329,0,0,1,3.455,1.089,1.943,1.943,0,0,1-.457,1.778l-.006.007c-.7.858-2.087,2.361-2.812,3.143a2.934,2.934,0,0,0-.608-.324c-.061-.842-.213-2.9-.306-3.965A1.858,1.858,0,0,1,11.184,1.748Zm-5.5,1c.309-.956,1.441-1.039,2.284-.495a1.793,1.793,0,0,1,.824,1.327c.128,1.014.279,2.91.34,3.7a2.981,2.981,0,0,0-.638.187c-.515-.689-1.681-2.237-2.4-3.076A1.721,1.721,0,0,1,5.68,2.746ZM3.235,6.291a2.7,2.7,0,0,1,2.376.648,19.333,19.333,0,0,1,1.578,1.6,2.773,2.773,0,0,0-.313.629c-.613.1-2.272.364-3.542.477C.732,9.834.781,6.787,3.235,6.291ZM8.608,18.284a2.31,2.31,0,0,1-3.386-1.1,1.984,1.984,0,0,1,.469-1.815l.006-.008c.651-.8,1.842-2.041,2.559-2.778a2.989,2.989,0,0,0,.673.256c.1.887.288,2.618.393,3.741A1.843,1.843,0,0,1,8.608,18.284Zm5.09-1.889a1.233,1.233,0,0,1-1.877.732,2.151,2.151,0,0,1-.851-1.574c-.111-.883-.247-2.092-.326-2.793a2.967,2.967,0,0,0,.507-.231c.587.576,1.582,1.575,2.176,2.278l0,.006A1.637,1.637,0,0,1,13.7,16.395Zm3.39-1.925a2.142,2.142,0,0,1-1.872-.455l-.008-.006c-.834-.642-2.211-1.809-3.018-2.5a2.763,2.763,0,0,0,.278-.627c.991-.091,2.882-.262,4.035-.357a1.908,1.908,0,0,1,1.729.66A2.2,2.2,0,0,1,17.088,14.47Z" transform="translate(841 915)"/>
  </g>
</svg>
