<svg class="svg" width="12" height="20" viewBox="0 0 12 20" fill="#2C2C2C" xmlns="http://www.w3.org/2000/svg">
    <path d="M5.07106 13.8569C3.60806 13.7043 2.28894 13.344 1.15957 12.4607C1.01944 12.3508 0.87476 12.2449 0.746881 12.1222C0.252559 11.6474 0.202751 11.1037 0.5939 10.5433C0.928521 10.0638 1.49024 9.93556 2.0741 10.2109C2.18715 10.2643 2.29487 10.3309 2.39805 10.4024C4.50282 11.8486 7.39424 11.8885 9.50692 10.4674C9.71623 10.3069 9.93997 10.1761 10.1993 10.1093C10.7035 9.97983 11.1737 10.165 11.4443 10.6062C11.7534 11.11 11.7494 11.6017 11.3686 11.9929C10.7843 12.5926 10.0817 13.0264 9.30097 13.3292C8.56274 13.6154 7.75416 13.7595 6.95387 13.8552C7.07464 13.9866 7.13156 14.0512 7.20706 14.1271C8.29374 15.2189 9.38516 16.3062 10.4683 17.4014C10.8373 17.7745 10.9144 18.2372 10.7112 18.6713C10.489 19.1456 9.99175 19.4577 9.50415 19.4243C9.19522 19.403 8.95429 19.2492 8.74023 19.0336C7.92018 18.2084 7.08472 17.3984 6.28127 16.5576C6.04745 16.3131 5.93499 16.3594 5.72864 16.5717C4.90365 17.421 4.06522 18.2572 3.22185 19.0887C2.84315 19.4621 2.39251 19.5293 1.95334 19.316C1.48649 19.0897 1.18942 18.6132 1.21235 18.1343C1.22816 17.8103 1.38746 17.5629 1.60982 17.3409C2.68523 16.2671 3.75768 15.1905 4.83052 14.1149C4.90148 14.0433 4.96769 13.9674 5.07106 13.8569Z"/>
    <path d="M5.96251 10.1162C3.35255 10.1073 1.2124 7.94363 1.22762 5.32952C1.24264 2.68654 3.38418 0.556671 6.01983 0.563984C8.66083 0.571099 10.7806 2.73161 10.7674 5.40205C10.7539 8.01083 8.59896 10.1253 5.96251 10.1162ZM8.33451 5.33584C8.32996 4.03787 7.29625 3.00456 6.00086 3.00338C4.69459 3.00199 3.6516 4.05408 3.66168 5.36391C3.67136 6.65693 4.71396 7.68293 6.01292 7.67819C7.30792 7.67364 8.33886 6.63361 8.33451 5.33584Z"/>
</svg>
