<svg class="svg company" xmlns="http://www.w3.org/2000/svg" fill="#c5d1d9" viewBox="0 0 17 19">
  <g transform="translate(-4918.5 587.5)">
    <path d="M261.5,47.7h-15a1.075,1.075,0,0,0-1,1v18h7v-4h3v4h7v-18A1,1,0,0,0,261.5,47.7Zm-11,13h-3v-2h3Zm0-4h-3v-2h3Zm0-4h-3v-2h3Zm6,8h-5v-2h5Zm0-4h-5v-2h5Zm0-4h-5v-2h5Zm4,8h-3v-2h3Zm0-4h-3v-2h3Zm0-4h-3v-2h3Z" transform="translate(4673 -635.2)"/>
  </g>
</svg>
