<svg width="10" height="10" viewBox="0 0 10 10" class="svg" xmlns="http://www.w3.org/2000/svg">
<path fill-rule="evenodd" clip-rule="evenodd" d="M0 0H3.4375V1.25H1.25V8.75H8.75V6.5625H10V10H0V0ZM6.25 0H10V3.75H8.75V2.06801L3.97151 6.8465L3.125 6L7.875 1.25H6.25V0Z"/>
</svg>
