<svg class="svg" width="40" height="39" viewBox="0 0 40 39" xmlns="http://www.w3.org/2000/svg">
    <path d="M25.3621 13.247L26.5768 13.9451L25.875 15.1544L24.6603 14.4563L25.3621 13.247Z"/>
    <path fill-rule="evenodd" clip-rule="evenodd"
          d="M20.352 23.2687C21.1639 23.735 22.1143 23.7509 22.9105 23.3945C23.4266 23.1624 23.8798 22.7726 24.1851 22.2465C24.9592 20.9128 24.4998 19.2017 23.1591 18.4316C21.8185 17.6615 20.0971 18.1201 19.3229 19.4538C18.5487 20.7877 19.0113 22.4986 20.352 23.2687ZM21.0538 22.0594C20.3834 21.6745 20.1537 20.8188 20.5376 20.1521L20.5943 20.0622C20.6289 20.0076 20.6698 19.9562 20.7139 19.9084L20.8335 19.7941C20.9153 19.7235 21.0065 19.6634 21.101 19.6143C21.1891 19.5693 21.2803 19.5335 21.3748 19.5072C21.4345 19.4902 21.4975 19.4773 21.5604 19.4685L21.702 19.4554C21.7996 19.4513 21.9003 19.4577 22.001 19.4751C22.1584 19.5025 22.3126 19.5571 22.4573 19.6409C22.7437 19.8061 22.9514 20.0579 23.0616 20.3443C23.2095 20.7253 23.1906 21.1676 22.9703 21.5484C22.5832 22.2152 21.7241 22.4446 21.0538 22.0594Z"/>
    <path fill-rule="evenodd" clip-rule="evenodd"
          d="M18.9484 25.6876C21.6297 27.2274 25.0694 26.3101 26.6177 23.6431C28.1661 20.976 27.244 17.5531 24.5627 16.0133C21.8814 14.4735 18.4417 15.3906 16.8965 18.0576C15.3482 20.7247 16.2702 24.1476 18.9484 25.6876ZM19.6502 24.4781C17.6424 23.3231 16.95 20.7566 18.1113 18.7559C19.2725 16.7552 21.85 16.0675 23.8609 17.2226C25.8719 18.3778 26.5642 20.9443 25.403 22.945C24.2417 24.9457 21.6611 25.6334 19.6502 24.4781Z"/>
    <path d="M28.7672 21.6236L28.4745 22.9894L29.8466 23.2796L30.1393 21.914L28.7672 21.6236Z"/>
    <path d="M21.9412 29.2574L21.7933 27.8687L23.1875 27.7227L23.3354 29.1114L21.9412 29.2574Z"/>
    <path d="M13.7778 23.6205L14.3474 24.8961L15.6314 24.3282L15.0586 23.0526L13.7778 23.6205Z"/>
    <path d="M16.5377 16.1296L15.5999 15.0919L16.6416 14.1575L17.5826 15.1951L16.5377 16.1296Z"/>
    <path fill-rule="evenodd" clip-rule="evenodd"
          d="M13.3403 35.3624C9.34359 33.0664 6.52698 29.3473 5.41607 24.8887L4.0534 25.2257C5.25872 30.0547 8.30821 34.0845 12.6385 36.5717C21.3496 41.5762 32.531 38.5955 37.56 29.9275C42.589 21.2594 39.593 10.1351 30.882 5.13058C26.7719 2.76902 21.9695 2.09521 17.3654 3.23342L17.7021 4.58848C21.9538 3.53833 26.3849 4.16028 30.1802 6.33984C31.6027 7.15828 32.8583 8.15696 33.9409 9.285C31.4831 10.5496 28.6696 10.9526 25.9474 10.3988L25.5194 10.3324C22.1112 9.12569 18.3662 9.65781 15.4552 11.6149C15.7006 10.8111 15.8769 9.98405 15.9681 9.13489L14.574 8.98713C14.4733 9.92143 14.2656 10.8301 13.9572 11.7049C13.7211 12.3769 13.4222 13.0292 13.0634 13.658L12.862 14.0557C12.5662 14.4391 12.2861 14.8371 12.0375 15.2657C10.4451 18.0103 10.1681 21.1527 10.9958 23.9781C10.4199 23.5771 9.81564 23.2082 9.17365 22.8964L8.55683 24.1519C9.93523 24.8206 11.1626 25.7302 12.198 26.8575L12.5284 27.1835C13.4442 28.5112 14.6527 29.6676 16.1475 30.5254C17.806 31.4795 19.6124 31.9597 21.4062 32.0129C19.6753 33.3163 18.2655 35.026 17.3245 37.0165C15.9618 36.6457 14.6212 36.0987 13.3403 35.3624ZM16.8462 29.3161C12.157 26.6211 10.5426 20.6317 13.2522 15.964C15.9618 11.2963 21.979 9.69128 26.6712 12.3863C31.3635 15.0812 32.9748 21.0705 30.2683 25.7385C27.5587 30.4062 21.5384 32.011 16.8462 29.3161ZM28.6256 12.0276C30.8002 11.9879 32.9527 11.4295 34.8913 10.3684C39.0045 15.4822 39.8668 22.7395 36.5781 28.8024C34.6112 26.8681 33.3556 24.3288 33.044 21.5842L32.9779 21.1821C33.0786 17.6891 31.5145 14.2514 28.6256 12.0276ZM35.8386 30.0408C32.0621 35.7771 25.2362 38.5074 18.7375 37.3332C19.9775 34.873 22.0168 32.8991 24.547 31.7558L24.9718 31.5387C27.6216 30.7508 29.9914 29.0038 31.4831 26.4365C31.823 25.8494 32.0936 25.2422 32.317 24.6263C33.0251 26.6698 34.2273 28.5345 35.8386 30.0408Z"/>
    <path fill-rule="evenodd" clip-rule="evenodd"
          d="M1.56371 26.685C1.37803 26.7392 1.17977 26.7167 1.00983 26.6204C0.918565 26.5689 0.843036 26.4989 0.783242 26.4161C0.736037 26.348 0.701419 26.2712 0.67939 26.1889C-0.727341 20.6833 0.0657152 14.9445 2.91694 10.0293C5.77131 5.11422 10.3692 1.55984 15.8639 0.021602C16.0496 -0.0300639 16.251 0.0178837 16.4083 0.0922514C16.5751 0.188734 16.6916 0.348037 16.7356 0.533369L18.4917 7.94333C18.5326 8.11614 18.5074 8.29853 18.4162 8.45255L18.3501 8.56567C18.2651 8.71695 18.1235 8.82967 17.9535 8.88193C14.9292 9.83246 12.3927 11.8514 10.8192 14.5675C9.24251 17.2835 8.75157 20.4776 9.43763 23.5596C9.44707 23.604 9.45336 23.649 9.45336 23.6938C9.45651 23.7568 9.44707 23.8199 9.43133 23.8809C9.4156 23.9431 9.39357 24.0034 9.3621 24.06L9.29601 24.1731C9.27083 24.2126 9.24566 24.2494 9.21419 24.2833C9.17642 24.3259 9.13236 24.3637 9.0883 24.3962C9.02851 24.4385 8.96242 24.4714 8.89004 24.4933L1.56371 26.685ZM6.30946 11.1709L5.0947 10.4728L4.39291 11.6821L5.60767 12.3801L6.30946 11.1709ZM0.399302 23.6885L6.38499 22.3697L6.34722 21.7747C6.17728 18.9965 6.76893 16.224 8.06237 13.7567L6.81928 13.1113C5.50067 15.6267 4.84923 18.4321 4.92161 21.2622L0.0971857 22.3255L0.399302 23.6885ZM14.8568 7.11198C12.3518 8.35294 10.237 10.2505 8.73583 12.5991L7.5494 11.8496C9.08201 9.45554 11.1968 7.49086 13.6956 6.13874L12.2102 1.45064L13.5477 1.03046L15.3918 6.84621L14.8568 7.11198Z"/>
</svg>
