<svg class="svg menu-open" width="35" height="26" viewBox="0 0 35 26" xmlns="http://www.w3.org/2000/svg">
    <rect width="35" height="4.81482" rx="2.40741"/>
    <rect y="10.5927" width="35" height="4.81482" rx="2.40741"/>
    <rect y="21.1852" width="35" height="4.81482" rx="2.40741"/>
</svg>
