<svg xmlns="http://www.w3.org/2000/svg" viewBox="5236 -2602 40 40">
    <defs>
        <style>.cls-2 { fill: none; stroke-miterlimit: 10; }</style>
    </defs>
    <g transform="translate(5024.084 -2956.825)">
        <path class="cls-2" stroke="#000"
              d="M66.668,7.667H65.487c-3.459,0-7.086-4.3-7.086-4.3a.473.473,0,0,0-.759,0s-3.712,4.3-7.086,4.3H49.29a.577.577,0,0,0-.59.591V19.308c0,.337.084.844.084,1.1a10.094,10.094,0,0,0,.253,1.181,7.727,7.727,0,0,0,1.35,2.193,15.089,15.089,0,0,0,2.362,2.278,26.054,26.054,0,0,0,3.965,2.615,3.21,3.21,0,0,0,1.265.422,2.809,2.809,0,0,0,1.265-.422,25.34,25.34,0,0,0,3.206-2.109,17.8,17.8,0,0,0,1.94-1.6,4.421,4.421,0,0,0,.844-.928A5.542,5.542,0,0,0,66.246,22.6a3.876,3.876,0,0,0,.591-1.35,2.551,2.551,0,0,0,.169-.844V8.342A.456.456,0,0,0,66.668,7.667Zm0,0H65.487c-3.459,0-7.086-4.3-7.086-4.3a.473.473,0,0,0-.759,0s-3.712,4.3-7.086,4.3H49.29a.577.577,0,0,0-.59.591V19.308c0,.337.084.844.084,1.1a10.094,10.094,0,0,0,.253,1.181,7.727,7.727,0,0,0,1.35,2.193,15.089,15.089,0,0,0,2.362,2.278,26.054,26.054,0,0,0,3.965,2.615,3.21,3.21,0,0,0,1.265.422,2.809,2.809,0,0,0,1.265-.422,25.34,25.34,0,0,0,3.206-2.109,17.8,17.8,0,0,0,1.94-1.6,4.421,4.421,0,0,0,.844-.928A5.542,5.542,0,0,0,66.246,22.6a3.876,3.876,0,0,0,.591-1.35,2.551,2.551,0,0,0,.169-.844V8.342A.456.456,0,0,0,66.668,7.667Z"
              transform="translate(174.466 358.919)"/>
        <path class="cls-2" stroke="#000"
              d="M64.252,9.833h-.87c-2.531,0-5.142-3.164-5.142-3.164a.382.382,0,0,0-.554,0S55,9.833,52.466,9.833H51.6a.374.374,0,0,0-.4.4V18.3a2.439,2.439,0,0,0,.079.791,4.9,4.9,0,0,0,.237.87,6.466,6.466,0,0,0,.949,1.582,8.667,8.667,0,0,0,1.74,1.661,21.906,21.906,0,0,0,2.848,1.9,1.7,1.7,0,0,0,.949.316,1.938,1.938,0,0,0,.949-.316,17.4,17.4,0,0,0,2.373-1.582,9.429,9.429,0,0,0,1.424-1.187l.633-.633a8.954,8.954,0,0,0,.791-1.028l.475-.949a2.963,2.963,0,0,0,.079-.633V10.307A.713.713,0,0,0,64.252,9.833Zm-4.43,9.1-1.9-.949-1.9.949.316-2.136-1.5-1.5,2.057-.316.949-1.9.949,1.9,2.136.316-1.5,1.5Zm4.43-9.1h-.87c-2.531,0-5.142-3.164-5.142-3.164a.382.382,0,0,0-.554,0S55,9.833,52.466,9.833H51.6a.374.374,0,0,0-.4.4V18.3a2.439,2.439,0,0,0,.079.791,4.9,4.9,0,0,0,.237.87,6.466,6.466,0,0,0,.949,1.582,8.667,8.667,0,0,0,1.74,1.661,21.906,21.906,0,0,0,2.848,1.9,1.7,1.7,0,0,0,.949.316,1.938,1.938,0,0,0,.949-.316,17.4,17.4,0,0,0,2.373-1.582,9.429,9.429,0,0,0,1.424-1.187l.633-.633a8.954,8.954,0,0,0,.791-1.028l.475-.949a2.963,2.963,0,0,0,.079-.633V10.307A.713.713,0,0,0,64.252,9.833Zm-4.43,9.1-1.9-.949-1.9.949.316-2.136-1.5-1.5,2.057-.316.949-1.9.949,1.9,2.136.316-1.5,1.5Z"
              transform="translate(174.319 359.303)"/>
    </g>
</svg>