<svg width="33" height="32" viewBox="0 0 33 32" fill="none" xmlns="http://www.w3.org/2000/svg">
<path d="M16.0703 32C24.9069 32 32.0703 24.8366 32.0703 16C32.0703 7.16344 24.9069 0 16.0703 0C7.23376 0 0.0703125 7.16344 0.0703125 16C0.0703125 24.8366 7.23376 32 16.0703 32Z" fill="#3B5998"/>
<path d="M20.0923 16.6262H17.2373V27.0856H12.9117V16.6262H10.8545V12.9504H12.9117V10.5717C12.9117 8.87066 13.7198 6.20703 17.2758 6.20703L20.4799 6.22044V9.78848H18.1551C17.7738 9.78848 17.2376 9.979 17.2376 10.7904V12.9538H20.4702L20.0923 16.6262Z" fill="white"/>
</svg>
