<svg width="80" height="80" viewBox="0 0 80 80" fill="none" xmlns="http://www.w3.org/2000/svg">
<path fill-rule="evenodd" clip-rule="evenodd" d="M72.2581 38.2321V30.9677H38.7097V38.2321L37.2581 39.925L29.6774 37.7394V35.1418C31.0415 34.0467 32.1201 32.6128 32.7886 30.9677H33.5484C36.3949 30.9677 38.7097 28.653 38.7097 25.8065V15.4839C38.7097 6.94556 31.7641 0 23.2258 0C14.6875 0 7.74194 6.94556 7.74194 15.4839V25.8065C7.74194 28.653 10.0567 30.9677 12.9032 30.9677H13.6631C14.3315 32.6128 15.4102 34.0467 16.7742 35.1418V37.7394L6.52911 40.6956C2.68523 41.8025 0 45.3717 0 49.3731V56.7742H30.9677V80H80V47.2644L72.2581 38.2321ZM33.5485 51.0049L47.2128 65.5809L33.5485 76.0906V51.0049ZM55.4838 69.6774C53.1458 69.6774 50.8814 68.854 49.0751 67.4023L36.0515 77.4194H74.9162L61.8926 67.4023C60.0863 68.854 57.8219 69.6774 55.4838 69.6774ZM63.755 65.5809L77.4193 51.0049V76.0906L63.755 65.5809ZM72.2582 52.7368L76.9772 47.7034L72.2582 42.1975V52.7368ZM69.6774 33.5483V55.4901L61.0603 64.6812C59.6219 66.2153 57.5894 67.0967 55.4838 67.0967C53.3782 67.0967 51.3457 66.2153 49.9073 64.6799L41.2903 55.4901V33.5483H69.6774ZM33.9906 47.7034L38.7096 52.7368V42.1975L33.9906 47.7034ZM33.5483 28.3874H33.4595C33.5124 27.964 33.5483 27.5343 33.5483 27.097V23.2261C34.9716 23.2261 36.129 24.3835 36.129 25.8067C36.129 27.23 34.9716 28.3874 33.5483 28.3874ZM36.1291 15.4838C36.1291 8.36875 30.3409 2.58057 23.2259 2.58057C16.1108 2.58057 10.3226 8.36875 10.3226 15.4838V21.3627C11.085 20.9185 11.9588 20.6451 12.9033 20.6451V15.4838H15.4839V17.9832C17.9783 17.6978 20.2905 16.5946 22.0918 14.792L23.2259 13.6617L24.3587 14.7907C26.1612 16.5946 28.4722 17.6978 30.9678 17.9832V15.4838H33.5484V20.6451C34.4929 20.6451 35.3667 20.9185 36.1291 21.3627V15.4838ZM12.9033 28.3874C11.48 28.3874 10.3226 27.23 10.3226 25.8067C10.3226 24.3835 11.48 23.2261 12.9033 23.2261V27.097C12.9033 27.5343 12.9392 27.964 12.9921 28.3874H12.9033ZM15.4839 20.5848V27.0969C15.4839 31.3666 18.956 34.8388 23.2258 34.8388C27.4956 34.8388 30.9678 31.3666 30.9678 27.0969V20.5848C28.0929 20.3189 25.4064 19.1678 23.2258 17.2632C21.0465 19.1691 18.3588 20.3189 15.4839 20.5848ZM23.2257 37.4193C24.5948 37.4193 25.9009 37.1458 27.0967 36.6594V38.5521L26.7842 39.8014C26.374 41.4389 24.9123 42.5805 23.2257 42.5805C21.5391 42.5805 20.0774 41.4389 19.6672 39.8027L19.3547 38.5521V36.6594C20.5506 37.1458 21.8566 37.4193 23.2257 37.4193ZM12.9031 47.7419V54.1936H30.9677V47.2644L35.4113 42.0785L29.3132 40.3201L29.2861 40.4284C28.5912 43.2157 26.0981 45.1613 23.2257 45.1613C20.3534 45.1613 17.8603 43.2157 17.1635 40.4284L17.1364 40.3201L7.24349 43.1742C4.49778 43.9667 2.58057 46.5146 2.58057 49.3731V54.1936H10.3225V47.7419H12.9031Z" fill="black"/>
<path fill-rule="evenodd" clip-rule="evenodd" d="M66.9766 50.7478C66.9766 57.131 61.7607 62.3258 55.3487 62.3258C48.9367 62.3258 43.7208 57.131 43.7208 50.7478C43.7208 44.3646 48.9367 39.1699 55.3487 39.1699C57.8463 39.1699 60.1565 39.9651 62.0528 41.3043L64.5838 37.2095L66.7842 38.5575L64.0091 43.0487C65.8474 45.0977 66.9766 47.7905 66.9766 50.7478ZM60.6954 43.5017C59.1952 42.4018 57.3499 41.7429 55.3489 41.7429C50.3632 41.7429 46.3049 45.7825 46.3049 50.748C46.3049 55.7134 50.3632 59.753 55.3489 59.753C60.3345 59.753 64.3928 55.7134 64.3928 50.748C64.3928 48.7272 63.7134 46.8667 62.5791 45.3616L55.7066 56.4829L49.4056 51.7769L50.9562 49.7191L54.9899 52.7316L60.6954 43.5017Z" fill="black"/>
</svg>
