{
  "extends": "tslint-config-airbnb",
  "rules": {
    "max-line-length": {
      "options": [120]
    },
    "import-name": false,
    "align": [true, "parameters"],
    "function-name": [
      true,
      {
        "method-regex": "^[a-z][\\w\\d]+$",
        "private-method-regex": "^[a-z_][\\w\\d]+$",
        "protected-method-regex": "^[a-z_][\\w\\d]+$",
        "static-method-regex": "^[a-z][\\w\\d]+$",
        "function-regex": "^[a-z][\\w\\d]+$"
      }
    ]
  },
  "linterOptions": {
    "exclude": ["node_modules/**"]
  }
}
