<svg class="svg" width="30" height="25" xmlns="http://www.w3.org/2000/svg" viewBox="-2285.778 -3338.9 21.6 25.313">
    <g transform="translate(-5173.978 -6602)">
        <g transform="translate(9.006 22.714)">
            <path d="M2890.1,3265.7h-.2a2.82,2.82,0,0,1-2.7-3v-.7h5.7v.8A2.881,2.881,0,0,1,2890.1,3265.7Zm-1.3-2.3a1.424,1.424,0,0,0,1.3.9,1.693,1.693,0,0,0,1.4-.9Z"/>
        </g>
        <path d="M2889.6,3284a1.377,1.377,0,0,1-1.3-.9,1.238,1.238,0,0,1,.3-1.4l2.8-3.3v-4.9a7.656,7.656,0,0,1,4.4-6.9v-.3a3.2,3.2,0,0,1,6.4,0v.3a7.688,7.688,0,0,1,4.5,6.9v4.9l2.9,3.4a1.419,1.419,0,0,1,.2.6,1.69,1.69,0,0,1-.3,1,1.624,1.624,0,0,1-.9.5Zm0-1.3Zm9.5-18.3a1.793,1.793,0,0,0-1.8,1.8v1.2l-.4.2a6.382,6.382,0,0,0-4,5.8v5.5l-3.1,3.6h18.8l-3.1-3.6v-5.5a6.178,6.178,0,0,0-4-5.8l-.5-.2v-1.2A1.95,1.95,0,0,0,2899.1,3264.4Z"/>
    </g>
</svg>
