<svg class="svg" fill="none" stroke="#000" xmlns="http://www.w3.org/2000/svg" viewBox="0 0 17.414 17.414">
    <path  stroke-width="2px" d="M8,8,0,16,8,8,0,0,8,8l8-8L8,8l8,8Z"
          transform="translate(0.707 0.707)"/>
</svg>