<svg xmlns="http://www.w3.org/2000/svg" viewBox="5445 -2538 40 40">
    <defs>
        <style>.cls-2, .cls-3 { fill: none; } .cls-2 { stroke-width: 1.2px; }
        </style>
    </defs>
    <g transform="translate(4623.606 -2885.093)">
        <g transform="translate(-4 -3.146)" stroke="#000">
            <path  class="cls-2"
                  d="M838.375,375.162s5.42-17.923,5.878-17.923,7,17.923,7,17.923-1.2,2.7-5.929,2.941A8.108,8.108,0,0,1,838.375,375.162Z"
                  transform="translate(0.274 1)"/>
            <path  class="cls-3"
                  d="M839.326,372.777s-6.914,3.139-6.933,3.25,12.756,5.953,13.043,5.953,12.957-5.8,12.957-5.953-8.017-3.25-8.017-3.25"
                  transform="translate(0 0.666)"/>
            <path  class="cls-3"
                  d="M840.129,370.139a9.792,9.792,0,0,0,5.069,1.768,6.19,6.19,0,0,0,4.669-1.768"
                  transform="translate(-0.126 1.516)"/>
            <path  class="cls-3"
                  d="M840.062,369.9a5.789,5.789,0,0,0,3.775,1.211c2.4-.032,2.678-.642,3.863-1.211"
                  transform="translate(0.965 -2.231)"/>
        </g>
    </g>
</svg>