<svg class="svg" width="14" height="14" viewBox="0 0 14 14" fill="none" xmlns="http://www.w3.org/2000/svg">
<circle cx="7" cy="7" r="6.5" stroke="#CFCFCF"/>
<path d="M7.00012 6.31331L4.97289 4L2 9H4.02699L5.15347 7.13427L7.00012 9L8.84725 7.13427L9.97325 9H12L9.02735 4L7.00012 6.31331Z" fill="#F75A52"/>
</svg>
