<svg
  class="svg"
  width="17"
  height="19"
  viewBox="0 0 17 19"
  fill="none"
  xmlns="http://www.w3.org/2000/svg">
  <path
    d="M16.151 3.325C16.151 2.69511 15.9008
    2.09102 15.4554 1.64562C15.01
    1.20022 14.4059 0.950001
    13.776 0.950001H10.451V0H5.70099V0.950001H2.37598C1.74609 0.950001
    1.14199 1.20022 0.696594 1.64562C0.251195 2.09102 0.000976562
    2.69511 0.000976562 3.325V5.7H0.950989V16.625C0.950989
    17.2549 1.20121 17.859
    1.64661 18.3044C2.09201 18.7498 2.6961
    19 3.32599 19H12.826C13.4559 19 14.06
    18.7498 14.5054 18.3044C14.9508 17.859 15.201 17.2549 15.201
    16.625V5.7H16.151V3.325ZM14.251 16.625C14.251 17.0029 14.1009
    17.3654 13.8336 17.6326C13.5664 17.8999 13.2039 18.05 12.826
    18.05H3.32599C2.94806 18.05 2.5856 17.8999 2.31836
    17.6326C2.05112 17.3654 1.901 17.0029 1.901
    16.625V5.7H14.251V16.625ZM15.201 4.75H0.950989V3.325C0.950989 2.94707
    1.10111 2.58461 1.36835 2.31737C1.63559 2.05013 1.99804 1.9 2.37598
    1.9H13.776C14.1539 1.9 14.5164 2.05013 14.7836 2.31737C15.0509
    2.58461 15.201 2.94707 15.201
    3.325V4.75Z"
    fill="#9BADB9"/>
  <path
    d="M5.70098 7.6001H4.75098V15.2001H5.70098V7.6001Z"
    fill="#9BADB9"/>
  <path
    d="M8.55095 7.6001H7.60095V15.2001H8.55095V7.6001Z"
    fill="#9BADB9"/>
  <path
    d="M11.4009 7.6001H10.4509V15.2001H11.4009V7.6001Z"
    fill="#9BADB9"/>
</svg>
