<svg fill="#fff" version="1.1" xmlns="http://www.w3.org/2000/svg" x="0px" y="0px" viewBox="0 0 22.6 16.3">
<path d="M2.5,12.3h13.6L18.1,4l4.5-2.2L21.7,0l-5.3,2.7l-1.9,7.7H4.1l-0.5-2h6.7v-2H3.1l-0.5-2h8.7v-2
	H0L2.5,12.3z"/>
<circle cx="4.8" cy="14.8" r="1.5"/>
<circle cx="13.8" cy="14.8" r="1.5"/>
</svg>
