<svg class="svg" xmlns="http://www.w3.org/2000/svg" viewBox="0 0 80 77.18">
    <path d="M61,39.08A19.05,19.05,0,1,0,80,58.13,19.05,19.05,0,0,0,61,39.08Zm-1.83,31L47.37,58.31l5.37-5.37,6.38,6.37,10-10,5.37,5.37Z"/>
    <path d="M35.73,52.76A25.89,25.89,0,0,1,68.39,33.3V25.4L59.6,0H8.79L0,25.4V60.57H10.75V52.76h25ZM13.19,43a6.35,6.35,0,1,1,6.35-6.35A6.35,6.35,0,0,1,13.19,43ZM9.77,22.47H8.83L14.24,6.84H54.15l5.41,15.63H9.77Z"/>
</svg>