<svg class="svg" xmlns="http://www.w3.org/2000/svg" viewBox="0 0 19 19" width="19" height="19">
<path d="M9.5,0A9.5,9.5,0,1,0,19,9.5,9.51,9.51,0,0,0,9.5,0Zm0,18A8.5,8.5,0,1,1,18,9.5,8.51,8.51,0,0,1,9.5,18Z" />
<path d="M8.7,12.11a4.4,4.4,0,0,1,.2-1.41,3.65,3.65,0,0,1,.76-1.15l1-1A2.25,2.25,0,0,0,11.28,7a1.77,1.77,0,0,0-.41-1.23,1.6,1.6,0,0,0-1.21-.44,1.8,1.8,0,0,0-1.23.4A1.36,1.36,0,0,0,8,6.83H6.58a2.52,2.52,0,0,1,.87-2,3.2,3.2,0,0,1,2.21-.75,3.07,3.07,0,0,1,2.22.76A2.79,2.79,0,0,1,12.67,7a3.78,3.78,0,0,1-1.22,2.58l-.82.81a2.56,2.56,0,0,0-.54,1.75Zm-.06,2.38a.88.88,0,0,1,.2-.57.79.79,0,0,1,.61-.23.81.81,0,0,1,.62.23.84.84,0,0,1,.21.57.75.75,0,0,1-.83.79.79.79,0,0,1-.61-.22A.84.84,0,0,1,8.64,14.49Z" />
</svg>
