<svg class="svg" xmlns="http://www.w3.org/2000/svg" viewBox="0 0 83 61">
    <path
          d="M79,0H4A4,4,0,0,0,0,4V57a4,4,0,0,0,4,4H79a4,4,0,0,0,4-4V4A4,4,0,0,0,79,0Zm0,2a2,2,0,0,1,1.2.41L41.63,35.19,2.95,2.31A2,2,0,0,1,4,2Zm0,57H4a2,2,0,0,1-2-2V4.13L32.8,30.31,5,53.73l1.29,1.53L34.35,31.62l7.28,6.19,7.25-6.16L77,55.27l1.29-1.53L50.42,30.34,81,4.35V57A2,2,0,0,1,79,59Z"/>
</svg>