<svg class="svg svgLocation" width="14" height="14" viewBox="0 0 14 14" stroke="#FFBB25" fill="none" xmlns="http://www.w3.org/2000/svg">
    <path d="M7 7.58337C7.9665 7.58337 8.75 6.79987 8.75 5.83337C8.75 4.86688 7.9665 4.08337 7 4.08337C6.0335 4.08337 5.25 4.86688 5.25 5.83337C5.25 6.79987 6.0335 7.58337 7 7.58337Z"/>
    <path d="M6.99967 12.6583C10.0913 9.91663 11.6663 7.58329 11.6663 5.83329C11.6663 4.59562 11.1747 3.40863 10.2995 2.53346C9.42434 1.65829 8.23735 1.16663 6.99967 1.16663C5.762 1.16663 4.57501 1.65829 3.69984 2.53346C2.82467 3.40863 2.33301 4.59562 2.33301 5.83329C2.33301 7.58329 3.90801 9.85829 6.99967 12.6583Z"/>
</svg>
