<svg xmlns="http://www.w3.org/2000/svg" width="38" height="38.202" viewBox="0 0 38 38.202">
  <path d="M18,0A18.255,18.255,0,0,1,36,18.5c0,10.217-7.762,16.061-17.7,16.061-2.157,0-9.724-3.39-15.74-1.977C3.647,26.821,0,26.5,0,18.5A18.255,18.255,0,0,1,18,0Z" transform="translate(1 2)" fill="#38aa43"/>
  <path d="M27.861,22.874c-.47-.235-2.794-1.358-3.212-1.514s-.757-.261-1.071.235-1.227,1.541-1.488,1.854-.548.339-1.018,0A12.38,12.38,0,0,1,17.26,21.1a14.622,14.622,0,0,1-2.611-3.264c-.261-.47,0-.7.209-.966a14.087,14.087,0,0,0,1.2-1.619.861.861,0,0,0,0-.835,35.045,35.045,0,0,0-1.462-3.5c-.418-.888-.731-.809-1.044-.836H12.56a1.723,1.723,0,0,0-1.253.6,5.222,5.222,0,0,0-1.671,3.943,9.165,9.165,0,0,0,1.932,4.883,19.454,19.454,0,0,0,8.068,7.155c4,1.567,4.8,1.253,5.666,1.175a4.726,4.726,0,0,0,3.186-2.246,3.681,3.681,0,0,0,.235-2.089C28.723,23.24,28.331,23.135,27.861,22.874Z" fill="#fff"/>
  <path d="M19.271,0A18.931,18.931,0,0,0,2.846,28.384h0L0,38.2,10.079,35.59A18.931,18.931,0,1,0,19.271,0Zm0,35.251A16.112,16.112,0,0,1,10.6,32.64L3.812,34.415,5.64,27.809a16.294,16.294,0,1,1,13.63,7.442Z" fill="#fff"/>
</svg>
