<svg width="38" height="39" viewBox="0 0 38 39" fill="#fff" xmlns="http://www.w3.org/2000/svg">
<path fill-rule="evenodd" clip-rule="evenodd" d="M35.3988 19.0219C35.3988 28.0936 28.0538 35.4425 18.9999 35.4425C9.94594 35.4425 2.60119 28.0936 2.60119 19.0219C2.60119 9.95015 9.94594 2.60119 18.9999 2.60119C28.0538 2.60119 35.3988 9.95015 35.3988 19.0219ZM38 19.0219C38 29.5274 29.4933 38.0437 18.9999 38.0437C8.50657 38.0437 0 29.5274 0 19.0219C0 8.51637 8.50657 0 18.9999 0C29.4933 0 38 8.51637 38 19.0219ZM13.0845 20.3236L8.68868 18.6811C8.24223 18.5136 8.23844 17.8826 8.6836 17.7107L26.7238 10.7433C27.1062 10.5952 27.5008 10.9306 27.4176 11.3327L24.1801 26.9234C24.1039 27.2914 23.6727 27.4584 23.3685 27.2371L18.9491 24.0247C18.6807 23.8296 18.3148 23.84 18.058 24.0496L15.6078 26.0494C15.3233 26.2822 14.8948 26.1524 14.7859 25.8016L13.0845 20.3236ZM23.1025 14.152L14.5117 19.4493C14.1824 19.6527 14.0274 20.0508 14.1338 20.4235L15.0626 23.691C15.1286 23.9225 15.4643 23.8988 15.4963 23.6596L15.7378 21.8677C15.7834 21.5303 15.944 21.2195 16.1933 20.9873L23.2832 14.3892C23.4158 14.2661 23.257 14.0571 23.1025 14.152Z"/>
</svg>
