<svg xmlns="http://www.w3.org/2000/svg" viewBox="810 4625 6 15">
  <defs>
    <style>
      .cls-1 {
        fill: rgba(0,0,0,0);
        stroke: #74bc92;
        stroke-width: 1.5px;
      }

      .cls-2 {
        fill: #74bc92;
      }
    </style>
  </defs>
  <g id="Group_2435" data-name="Group 2435" transform="translate(810 4625)">
    <path id="Path_176" data-name="Path 176" class="cls-1" d="M0,0V12.75" transform="translate(3)"/>
    <path id="Path_175" data-name="Path 175" class="cls-2" d="M0,0H6L3.15,3Z" transform="translate(0 12)"/>
  </g>
</svg>
