<svg width="60" height="60" viewBox="-8 -6 60 60" fill="none" xmlns="http://www.w3.org/2000/svg">
<g clip-path="url(#clip0)">
<path d="M38.4037 1.06642H4.25801C3.12847 1.06912 2.04611 1.51972 1.24835 2.31939C0.450586 3.11907 0.00256101 4.20251 0.00256424 5.33205V42.6653C0.00222948 43.2259 0.112311 43.7808 0.32653 44.2987C0.540749 44.8163 0.854893 45.2869 1.25103 45.6832C1.64716 46.0797 2.11753 46.3941 2.63523 46.6085C3.15292 46.8232 3.70783 46.9336 4.2682 46.9336H38.4138C39.545 46.9336 40.6301 46.4843 41.4301 45.6843C42.2301 44.8843 42.6794 43.7992 42.6794 42.668V5.33205C42.6794 4.77101 42.5688 4.21549 42.3538 3.69731C42.1386 3.17909 41.8237 2.70843 41.4264 2.3122C41.0293 1.91597 40.5578 1.60198 40.0392 1.38821C39.5205 1.17444 38.9648 1.06508 38.4037 1.06642ZM2.1354 42.668V5.33205C2.1354 4.7664 2.3601 4.22392 2.76009 3.82395C3.16007 3.42395 3.70255 3.19925 4.2682 3.19925H5.33591V44.8008H4.2682C3.70255 44.8008 3.16007 44.576 2.76009 44.176C2.3601 43.776 2.1354 43.2336 2.1354 42.668ZM40.5365 42.668C40.5365 43.2336 40.3117 43.776 39.9117 44.176C39.5117 44.576 38.9693 44.8008 38.4037 44.8008H7.46871V3.19925H38.4037C38.9693 3.19925 39.5117 3.42395 39.9117 3.82395C40.3117 4.22392 40.5365 4.7664 40.5365 5.33205V42.668Z" fill="#FFBB25"/>
<path d="M29.9437 18.1315H27.7344V10.5048C27.7344 10.2448 27.6829 9.98726 27.5829 9.74712C27.4832 9.50702 27.3368 9.28902 27.1522 9.10568C26.9677 8.92238 26.7488 8.77736 26.508 8.67902C26.2672 8.58064 26.0094 8.53086 25.7493 8.53254H24.5338V5.33203H22.4009V8.53254H21.1855C20.9254 8.53086 20.6676 8.58064 20.4268 8.67902C20.1861 8.77736 19.9671 8.92238 19.7826 9.10568C19.5981 9.28902 19.4517 9.50702 19.3518 9.74712C19.2519 9.98726 19.2004 10.2448 19.2005 10.5048V18.1315H16.9912C16.4385 18.1507 15.9147 18.3838 15.5306 18.7817C15.1465 19.1797 14.9319 19.7113 14.9323 20.2643V24.53C14.9319 25.0831 15.1465 25.6147 15.5306 26.0126C15.9147 26.4105 16.4385 26.6437 16.9912 26.6628H18.1328V29.8632H19.2005V40.6907C19.2004 40.9507 19.2519 41.208 19.3518 41.4483C19.4517 41.6883 19.5981 41.9064 19.7826 42.0896C19.9671 42.2731 20.1861 42.4181 20.4268 42.5163C20.6676 42.6147 20.9254 42.6645 21.1855 42.6629H24.5338V40.5301H21.3333V36.2669H22.4009V39.4776H24.5338V36.2669H25.7493C26.0094 36.2685 26.2672 36.2187 26.508 36.1205C26.7488 36.0221 26.9677 35.8771 27.1522 35.6936C27.3368 35.5104 27.4832 35.2925 27.5829 35.0523C27.6829 34.8123 27.7344 34.5547 27.7344 34.2947V29.8685H28.8021V26.668H29.9437C30.4962 26.6488 31.02 26.4156 31.4042 26.0177C31.7882 25.6198 32.0029 25.0882 32.0026 24.5351V20.2643C32.0029 19.7113 31.7882 19.1797 31.4042 18.7817C31.02 18.3838 30.4962 18.1507 29.9437 18.1315ZM21.3358 10.6654H25.6015V18.1315H21.3358V10.6654ZM25.6015 24.5326H21.3358V20.2643H25.6015V24.5326ZM17.0677 24.5326L16.9937 20.2669H19.203V24.5326H17.0677ZM25.6015 34.1315H21.3358V29.8659H25.6015V34.1315ZM26.6693 27.7304H20.2681V26.6628H26.6564L26.6693 27.7304ZM28.8021 24.53H27.7344V20.2643H29.8672L29.941 24.53H28.8021Z" fill="#FFBB25"/>
</g>
<defs>
<clipPath id="clip0">
<rect width="42.6667" height="48" fill="white"/>
</clipPath>
</defs>
</svg>
