<svg class="svg svgError-404" width="150" height="150" viewBox="0 0 150 150" fill="none" xmlns="http://www.w3.org/2000/svg">
<g clip-path="url(#clip0)">
<path opacity="0.98" d="M18.8512 58.5544C17.9197 57.6228 17.9197 56.7158 18.6796 56.3726L20.6898 55.2695C20.8614 55.0979 21.0575 55.0979 21.2291 55.0979C21.7684 55.0979 22.3322 55.6372 22.5283 56.3972L28.9509 71.7919L18.8512 58.5544ZM10.6145 63.3101L26.9408 75.7632L14.4877 59.4369C13.9484 58.726 13.3846 58.3338 12.8453 58.3338C12.4776 58.3338 12.1344 58.5053 11.9138 58.7015L9.90363 60.7116C9.1437 61.447 9.5114 62.3786 10.6145 63.3101ZM68.9332 87.7017L3.11327 87.5301C1.27472 87.5301 0 89.0009 0 90.6434V94.8595C0 96.6981 1.47084 97.9728 3.11327 97.9728H61.4319V132.243C61.4319 134.082 62.9027 135.528 64.7168 135.528H68.9332C70.7717 135.528 72.218 134.057 72.218 132.243V90.8147C72.218 88.9517 70.7472 87.7017 68.9332 87.7017ZM9.683 75.42L26.1809 77.6017L10.7861 71.3752C10.4184 71.0075 9.8546 71.0075 9.48689 71.0075C9.11918 71.0075 8.94758 71.3752 8.77599 71.7184L8.23668 73.9001C8.04057 74.66 8.60439 75.42 9.683 75.42ZM148.873 97.5806L141.372 110.622C139.533 113.735 136.42 113.564 133.846 112.093L122.839 105.67C119.359 110.965 112.2 112.828 106.685 109.543C100.998 106.43 98.9877 99.272 101.733 93.6093L63.5894 71.6203C60.1084 76.9156 52.9503 78.7784 47.4347 75.4935C41.7475 72.2089 39.7373 65.2224 42.4829 59.5594L36.7957 56.2746C32.7509 54.0928 33.1431 51.8621 34.6139 49.2881L41.772 36.835C43.0712 34.6533 44.1743 33.1825 46.5277 31.54L70.1591 16.1453C71.4583 15.0421 73.444 14.5028 75.2825 14.5028C77.1211 14.3312 78.9351 14.8705 80.7982 15.8021L123.036 39.8257C125.978 41.4682 127.792 44.9491 127.792 48.9939L128.895 70.9829L146.52 87.1374C151.08 90.9863 150.344 94.835 148.873 97.5806ZM56.4556 59.0937C55.3525 58.3828 54.0532 58.1622 52.803 58.1622C50.7929 58.3338 48.5866 59.4614 47.508 61.2754C45.6694 64.3887 46.7971 68.4335 49.9104 70.272C53.0236 72.1106 57.0684 70.9829 58.907 67.8697C60.6965 64.7809 59.5688 60.9077 56.4556 59.0937ZM86.3628 46.8122L94.9915 31.9568L79.4006 22.9601C78.4688 22.5924 77.7579 22.2492 76.8267 22.2492C75.3558 22.2492 74.0808 22.7885 72.2423 23.8917L60.8678 32.1284L86.3628 46.8122ZM115.706 93.3642C114.603 92.6533 113.303 92.4326 112.053 92.4326C110.043 92.4326 108.008 93.7319 106.758 95.5459C104.92 98.6589 106.047 102.704 109.161 104.542C112.274 106.381 116.319 105.253 118.157 102.14C119.922 99.0514 118.819 95.2272 115.706 93.3642ZM119.922 66.2518L119.751 51.3963C119.751 48.4546 118.819 45.7091 116.098 44.0666L101.782 35.83L93.1287 50.6609L119.922 66.2518Z" fill="black"/>
</g>
<defs>
<clipPath id="clip0">
<rect width="150" height="150" fill="white"/>
</clipPath>
</defs>
</svg>
