<svg xmlns="http://www.w3.org/2000/svg" viewBox="0 0 19 12" fill="#96adbb">
    <g transform="translate(-3088 1583)">
        <circle cx="2" cy="2" r="2" transform="translate(3100 -1575)"/>
        <circle cx="2" cy="2" r="2" transform="translate(3090 -1575)"/>
        <path d="M3079-1581.1v6.3a4.719 4.719 0 0 1 2.9.6 3.368 3.368 0 0 1 1 2.3h2.1v-5.839c0-1.575-.525-2.736-1.9-3.062a23.58 23.58 0 0 0-4.1-.299z"
              transform="translate(22 -1)"/>
        <path d="M3066-1572v-10h12.1v8.1l-1.3 1.9h-4s-.2-2.1-1.874-2.57a2.868 2.868 0 0 0-3.126.87 3.671 3.671 0 0 0-.6 1.7"
              transform="translate(22 -1)"/>
    </g>
</svg>