<svg class="svg" xmlns="http://www.w3.org/2000/svg" width="16" height="18" viewBox="0 0 16.744 18">
  <g transform="translate(-3236.994 808)">
    <path d="M169.07,179h-13.4A1.674,1.674,0,0,0,154,180.674v14.651A1.674,1.674,0,0,0,155.674,197h13.4a1.674,1.674,0,0,0,1.674-1.674V180.674A1.674,1.674,0,0,0,169.07,179Zm-14.233,16.326V180.674a.837.837,0,0,1,.837-.837h.419v16.326h-.419A.837.837,0,0,1,154.837,195.326Zm15.07,0a.837.837,0,0,1-.837.837H156.93V179.837h12.14a.837.837,0,0,1,.837.837Z" transform="translate(3082.995 -987)"/>
    <path d="M173.89,188.023h-.867V185.03a.774.774,0,0,0-.779-.774h-.477V183h-.837v1.256h-.477a.774.774,0,0,0-.779.774v2.993h-.867a.837.837,0,0,0-.808.837v1.674a.837.837,0,0,0,.808.837h.448v1.256h.419v4.249a.774.774,0,0,0,.779.774h1.314v-.837h-1.256V195.14h.419V196.4h.837V195.14h.477a.774.774,0,0,0,.779-.774v-1.737h.419v-1.256h.448a.837.837,0,0,0,.808-.837V188.86A.837.837,0,0,0,173.89,188.023Zm-3.378-2.93h1.674v2.93h-1.674Zm1.674,5.442h-1.674V188.86h1.674Zm-3.349,0-.029-1.674h.867v1.674Zm3.349,3.767h-1.674v-1.674h1.674Zm.419-2.512h-2.512v-.419H172.6Zm.837-1.256h-.419V188.86h.837l.029,1.674Z" transform="translate(3074.855 -989.326)"/>
  </g>
</svg>
