<svg width="17" height="9" viewBox="0 0 17 9" fill="none" xmlns="http://www.w3.org/2000/svg">
    <path d="M17 4.4999L12.08 0.399902V8.5999L17 4.4999Z" fill="#8798A4"/>
    <path d="M0.600098 4.5H15.3601" stroke="#8798A4" stroke-miterlimit="10"/>
</svg>
