<svg class="svg" width="18" height="18" viewBox="0 0 33 33" fill="2c2c2c" xmlns="http://www.w3.org/2000/svg">
    <path d="M16.5 7.96509C11.7938 7.96509 7.96503 11.7939 7.96503 16.5C7.96503 21.2061 11.7938 25.035 16.5 25.035C21.2062 25.035 25.035 21.2062 25.035 16.5C25.035 11.7938 21.2062 7.96509 16.5 7.96509ZM16.5 21.7152C13.6197 21.7152 11.2848 19.3803 11.2848 16.5001C11.2848 13.6198 13.6198 11.2849 16.5 11.2849C19.3803 11.2849 21.7152 13.6198 21.7152 16.5001C21.7152 19.3803 19.3802 21.7152 16.5 21.7152Z"/>
    <path d="M27.0967 8.02904C27.0967 9.15855 26.181 10.0742 25.0515 10.0742C23.922 10.0742 23.0063 9.15855 23.0063 8.02904C23.0063 6.89953 23.922 5.98389 25.0515 5.98389C26.181 5.98389 27.0967 6.89953 27.0967 8.02904Z"/>
    <path d="M23.1691 0H9.83088C4.41011 0 0 4.41011 0 9.83088V23.1691C0 28.5899 4.41011 33 9.83088 33H23.1691C28.5899 33 33 28.5899 33 23.1691V9.83088C32.9999 4.41011 28.5898 0 23.1691 0ZM29.6802 23.1691C29.6802 26.7651 26.7651 29.6802 23.1691 29.6802H9.83088C6.23494 29.6802 3.3198 26.7651 3.3198 23.1691V9.83088C3.3198 6.23488 6.23494 3.3198 9.83088 3.3198H23.1691C26.7651 3.3198 29.6802 6.23488 29.6802 9.83088V23.1691Z"/>
</svg>
