<svg viewBox="400 0 740 260.8" width="2100" height="450" version = "1.1" baseProfile="full" preserveAspectRatio="xMidYMin meet" xmlns = "http://www.w3.org/2000/svg" xmlns:xlink = "http://www.w3.org/1999/xlink" xmlns:ev = "http://www.w3.org/2001/xml-events">
    <defs>
        <style>
            .cls-1 { fill: #e3e3e3; }
            .cls-2 { fill: #b5b5b5; }
            .cls-3 { fill: #d5d5d5; }
            .cls-4 { fill: #d9d6d6; }
            .cls-5 { fill: silver; }
            .cls-6 { fill: none; stroke: #ff00d5; }
            .cls-8 { fill: none; stroke: none; }
        </style>
    </defs>
    <g id="Group_2" data-name="Group 2" transform="translate(-34 -917)"> <g id="map-index" transform="translate(132 913)">
        <path id="фон" class="cls-1" d="M0,0H1280V320H0Z"/>
        <g id="сооружения"> <path id="Path_1" data-name="Path 1" class="cls-2" d="M12,320v-7.667c0-.666,7.167,0,7.167,0l11.666-5.666,5.167-18L24.667,285l1.708-8.833-5.542-.334,4-23.166H28l.5,11.43,10.5,5.07,4.333-8.334,6.834,13L60.833,269.5s2,6.5,3.667,7,12.167-1,13.333-1.667a28.48,28.48,0,0,0,6.667-7.166c2.167-3.334-.833-10.167-.833-10.167l-5.834,2.833-4-10L71,251.5l-4.5-11-3.667,1L58.5,231,47,221.833l-15,5.5L30.5,224,17,223.667l1.5-12.834,12.706-4.388,88.8,64.482S101.043,311.037,97.061,320Zm154.437-75.875L156.25,258.5l16,11.25,6-4.875Zm51.251,67.188v3.5l6.312,3v-3.688Z"/> <path id="Path_2" data-name="Path 2" class="cls-2" d="M31,231.75c.25.75,4.125,11.5,4.125,11.5l-4.875,3Zm35-72.43h12.12v20.555H66Zm6.06-22.445,14.06-15.25,8,7.625S81.25,145.125,81,144.75,72.064,136.875,72.064,136.875Zm-33.594-30.5,2.112-2.578,4.286,3.51-2.112,2.578Zm3.028-3.7L43.61,100.1l4.286,3.51-2.112,2.58Zm2.656-3.243,2.112-2.578,4.285,3.508-2.11,2.58Zm2.582-3.153,2.112-2.578,4.285,3.51-2.112,2.578ZM49.23,93.24l2.11-2.578,4.286,3.51L53.514,96.75Zm2.54-3.1,2.112-2.578,4.285,3.508-2.112,2.58ZM44.06,110.87l2.112-2.577,4.285,3.51-2.112,2.578Zm3.028-3.7,2.112-2.58,4.285,3.51-2.112,2.58Zm2.656-3.244,2.11-2.578,4.287,3.51-2.11,2.578Zm2.582-3.152,2.112-2.58,4.285,3.51-2.11,2.58Zm2.494-3.044,2.11-2.58,4.286,3.51-2.11,2.58Zm2.54-3.1,2.112-2.578,4.285,3.51-2.11,2.578ZM154.5,75.75a17.436,17.436,0,0,1,2.75,1.875l.625-11.5h2l-3.25-26.375-5.125.875,3.375,22.625Zm-6.125-17.625-2.75-15.875-1.5-22,5.25-17.375h-1.75l-5.375,17,.875,21.875,2.688,12.125-1.563,13.5,4.288,3.734-.163-12.985ZM228.625,76c2.1-.753,4.875.125,5,2.875s1.125,5.25,0,5-5.25-3.092-5.625-4.11S227.9,76.261,228.625,76Zm32.792,86.5,5.166,3.083h7.625V162.5h-12.79Zm15.666,3.083,2.084,2.224,7.5-3.753V162.5h-9.584v2.682m-83.75,74.235L195.417,238l3.75,4.417-1.834,1.708-4-4.708Zm230.75.166s13.417,6.5,13.25,6.834-3,5-3,5l-3.624.916L423.332,268l-5.416-2.583L421.56,259l-1.31-2.917-3.417-1.916Zm-5.333,39.25-10.583,18.584-2.5-1.334L416.833,277.5l1.917,1.333Zm-11.083-5.916-4.25,2.166-3.834,6.334,4.042,2.166,5.125-9.833-1.083-.833Zm-9,11.083-2.917,5.583,8.417,5.334,1.5-3.334-2.5-1.5,1-2.625,1.5.542.666-1.333ZM390.5,240.917l-4-2.167-3,4.667,4.25,2.333,2.75-4.833Zm.667-11.75-2.25,3.583,4.75,2.583,1.916-3.083Zm11.75,6.86,4.5,2.723-2.25,4.25-4.5-2.917Zm9.333-6.36-5.75-2.834-1.667,3.334,5.667,2.5Zm-12-5.917-1.667,3.083-5.5-3.083,1.917-3Zm-20.667-9.583-1.25,2.083L372,213l1.417-2.333,6.166,3.5Zm-12.666,3.416,7.916,4.25-1.75,3-6.166-3.625Zm-2.5,9.834L370.875,231l-3.23,3.583-5.395-4.833Zm-1.042,32.208,2.375,2.813-3.5,3.062-2.312-2.937Zm-8.125,7,2.625,2.938-3.5,2.875-2.562-2.907,3.437-2.9Zm215.667-50.042,6.833,3.667-4,8.833-7.25-3.5,4.417-9Zm94.166,51.25,4.167,2L671.5,266l-1.75-1.083,1.75-3.584,5.167,2.5-1.667,3.5-1.5-.666L671.25,271l3.583,1.833,6.5-12.166-9.333-5.5ZM733,262.667l7.833-7.5,5.167,5L738.167,268Zm-28.333-24.334c0-.25,6-4.666,6-4.666l6.25,7.833-8.584,3.583Zm-1-2,5.583-4-5.583-6.833-3.75,4,3.75,6.833Zm-4.584-8.666,3.334-4.25L694.75,213.25l5.167-4.5-18.5-22.833-8.167,7.333,17.833,22.333-3.25,2.834,3.167,3.75,2.753-2,5.33,7.5Zm19.75-32.834,3.75-2.833,3.667,4.833,3-1.833,4.917,6.5-6,5.292-9.334-11.96ZM881.25,138.75l-9.375-2-2.125,7.625-13.5-1.75-1.833,6.625-13.167-2.5-1.656,6.267-11.22-1.844-2.212,11.1,5.838.975,1.25-6.34,12.25,1.715,9.013-4.094,18.112-7.78.5-2.875,8.125-5.125Zm51.5,26.5c-.083.25-3.083,17.417-3.083,17.417l-2.084-.5v-2.25L920,178.333l-1,6.75,13.167,2.334,2.083-12.334-2.167-.833,1.75-9Zm-15.083,13.083-.917,6.5L898,182.25l-.417-4.667s2.084.25,2.167,0,.083-2.666.083-2.666ZM900.333,166.25h3.417v6.667h-3.417ZM932,147.667,930.583,156l-5.666-1,1.708-8Zm4.917-24,7,1.5-3.834,20.583H937.5l3.333-18.417-4.5-1Z"/> <path id="Path_3" data-name="Path 3" class="cls-2" d="M934.25,123.083l-.667,2.667-9.666-2.667L919.083,148l-5.833-1,.75-4.667,3.667.417.5-3.417-8.417-1.916-.667,3.75-7.666-1.5L898.25,162.25H896v10.417l-3.66.644-4.995-58.144h4.072l42.833,7.917ZM840,193.833l1.333,3.75L847.417,195l-1.834-3.833L840,193.833ZM726.5,242.942l2.375-5.192,5.292-1.625,4.517,2.675L726.5,242.942m38.868-13.212,1.007-5.1,6.5-2.75,5.818,3.324-13.325,4.53m45.138-15.345L812,209l6.125-2.5,4.99,3.6-12.61,4.287M835.747,0,821.5,72.833l11.833,2.5L832,82.667h2.5L833.833,86l4,1-1,9,46.5,8.5L905.248,0h-69.5ZM973.86,21.5,959.5,18l-5.167,20.333L969,40.667l1-3.5-2.5-1.334,2.167-8.5,2.666.334,1.526-6.167ZM949.015,196.8l3.735-5.672,7.375,2.25v5.6l-11.11-2.18m58.2,11.42,3.793-5.592,6.875,1.625v6.06l-10.668-2.093m5.62-116.967,11,3.083L1021.247,104l-11.417-2,.917-4.375,6.667,1.458.833-2.833-3.833-.917-.25,1-2.834-.77Zm8.3-36.75,2.708,8.75-7-3.875Zm-10-9.625c.625,0,6.375,4.375,6.375,4.375l-4.75,3-2.25-3.687Zm-4.18-13.559,8.554,2.31.625-2.31s10.125,1.434,15.125,7.434,9.875,9.875,12,9.813c1.75-4.813,4.5-20.063,4.5-20.063l-38.564-8.714-2.24,11.53m40.8,18.934-1.365,9.125,23.49,2,1.25-6.125Zm29.63-19.875L1073.5,50.25l-2.375-.75,1.375-6.25-7.875-2.125L1067,28.875l10.375,1.5Zm16.37.5L1092,39.563l3,.562,1.625-8.5Zm32.75,42,5.25.75-2.625,13.25-5.375-1.125Zm-30.5,55.5,5.375,1.25-2,8.875-5.5-1.375Zm29-1c5.667,1,2.78,10.056,2.125,12.625-.75,2.938-2,5.188-5.956,4.523-3.058-.514-3.42-3.643-2.545-8.458s1.5-9.55,6.375-8.69Zm-48.09,53.072,7.086,2.22-1.333,3.5h-2.21v1.708L1082,189.5l-.808,2.667-6.39-1.7,2.112-10.02m-9.284,66.928,3.5,1L1068.53,261l-4.025-1.125Zm-3.88,19,4.062,1.125-2.03,9.125,20.968,3.75-.75,3.75-25.125-4.5Zm-2.87,16.75,17.375,2.75-.75,3-4.188-.812.313-1.907-.906-.156-.876,4.844-6.47-1.25.97-4.906-2.063-.375-.468,1.968-3.53-.81.593-2.345Zm19.08,3.208,11.375,1.875-.375,1.5-2.625-.458-.29,1.594,2.582.49-.417,1.916-11.083-2.406.833-4.51Zm32.23,4.917,8.688,1.188-.875,5.437-8.688-1.375Zm47.44,28.773,1.456-7.356,8.75,1.666-1.113,5.69Zm1.7-44.19,7.834,1.75-1.584,9-8.083-1.75Z"/> <rect id="Rectangle_1" data-name="Rectangle 1" class="cls-2" width="8.916" height="21.833" rx="3.51" transform="matrix(0.256, -0.967, 0.967, 0.256, 1197.951, 281.651)"/> <path id="Path_4" data-name="Path 4" class="cls-2" d="M1261.43,315.993l8.4-10.16,8.876.21v7.29L1274,319l-12.568-3.007M1245.48,320c-.636-2.893-1.91-7.7-1.91-7.7l-3.905.122,1.582,7.583ZM1280,108.36l-13.625-3.11s2.25-8.625,2.25-9l11.367,2.292Zm0-90.61-9.75-1.625L1272,4.25l4.125.75-.5,3.875s-1.878-.433-2.282,2.313c-.468,3.187,6.126,3.406,6.46,1.218.447-2.916-1.115-3.312-1.115-3.312l.562-3.344.75.1ZM0,297.13l8.552,7.58.7-23.21c-.33.494-5.657,5.878-9.25,9.49Zm496.5-58.8C497.667,239.167,524,252,524,252l-10.5,21.667-16-10-6,7.666-3.333-1.254-3.834,5.624-4.37-2.7a9.792,9.792,0,0,0,1.037-2.92,7.855,7.855,0,0,0,0-3.08ZM526,252.667l-10.833,22,6.5,1.833,6.5-2.333,16,7.833,8.333-16.167ZM578.375,41.25l5.5,6.5-4.625,4.875H573.5l-3.875-4Zm-28.519,15-1.94,4.855,11.89,13.053-2.24-7.77-7.71-10.14M522.165,25.016l-2.582,6.067,3.167,3.084,4.764-3.115-5.35-6.036M507.37,8.32l-1.2,5.3,3.583,4.3,2.732-3.828-5.112-5.77"/> <path id="Path_5" data-name="Path 5" class="cls-2" d="M515.917,9l-4.756,3.6,6.408,7.23,2.6-3.078L515.919,9Zm10.107,155.054L521,161.5l-1.667,4,7.834,8.167,2.5-4.5-3.643-5.113M250.692,228.065,244,225.75,241,233l6.3,2.342,3.388-7.277M9.38,0l6.245,4.878,4-4.875L9.382,0Zm626.987,17.92L640,19.827l6-5.413-3.26-2.194-6.373,5.7M1154.33,252.5,1153,261l-16.167-2.333,2-9.667,15.5,3.5Zm-99.54,32.93-4.954-1.3-2.5,10.438,5.244,1.348,2.21-10.48M1048.67,280l-1.334,5.167-3.666-1.042,1.5-4.958Zm-12.5,9,5.666,1.844-1.166,3.72,3,1.347,2.5-6.91,1.166.792-2.5,10.54-11.166-3.665,2.5-7.667Z"/> </g>
        <g id="река"> <path id="Path_6" data-name="Path 6" class="cls-3" d="M155.526,0c-.39.5-.792,1.068-1.264,1.78-.175.262-.12,1.695-.293,1.97-.223.35-1.408.716-1.63,1.084A48.444,48.444,0,0,0,146.876,18c-2.125,8.25.625,32.5,2.125,42.75s-1.18,17.663-1.875,20.875S127,106.875,125.376,108.75s-20.5,19-22.25,21.5-9.625,28.5-10.875,32.875-3.25,32-3.625,34.5-12,24.5-12.5,26.5S80,232.75,83.25,237.25s2.625,12.5,3.125,15.417,3.875,12.958,2.75,16.083C88.1,271.6,36.955,312.65,27.783,320h4.81c10.8-8.544,57.6-45.682,59.032-49,1.625-3.75-.5-9.75-1.75-16.5s-2-15.125-2.25-17.75-6.5-6.5-7.75-10.75,10.25-23.625,11.5-27.75,3-27.75,3.75-32.5,9-30.375,10.375-33.625,15.875-15.625,22.625-22.375S138.75,96.875,147.5,86s4.75-25.375,4-35.875-2.625-24.5-.625-34.25a25.02,25.02,0,0,1,3.54-8.815c.273-.43.122-1.917.4-2.31.15-.21,1.3-.2,1.448-.4A22.51,22.51,0,0,1,160.25,0ZM893.375,15.625c-1.625-.375-1.375,2.75-1.75,3.5a6.46,6.46,0,0,1-4.34,3c-2.216.25-3.035,1.625-4.785,4.25s-3.25,3.375-4.125,3.375-1.75,2.125-3.875,3.125-1.375-1-1.25-6.875,2.424-9.322,1.25-11.125c-2.237-3.436-7.75,2.875-9.125,3.125S863,16.125,861.75,15.875,860.125,17.5,858.5,17.5s-4-4.375-5.375-4.75-1.75,2.75-3.5,3.375-2.875-4-4.875-6-2.125-3.625.375-5.75,13.5-3.125,15.75-3.125,3.25,5.375,5.125,5.125,1.875-1.875,5.125-3.25,5.75-.125,5.5-1.375c-.107-.535-1.316-1.185-2.662-1.753H868.6c-1.1.9-2.557,1.933-3.6,2-1.07.07-1.976-1.038-2.558-2h-4.1a46.089,46.089,0,0,1-5.47,1C845.25,2,842,4.5,841.5,7.125s2.75,4.5,3.75,6.375.75,7.625,3.5,7.875,4.125-3.75,5.375-4.5,3.125,1.5,3.625,2,3,0,4.375,0,1.75,1.875,2.625,2.75,1.5-.625,4.625,1.625,1.875,9.375,2.125,11,2.375,1,3.25.875,4.125-5.375,5.875-2.875-1.208,5-2,7.625-.48,5.6-.125,14.5c.125,3.125-3.875,17.75-4.625,19.25s-10.375-3.875-12-3.875S860,71.5,854.25,71s-5.625-1.75-5.75-3.25-1.75-.375-4.75,1.25-3.25,2.5-3.375,7.667-.75,8.333.5,8.083S842,80.5,843.25,78.125s3.5-1.5,4.375-.375,2.625,6.5,3.75,6.375-.125-3.125,0-5.25,7.625-5.625,8.75-6.5,4.125-.375,5.125.25,8,6.875,8.925,10.5S875,87.5,877,88.875s3.375.25,2-1-4.375-5.25-4.75-8.125.75-2.625,1.375-3.75.625-2.125,1.25-6.875a57.055,57.055,0,0,1,2.99-11.625c1.26-3.5.135-10.75.01-14.5s1-4.125,2.25-5.375,1.25-3.25,1.25-5.75,2.625-5.5,5.25-6.625,4,1.5,4.75,1S894.262,15.83,893.375,15.625Z"/> </g>
        <g id="вспомогательные_дороги" data-name="вспомогательные дороги"> <path id="Path_7" data-name="Path 7" class="cls-4" d="M62.352,229.988l10.22,7.42a70.12,70.12,0,0,0,1.845,8.465c.878,2.507,4.62,10.482,4.78,10.82l.2.432h5.1a.75.75,0,0,0,0-1.5H80.352c-.805-1.726-3.78-8.137-4.52-10.248A75.128,75.128,0,0,1,74,236.864l-.048-.305L62.577,228.3l-9.21,3.5-13.25,4.875a.751.751,0,1,0,.517,1.41l10-3.68c3.548,9.1,8.7,23.127,8.617,25.194-.068,1.66-5.592,3.772-9.3,4.677a.75.75,0,1,0,.356,1.458c1.72-.42,10.305-2.68,10.447-6.072.123-2.97-7.4-22.412-8.708-25.775l1.85-.68ZM156.782,79.12c.17.02.4.033.668.046,1.527.075,3.18.26,3.474,1.5.41,1.753.126,6.99-.018,8.862a.75.75,0,0,0,.69.805c.02,0,.04,0,.06,0a.75.75,0,0,0,.745-.693c.023-.284.533-6.982-.016-9.318-.576-2.45-3.47-2.594-4.86-2.662a3.758,3.758,0,0,0-.464-.01,9.928,9.928,0,0,1-1.588-3.61.75.75,0,1,0-1.444.405c.575,2.044,1.52,4.512,2.754,4.666Zm-1.24,5.564-28.89,38.365a.75.75,0,0,0,1.2.9l28.89-38.364a.751.751,0,0,0-1.2-.9Zm49.888,192.3a.75.75,0,0,0,1.057-.084l6.44-7.562c4.147,1.81,10.008,4.528,14.182,6.51a.75.75,0,1,0,.643-1.355c-5.065-2.4-10.788-5.065-14.808-6.776l-.005,0c-2.666-1.134-4.588-1.855-5.046-1.793-.814.116-2.535,1.728-8.005,7.5-.99,1.046-2.014,2.124-2.272,2.35a.75.75,0,0,0,.382,1.4c.406,0,.406,0,2.978-2.713,2.01-2.12,6.134-6.47,7.13-7.026a27.836,27.836,0,0,1,3.378,1.292l-6.14,7.21a.75.75,0,0,0,.084,1.057ZM390.885,97.422c-2.516-.932-6.314-8.882-7.565-11.867a.75.75,0,1,0-1.383.58c.486,1.16,4.85,11.368,8.428,12.693,3.4,1.26,34.425,1.464,37.95,1.483h.005a.75.75,0,0,0,0-1.5c-9.51-.05-34.772-.4-37.44-1.388Z"/> <path id="Path_8" data-name="Path 8" class="cls-4" d="M218.344,293.177a15.519,15.519,0,0,0,4.872,1.19,2.294,2.294,0,0,0,1.648-.5c1.2-1.2,9.387-20.424,10-22.058.87-2.306.132-9.862.045-10.716a.75.75,0,0,0-1.493.153c.227,2.223.677,8.36.045,10.033-.92,2.436-8.708,20.41-9.655,21.52-.428.312-2.772-.17-4.917-1.015a.751.751,0,0,0-.55,1.4Zm492.979-45.152a.75.75,0,1,0-1.367.617,88.1,88.1,0,0,1,3.357,8.393c.638,2.575.984,6.07.044,8.157-.986,2.193-4.347,3.718-4.333,3.718-3.625,1.1-7.31,1.69-7.855,1.283-.6-.67-2.892-6.438-5.42-13.14l2.56-1.536,5.157-2.334a.75.75,0,0,0-.618-1.366l-5.236,2.373-2.4,1.44c-1.7-4.53-3.453-9.342-4.84-13.22a.751.751,0,0,0-1.414.506c1.194,3.334,3.057,8.492,4.936,13.5l-4.615,2.77a.75.75,0,1,0,.772,1.287l4.38-2.632c2.547,6.74,5.01,12.873,5.758,13.482a3.19,3.19,0,0,0,1.947.457,30.265,30.265,0,0,0,7.41-1.47c.16-.072,3.95-1.776,5.18-4.506,1.378-3.066.38-7.766.043-9.133a86.657,86.657,0,0,0-3.447-8.65ZM614,160.9l-.008,0c-.005,0-.007.01-.012.015a21.115,21.115,0,0,0-1.932,2.058c-3.472-1.785-7.044-3.78-7.472-4.293-1-1.2-60.71-30.248-61.21-30.42a.742.742,0,0,0-.94.458.758.758,0,0,0,.442.96c.437.168,58.2,28.27,60.6,30.017a9.3,9.3,0,0,0,1.6,1.153c-2.76,5.442-6.987,13.64-7.587,14.435a.75.75,0,0,0,.933,1.167c.195-.13.654-.443,7.947-14.834,1.584.91,3.444,1.89,4.738,2.558-7,9.387-12.7,27.037-12.98,27.918a.75.75,0,0,0,1.428.457c.07-.216,6.017-18.64,12.97-27.756a.747.747,0,0,0,.65-.407.735.735,0,0,0,.056-.482c.38-.46.764-.894,1.15-1.29,3.993,5.155,9.914,13.06,10.22,14.145-.06,1.847-9.69,19.3-15.745,29.862a.75.75,0,0,0,1.3.746c6.16-10.745,16.413-29.047,15.907-30.9-.48-1.76-8.145-11.734-10.577-14.87.173-.146.345-.295.518-.423,8.545-6.356,14.54-11.732,14.6-11.786a.75.75,0,1,0-1-1.114c-.06.053-6.006,5.386-14.49,11.7a14.017,14.017,0,0,0-1.1.93ZM549.523,54.744a.75.75,0,0,0-1.06-.048l-57.94,52.892a.75.75,0,1,0,1.01,1.107l57.943-52.89a.75.75,0,0,0,.047-1.06ZM477.052,28.9c1.864,2.665,20.94,22.637,24.45,26.307L484.865,70.244c-1.97-1.393-9.39-3.564-11.454-3.733a2.223,2.223,0,0,0-.965.08,30.954,30.954,0,0,1-4.7-4.8.75.75,0,1,0-1.15.963c2.024,2.42,4.682,5.32,5.846,5.38a.96.96,0,0,0,.576-.144c1.34-.123,8.937,2.234,10.724,3.27l-13.8,12.467a.75.75,0,0,0,1.007,1.112L528.84,32.535a.75.75,0,0,0-1.007-1.113L502.617,54.2c-.945-.988-3.15-3.3-5.885-6.174L504,41.56a.751.751,0,0,0-1-1.12l-7.3,6.5c-6.87-7.24-16.2-17.158-17.42-18.9-2-2.858-11.97-14.427-12.393-14.918a.75.75,0,0,0-1.136.98c.1.12,10.346,12,12.3,14.8ZM740.17,42.988a.75.75,0,0,0,.03-1.5c-.727-.03-17.826-.738-19.325-.738a.75.75,0,0,0,0,1.5c1.467,0,19.085.73,19.263.738ZM782.8,113.55a.78.78,0,0,0-.563.93.717.717,0,0,0,.883.533c1.18-.123,16.15,2.39,25.31,3.976a.775.775,0,0,0,.13.01.75.75,0,0,0,.127-1.49c-9.234-1.6-24.88-4.228-25.888-3.96ZM892.734,176.6l9.18-2.166,27.3,5.45,6.657-33.935-12.52-3.207,3.118-16.36,8.406,1.655,2.246-8.338a.751.751,0,1,0-1.45-.39l-1.88,6.985-8.513-1.677-3.636,19.092-1.823,8.087-17.7-5.39a.75.75,0,1,0-.437,1.435l19.25,5.86,2.136-9.484,11.06,2.833-2.173,11.086-8.917-1.958a.75.75,0,0,0-.322,1.465l8.95,1.965-3.63,18.51-26.148-5.22-9.5,2.242a.75.75,0,0,0,.344,1.46Zm193.386,84.764a.754.754,0,0,0,.867-.61c.278-1.61,1.087-6.97-.182-8.38-1.212-1.348-10.016-4.413-12.923-4.23a1.712,1.712,0,0,0-1.325.595c-.89,1.28-2.62,11.537-3.3,15.74l-9.64-2a.751.751,0,1,0-.305,1.47l9.75,2.02c-.16,1.86-.456,6.18.127,7.464.36.794,1.622,1.727,12.08,2.756l.526.054a1.59,1.59,0,0,0,.18.012c.618,0,1.783-.573,3.01-7.63a.75.75,0,0,0-1.477-.256c-.455,2.62-1.247,5.683-1.757,6.36l-.335-.032c-9.26-.912-10.684-1.723-10.86-1.885-.372-.82-.19-4.782.06-7.346,1.118-6.99,2.572-14.673,3.134-15.8,1.5-.5,11,2.67,11.94,3.71.527.586.332,4.155-.18,7.12a.75.75,0,0,0,.61.868Z"/> <path id="Path_9" data-name="Path 9" class="cls-4" d="M1280,4.687V3.163l-11.3-2.052.21-1.11h-1.526c-.053.278-.11.57-.16.843L1262.58,0h-8.394l12.755,2.316c-.8,4.223-1.475,7.818-2.037,10.865l-28.98-5.638L1237.27,0h-1.522l-6.408,36.063-1.49-.263L1234.268,0h-1.524l-.294,1.643L1224.76,0h-4.346c-.872,8.225-2.143,17.23-2.83,18.686a50.871,50.871,0,0,1-8.374-1.267l2.17-11.32,3.335-5.723a.73.73,0,0,0,.09-.377H1213.2l-2.91,5c-3-.568-17.324-3.27-27.733-5h-10.073a.742.742,0,0,0,.267.08c.622.058,1.433.157,2.38.287l-1.46,8.933-17.495-3.357-.085.813c-.086.823-.837,8.063-.837,8.91,0,.83,0,1.174,16.5,4.052l.943.164h.006c7.276,1.26,15.215,2.535,15.82,2.535.654,0,1.747,0,2.063-9.225l.02-.64-15.463-2.97,1.473-9c4.968.733,12.61,2.072,19.39,3.3l-4.62,25.48-19.41-3.43c-1.017-.215-11.63-2.447-23.38-4.848C1151.861,6.326,1152.767,1.587,1153,0h-1.492c-.453,2.754-2.727,13.286-4.386,20.782-6.418-1.308-13.063-2.642-18.59-3.708L1132.29,0h-1.535l-3.694,16.792c-5.514-1.053-9.69-1.79-11.012-1.874a.775.775,0,0,0-.8.7.75.75,0,0,0,.7.8c1.32.085,5.728.87,11.52,1.983h.005c4.96.955,10.936,2.15,16.87,3.354L1139.725,43.4l-32.75-5.705a.75.75,0,0,0-.257,1.478l7.537,1.314c-.56,2.374-2.26,9.52-2.8,11.255-.228.736-3.755.493-7.25-.5a.75.75,0,1,0-.41,1.443,23.7,23.7,0,0,0,5.84.99c1.58,0,2.9-.367,3.253-1.488.572-1.83,2.31-9.154,2.852-11.445l23.675,4.124-5.683,26.606-32.38-6.943a.75.75,0,1,0-.314,1.466l32.38,6.943-3.52,16.483-32.4-6.638h0l0,0-7.643-1.485,5.525-22.407,6.816,1.586a.761.761,0,0,0,.17.02.75.75,0,0,0,.17-1.48l-6.836-1.59c.783-4.2,1.595-8.65,2.3-12.745l7.257,1.407a.75.75,0,0,0,.285-1.472l-7.29-1.413c1.223-7.22,2.044-13.01,1.665-13.69-.195-.354-.8-1.416-18.26-4.2l3-15.694a.75.75,0,1,0-1.472-.28l-3.146,16.474v0l-5.145,26.94h-1.964l-25.573-5.483,1.547-8.655c9.7,2.144,13.143,2.586,14.428,2.586.59,0,.73-.093.82-.155l.3-.227.053-.317c.122-.73,2.08-12.4,2.19-13.067l1.885-8.052.035.008.137-.752c2.3-12.478,1.666-12.6.867-12.762a.75.75,0,0,0-.76,1.168c.11,1.022-.613,5.95-1.445,10.57-4.258-.872-9.413-1.948-14.228-2.98l1.943-10.878a.75.75,0,1,0-1.476-.264L1051.7,14.315c-6.79-1.465-12.62-2.79-13.814-3.237-.262-1.134-.128-6.242.167-10.79a.746.746,0,0,0-.04-.29h-1.4a.713.713,0,0,0-.052.192c-.712,10.955-.028,11.7.2,11.94.163.178.6.638,14.68,3.675l-1.57,8.792v0l-.318,1.777L1009.6,17.764a.75.75,0,1,0-.317,1.466l40.008,8.625-1.732,9.69v0l-6.136,34.338-17.3-3.36-23.5-4.568L980.328,59.7c.954-4.24,5.7-25.494,6.75-32.588,1.2-8.17-2.378-13.3-4.62-15.63-1.04-1.083-11.373-3.543-22.53-5.94-.007,0-.012-.005-.02-.007h-.016c-3.03-.65-6.117-1.3-9.1-1.908L951.583,0h-1.536l-.724,3.324C941.982,1.826,935.51.57,932.515,0h-2.63a7.4,7.4,0,0,0-1.146,2.165,9.592,9.592,0,0,1-1.412,2.684c-1.124.407-9.892-1.282-17.72-3.146a.75.75,0,0,0-.348,1.46c7.906,1.88,17.6,3.918,18.905,2.92a8.608,8.608,0,0,0,1.958-3.34,13.717,13.717,0,0,1,.713-1.542c1.762.29,9.37,1.764,18.17,3.57l-8.166,37.455L938.926,51l-39.634-8.14a.75.75,0,1,0-.3,1.47l39.618,8.137-6.578,30.17-37.892-7.662a.76.76,0,0,0-.884.587.75.75,0,0,0,.587.884l37.87,7.658L924.5,117.16a.75.75,0,1,0,1.466.32l7.37-33.81v0l6.736-30.9,39.187,8.234h0l21.055,4.425,22.8,4.43-1.734,9.828c-7.9-.755-8.583.067-8.8.343-.634.795-1.833,5.657-2.47,8.38l-.02,0-.15.745,0,.016v0l-2.5,12.293v0l-.6,2.73-13.358-3.31a.75.75,0,1,0-.36,1.455l13.4,3.322-1.164,5.315,0,0v0c-1,4.56-2,9.12-2.08,9.535-.18.9-.294,1.557,27.03,7.134l-8.876,44.43-80.838-17.653c1.524-7.31,2.64-12.513,2.85-13.115a.75.75,0,0,0-1.33-.687c-.507.884-7.86,37.114-11,52.65a.75.75,0,0,0,.587.883.781.781,0,0,0,.15.016.75.75,0,0,0,.734-.6c2.35-11.645,5.42-26.7,7.7-37.674l94.68,20.676-.008.03.758.133c.153.026,15.334,2.666,16.8,2.992.29.064.427.275.59.794-1.416,6.816-2.4,11.806-2.336,12.247.184,1.29,1.814,3.54,2.14,3.978a.75.75,0,1,0,1.206-.893,12.663,12.663,0,0,1-1.855-3.224c.014-.53.785-4.43,1.954-10.06.04.028.067.065.11.09,1.036.55,17.687,4.456,21.014,5.233a.769.769,0,0,0,.172.02.75.75,0,0,0,.17-1.48c-7.516-1.756-19.77-4.693-20.648-5.1-.155-.082-.277-.522-.376-.874v-.006c2.146-10.27,5.327-25.017,7.782-36.266a.75.75,0,1,0-1.465-.32c-1.84,8.43-5.11,23.49-7.453,34.683a2.045,2.045,0,0,0-.677-.287c-1.324-.294-12.967-2.327-16.11-2.875l7.007-34.874a.75.75,0,1,0-1.47-.3l-7.01,34.88-12.363-2.7,9.025-45.183v0l.362-1.812c20.127,4.526,24.238,5.16,25.224,5.16a.638.638,0,0,0,.34-.06c.392-.2.984-.493,3.272-13.78,2.032.415,7.835,1.6,13.64,2.78,3.6.73,7.2,1.457,9.905,2,5.233,1.043,5.236,1.042,5.393.277a.753.753,0,0,0-.712-.9c-1.075-.152-16.967-3.38-27.954-5.63l.308-1.557,2.89-14.612,5.49,2.92c-.338,1.36-.66,2.625-.917,3.632a40.225,40.225,0,0,0-1.067,4.536.733.733,0,0,0,.714.73h.036a.77.77,0,0,0,.75-.7c.03-.3.512-2.2,1.022-4.2,3.46-13.58,3.474-15.07,2.644-15.624a54.928,54.928,0,0,0-6.44-2.568l1.8-9.107,28.582,5.554,33.122,6.787h0L1154.1,95.92l-11.918,53.347c-1.63-.433-5.508-1.47-7.31-1.983-2.448-.7-16.78-1.525-17.538-1.525h-.01a.75.75,0,0,0,.014,1.5c.617,0,14.907.833,17.123,1.466,1.834.525,5.8,1.583,7.394,2.008l-1.74,7.784-49.6-9.062a.75.75,0,0,0-.27,1.475l16.317,2.98-4.923,27,13.065,3.045-3.453,17.323-21.272-4.67a.751.751,0,1,0-.323,1.466l21.31,4.677-4.244,22.47-37.748-7.152a.75.75,0,0,0-.28,1.474l6.71,1.272-5.445,25.753.67.192c2.586.75,14.454,4.11,18.88,4.11a3.66,3.66,0,0,0,1.273-.166c2.784-1.112,3.692-9.045,3.845-10.623a.75.75,0,1,0-1.492-.146c-.345,3.55-1.477,8.8-2.908,9.377-1.517.6-11.5-1.8-18.51-3.8l5.163-24.42,41.077,7.785-7.6,35.74v0l-3.763,17.7c-2.85-.61-6.648-1.43-6.988-1.53a.75.75,0,0,0-.467,1.425c.332.112,4.78,1.068,7.144,1.573l-.848,3.99a.743.743,0,0,0,0,.318l-11.106-1.776c-.59-.56-2.69-.806-6.26-.717a41.17,41.17,0,0,1,1.134-4.72,1.822,1.822,0,0,0-.14-1.6,4.054,4.054,0,0,0-2.433-1.486l2.6-12.9a.75.75,0,0,0-1.47-.3L1084.86,279l.78.117a3.753,3.753,0,0,1,2.14.935.332.332,0,0,1,.014.32,51.386,51.386,0,0,0-1.368,5.872l-.163.915.928-.035a31.7,31.7,0,0,1,5.91.208c-.06,1.28-.016,4.432.01,6.024l-38.732-6.168a.75.75,0,0,0-.236,1.48l22.99,3.662-4.557,25.535-23.518-5.214a.75.75,0,1,0-.325,1.465l26.53,5.882h6.932l-8.153-1.808,4.575-25.624,30.02,4.78-2.71,15.9v.011l-1.15,6.743h1.522l.977-5.74,10.4,1.882-.7,3.858h1.524l4.942-27.454,13.056,1.674-1.84,15.427-10.73-1.39a.75.75,0,1,0-.194,1.487l10.776,1.4-.664,8.86h1.5l.65-8.666,14.03,1.818-.517,6.848h1.505l.56-7.415,2.726-16.082,2.3.294,17.134,2.2a.76.76,0,0,0,.84-.65.75.75,0,0,0-.648-.838l-16.386-2.1,7.61-57.593,21.427,4.06a15.644,15.644,0,0,0-1.81,3.58c-.5,2.123-8.662,49.528-9.01,51.545a.75.75,0,0,0,.613.866.76.76,0,0,0,.128.01.75.75,0,0,0,.74-.622c.084-.493,8.5-49.377,8.99-51.455a18.012,18.012,0,0,1,1.93-3.624l56.253,10.66-11.673,57.273-1.32,9.894h1.512l1.287-9.645.967-4.752c2.786.362,13.01,1.653,17.234,1.653.17,0,.328,0,.476-.006,3.372-.1,17.284-.562,23.37-.767l-.016,1.256a.75.75,0,0,0,.74.76h.01a.75.75,0,0,0,.75-.74c0-.08.008-.587.017-1.327l1.37-.046a.75.75,0,0,0-.025-1.5h-.025l-1.3.045c.026-2.714.046-6.572-.034-7.854-.05-.756-.113-1.792-12.42-4.99-4.66-1.213-9.348-2.276-11.083-2.663l1.28-6.98,24.473,5.82v-1.54l-24.2-5.757,4.6-25.106,19.6,3.714v-1.527l-19.34-3.666,5.893-35.573c1.283.085,2.37.127,3.245.127,1.552,0,2.465-.13,2.73-.393.95-.94,2.013-5.335,2.49-7.493,1.655.36,3.323.73,4.982,1.1v-1.54c-26.65-6-27.35-4.807-27.65-4.288-.73,1.27-3.39,17.255-4.2,22.22l-27.644-8.067,9.3-44.053,30.86,5.638c-.3,3.506-1.03,12.4-.725,13.77.114.51.412,1.82,20.065,5.527v-1.533c-8.864-1.7-17.353-3.637-18.624-4.48-.14-1.4.356-8.224.766-13.013l3.13.573a.735.735,0,0,0,.52.393.759.759,0,0,0,.134.012.745.745,0,0,0,.5-.2l13.577,2.48v-1.524l-13.15-2.4,1.595-8.828c3.846,1,8.617,2.234,11.555,2.96v-1.545c-3.835-.955-10.73-2.744-16.077-4.147.493-3.266,1.04-6.9,1.57-10.47l8.8,1.743h0l5.7,1.13v-1.53l-4.68-.927,1.418-7.234a28.98,28.98,0,0,0,3.262.857v-1.53a30.786,30.786,0,0,1-3.577-1.02l-.823-.3-1.752,8.93-3.38-.67c.317-2.353,1.115-8.312,1.115-8.9,0-.435-.01-1.152-4.35-2.39.3-2.086.536-3.792.683-4.938l12.084,2.9v-1.542l-11.918-2.862v-.023c0-1.032,2.173-15.965,3.707-26.253l8.21,1.89v-1.54l-9.455-2.176-.006.04-30.11-5.363c-3-.56-18.1-3.644-21.563-4.352l4.386-24.692c24.69,6.03,31.36,7.165,33.3,7.165.667,0,.774-.133.866-.248.373-.467,1.87-8.21,3.7-18.313L1280,71.443V69.911l-18.616-3.9c1.242-6.9,2.614-14.743,3.882-22.08L1280,46.537V45.013l-49.185-8.688,4.85-27.3,28.972,5.637c-.36,1.97-.67,3.682-.936,5.19-2.92-.527-13.512-2.44-14.22-2.582a.75.75,0,1,0-.294,1.47c.73.146,11.31,2.058,14.256,2.59-1.522,8.724-1.37,9.12-1.305,9.288.305.763,1.29.815,2.923.9,1.447.077,3.87.2,4.16,1.062.792,2.33,7.064,5,10.78,5.794V36.84c-3.546-.822-8.863-3.29-9.36-4.75-.617-1.82-3.326-1.962-5.5-2.076-.518-.028-1.182-.062-1.555-.126.1-1.138.675-4.578,1.465-9.03l0-.006v-.008c.362-2.04.77-4.29,1.2-6.63l0-.008V14.2c.7-3.815,1.457-7.863,2.167-11.613ZM1172.2,18.28c-6.907-1.208-13.743-2.493-15.424-3.05.093-1.277.442-4.787.722-7.506l15.93,3.057Zm16.862-4.5a34.864,34.864,0,0,1-.822,7.107c-1.564-.182-7.93-1.205-14.563-2.353l1.223-7.473Zm-136.155,2.34c3.77.806,8.428,1.78,14.19,2.958l-1.718,7.34-13.9-2.31Zm-1.69,9.464,13.868,2.308-1.986,11.84c-1.73-.08-8.04-1.3-13.946-2.6ZM950.477,5.076c2.76.568,5.61,1.165,8.41,1.764-1.833,9.256-4.07,19.322-4.7,20.248-.6.443-4.3-.08-8.263-1.15Zm1.23,48.607L940.4,51.307l1.754-8.043c4.2.887,8.782,2.053,9.61,2.575a52.7,52.7,0,0,1-.055,7.843Zm27.155,5.706-25.67-5.4c.188-3.214.373-8.042-.132-8.945-.165-.294-.662-1.173-10.59-3.252l3.14-14.39a32.582,32.582,0,0,0,7.4,1.3,3.05,3.05,0,0,0,2.324-.655c1.062-1.308,3.947-15.478,5.02-20.9,10.523,2.27,20.017,4.51,21.024,5.365.15.157.31.333.472.518-1.594,1.688-6.334,6.772-6.95,8.157-.72,1.622-4.02,17.667-4.05,17.825a.75.75,0,0,0,.59.882.722.722,0,0,0,.146.015.75.75,0,0,0,.735-.6c.375-1.886,3.37-16.21,3.95-17.508.412-.93,3.99-4.894,6.518-7.578a16.874,16.874,0,0,1,2.8,12.664c-1.038,7.054-5.79,28.314-6.73,32.5Zm115.366-2.305-5.92-1.377,2.326-12.453,5.87,1.138c-.743,4.32-1.572,8.91-2.276,12.692Zm-12.864-30.3c7.652,1.228,15.79,2.805,17.2,3.507.04,1.25-.77,6.53-1.806,12.627l-7.32-1.42-2.592,13.874-10.473-2.435Zm-56.77,43.367,16.546,3.215-4.408,22.07-6.9-1.818c1.006-3.916,1.883-8.463.867-9.478-.935-.935-5.936-3.225-7.852-4.083Zm-10.878,10.887c.818-.3,4.75-.135,8.095.2,2.73,1.21,7.178,3.314,7.785,3.91.342.678-.33,4.582-1.215,8.087L1011.563,88.8a62.66,62.66,0,0,1,2.152-7.76Zm-2.47,9.227,17.48,4.613h0l7.71,2.034-1.972,9.87-25.415-5.736Zm19.343,35.923c-9.2-1.882-23.16-4.9-25.743-5.878.277-1.287,1.024-4.705,1.8-8.26l25.6,5.844Zm-23.62-15.6,1.77-8.072,25.433,5.74-1.632,8.17Zm52.944,4.367-.018,0-.13.765c-.966,5.65-2.18,11.855-2.7,13.365-2.485-.294-15.75-3.177-24.492-5.14l3.067-15.355,24.447,5.517Zm.46-2.323-24.443-5.517,3.574-17.894,24.344,5.858Zm11.853-21.112c.07,1.1-.85,5.173-1.783,8.983l-5.557-2.954,1.632-8.246c2.063.728,4.81,1.75,5.708,2.218Zm-8.088,2.086-24.34-5.857,2.816-14.092,24.53,4.767Zm3.3-16.655-24.54-4.77,4.186-23.43,24.878,5.336Zm1.472.286,4.547-22.98h1.96l18.5,4.3-5.54,22.46Zm149.38-57.175c.467-.19,1.55-.628,3.542-19.148l10.36,2.213-5.812,32.42-19.648-3.472,2.218-13.17c2.912.608,8.2,1.62,9.34,1.157Zm-20.8-15.907c5.687,1.035,10.53,1.946,12.31,2.283l-2.047,10.675-.016,0-2.476,14.7-12.386-2.187ZM1172.4,27.529l33.34,5.89h.005l20.367,3.6-8.537,47.63c-2.834.018-8.57.043-9.184,0-.994-.07-1.32,1.175-1.828,3.446-.246,1.09-.7,3.122-1.062,3.422a8.474,8.474,0,0,1-2.98-.064c-1.59-.19-2.444-.274-2.966.118-.245.183-.885.688-2.172,9.788l-10.687-1.26-12.16-2.12c2.407-10.7,2.253-11.15,2.17-11.39a.75.75,0,0,0-1.45.362c-.023.75-1.117,5.945-2.2,10.77l-17.13-2.983,7.008-28.588,28.12,5.864c-1.367,4.8-2.888,9.9-3.18,10.452a.75.75,0,1,0,1.3.745c.455-.79,2.586-8.2,3.35-10.89l17.994,3.75a.76.76,0,0,0,.154.016.75.75,0,0,0,.152-1.484l-47.535-9.913.627-2.557Zm44.907,58.62-3.08,17.19-15.353-1.808a68.551,68.551,0,0,1,1.628-8.738,12.994,12.994,0,0,1,1.842.145c1.83.22,3.09.33,3.89-.116.86-.478,1.25-1.982,1.794-4.4a19.434,19.434,0,0,1,.6-2.265c1.47.034,6.533.008,8.685,0Zm-71.483-64.1c11.343,2.31,22.2,4.58,25.1,5.19l-5.077,20.708-24.64-4.292Zm-14.455,67.674,3.675-17.2,5.852-27.4,24.6,4.284-2.857,11.654c-3.455-.795-11.628-2.625-12.737-2.443a.732.732,0,0,0-.6.832.77.77,0,0,0,.833.648c.727-.08,6.624,1.147,12.146,2.42l-2.2,8.987-12.248-2.08a.751.751,0,0,0-.252,1.48l12.142,2.06-2.372,9.677-11.952-2.38a.75.75,0,0,0-.293,1.47l11.888,2.368-2.537,10.352Zm24.214,6.47,30.9,5.384,11.438,1.35h.006l16.034,1.89-.018.1h.228l.58,5.072-1.42,10.11,0,0v0l-3.77,26.81-19.923-3.486a.75.75,0,1,0-.26,1.477l12.7,2.222-.8,11.85a3.591,3.591,0,0,0-.077,1.86.7.7,0,0,0,.028.088c.01.017.01.04.02.055a.537.537,0,0,0,.095.14.283.283,0,0,0,.05.048l.033.027a.727.727,0,0,0,.213.135,22.436,22.436,0,0,0,4.756,1.382l-2.554,7.44-1.778-.324h-.007l-18.312-3.346c.72-4.473,2.515-15.676,2.515-16.294a.826.826,0,0,0-.486-.744c-1.138-.61-9.6-2.178-13.186-2.825-12.024-2.17-12.392-1.923-12.66-1.744a.75.75,0,0,0,.585,1.354c1.91-.056,21.108,3.483,24.192,4.407-.276,2.038-1.517,9.87-2.436,15.575l-40.67-7.43Zm49.294,58.485a20.083,20.083,0,0,1,3.588.025l-.31,2.2,23.1,2.5-1.052,6.1c-9.9-1.61-25.06-4.284-27.505-5.26l.077-1.154a16.567,16.567,0,0,1,2.1-4.407Zm-1.81.047.493-7.34,5.79,1.014-.675,4.813c-1.843-.134-3.886-.19-4.517.14a4.237,4.237,0,0,0-1.09,1.374Zm6.79.85.973-6.918,21.624,3.783-.946,5.482Zm1.182-8.4,2.283-16.242,22.127,4.165-2.26,13.09v0l-.48,2.778Zm23.02,4.793v-.006l.47-2.72,14.8,3.173-1.628,8.25-14.71-2.528Zm.725-4.206,1.332-7.72c2.277.513,9.737,2.5,14.886,3.906l-1.38,6.995Zm1.586-9.19.545-3.16,15.06,3.618-.68,3.443c-4.317-1.175-12.246-3.314-14.925-3.9Zm.763-13.233-1.43,8.28-22.172-4.172,1.18-8.384,22.594,3.283-.172.994Zm-95.894,34.9,59.445,10.862a28.207,28.207,0,0,0-3.537,7.916c-.6,2.98-1.56,9.234-1.913,11.565-5.78-2.223-16.142-3.93-20.085-4.53l-2.232-.538v0l-.64-.152-.05-.01,0,0c-18.24-4.33-19.21-3.523-19.53-3.258-1.055.88-2.176,6.993-2.754,10.587l-2.156,8.46c-.373,1.345-2.195,8.127-1.668,10.06.412,1.513,7.08,2.984,19.79,4.374-3.093,17.218-3,17.5-2.945,17.666.084.25.36,1.558.6,2.748l-40.715-7.715Zm48.412,49.19-17.145-3.337c.47-2.757.926-5.44,1.345-7.915l13.71,2.064a.724.724,0,0,0,.113.008.75.75,0,0,0,.11-1.492L1174.1,196.7c.652-3.86,1.194-7.09,1.522-9.053,7.678,1.2,15.8,2.992,19.74,4.515a.727.727,0,0,0,.366.178.715.715,0,0,0,.1.008c1.133.473,1.834.916,1.946,1.3.118,1.075-1.578,13.55-2.66,21.082l-2.023,7.93a27.675,27.675,0,0,1-6.013-.382,26.711,26.711,0,0,1-2.56-3.8c-.182-.372-.655-1.354-13.568-3.337.432-2.483.872-5.038,1.3-7.56l17.11,3.33a.769.769,0,0,0,.145.014.75.75,0,0,0,.144-1.487Zm-40.223-8.672,1.8-7.06,18.054,3.31c-.5,2.72-.957,5.232-1.38,7.556Zm18.206,5.282c-.547,3.006-1.03,5.678-1.46,8.052-8.48-.935-17.514-2.413-18.63-3.378-.23-1.238.727-5.578,1.5-8.5Zm-16.1-13.812c.653-3.886,1.58-8.132,2.073-8.917,1.438-.17,9.813,1.508,17.577,3.334-.585,3.178-1.127,6.13-1.632,8.888Zm-11.774-32.257-18.385,68.02-1.583-.3,18.69-67.953Zm-36.386,19.795,4.667-25.59,12.157,2.222-5.2,26.078ZM1108.2,225.5l4.38-23.2,3.733-18.738,0,0v0l5.357-26.884,15.327,2.8-18.685,67.943Zm11.232,3.655,1.628.308-7.19,35.047-1.877-.35Zm-12.525,58.937.9-4.224a.732.732,0,0,0,.213-1l3.664-17.24,1.888.35-4.653,22.676-2.1-.336a.742.742,0,0,0,.09-.225Zm11.038,26.58-10.412-1.885,2.84-16.675-15.75-2.508c-.035-1.907-.062-4.433-.035-5.724l14.762,2.36c1.237.346,9.826,1.676,12.617,2.1Zm32.276-3-14.067-1.825,1.84-15.43,14.83,1.9Zm5.843-16.45-33.11-4.245c-4.107-.625-10.48-1.63-12.565-2.038l4.655-22.69,43.778,8.1Zm2.954-22.365-43.673-8.074,7.188-35.04,41.152,7.8Zm5.93-37.593c-.184-.9-.4-1.91-.52-2.35.2-2.005,4.94-28.1,8.218-45.914l1.507.364c-3.032,18.127-7.625,44.94-8.15,46.308a10.23,10.23,0,0,1-1.054,1.592Zm22.494,5.252-21.51-4.077a12.637,12.637,0,0,0,1.414-2.1c.3-.605,1.734-8.476,3.347-17.724,5.62.87,11.595,2.043,12.527,2.623a28.226,28.226,0,0,0,2.8,4.1c.2.217.778.854,6.82.823a83.068,83.068,0,0,1-1.54,9.853,37.1,37.1,0,0,1-3.02,5.188q-.426.666-.833,1.31Zm1.586.3c.17-.27.342-.537.51-.8a35.914,35.914,0,0,0,3.182-5.523c.75-2.254,1.625-10.3,1.7-10.954l1.962-7.707,22.367,5.72-5.25,23.9Zm87.24,56.5c.067,1.36.047,5.07.022,7.677-6.05.2-20.048.672-23.43.768-.437.01-.98,0-1.594-.025l2.72-14.825c10.246,2.262,21.084,5.2,22.28,6.4Zm-26.51,8.336c-4.72-.316-11.89-1.208-14.262-1.512l10.4-51.017,13.043,2.473Zm3.823-98.368c1.727-.186,10.416,1.423,19.975,3.463-.64,2.893-1.523,6.01-2.017,6.674-1.38.37-10.85-.54-19.668-1.68.742-4.12,1.4-7.5,1.71-8.458Zm-4.083,22.35c.59-3.625,1.373-8.274,2.108-12.414q8.39,1.09,13.452,1.494l-5.863,35.4-13.038-2.47Zm-1.58.414-3.235,21.32-29.713-5.63,5.223-23.782Zm-28.857-9.956-22.382-5.726c1.116-7.758,2.826-20.11,2.55-21.062-.21-.73-1.16-1.436-2.568-2.1.287-1.91,1.323-8.738,1.958-11.875.59-2.92,2.88-6.7,3.657-7.923l26.058,4.76Zm9.555-45.4-23.284-4.254,2.537-7.39c4.145.88,10.94,2.136,22.078,3.94Zm1.475.27,2.648-15.338,14.675,2.522-3.045,15.423Zm36.905-2.49-1.616,8.936-3.076-.562c.218-1.433.747-4.9,1.4-9.236.824.216,1.964.514,3.293.86Zm-4.547-2.58a.737.737,0,0,0-.454.493.75.75,0,0,0,.263.78c-.5,3.274-.982,6.476-1.43,9.412l-14.985-2.738,7.59-38.45,13.03,3.13c-.485,3.783-2.273,15.828-4.014,27.374Zm7.624-19.45c-.107,1.115-.658,5.31-1.07,8.37l-3.28-.65c.473-3.172.923-6.228,1.3-8.85a17.557,17.557,0,0,1,3.048,1.13Zm-3.46-9.43-29.44-7.07,1.3-7.518,29.18,6.686c-.528,3.747-.945,6.838-1.038,7.9Zm-25.244-31.38,28.957,5.157c-.195,1.31-.57,3.842-1.012,6.84l-28.913-6.385Zm27.727,13.484c-.4,2.737-.838,5.736-1.232,8.5l-29.138-6.676,1.42-8.22Zm-29.2-13.75-2.332,13.51-22.64-3.29,1.316-9.372,2.22-5.178c3.2.656,17.775,3.633,21.435,4.33Zm-24.21-4.438h1.187l-.938,2.19Zm1.694-1.49-1.64-.01,11.855-66.14,1.49.264Zm38.91-18.784c-2.995-.177-21.08-4.385-32.764-7.235l3.048-17.156,33.077,6.93c-1.553,8.607-2.9,15.737-3.36,17.462ZM1236.02,60.7a72.1,72.1,0,0,1,1.31-9.052,115.322,115.322,0,0,1,14.976.91c.005,1.457-.455,6.565-.962,11.352Zm27.767-17.028c-1.167,6.74-2.584,14.81-3.883,22.03l-7.085-1.483c1.273-11.918.98-12.37.8-12.636-.2-.3-.53-.4-1.193-.52-1.948-.333-15.01-1.44-16.047-.664-.27.2-.893.7-1.836,9.99l-7.72-1.616,3.726-20.973ZM1022.69,320l2.366-8.8a.751.751,0,1,0-1.45-.39l-2.47,9.192Zm-376.737,0a100.263,100.263,0,0,1,4.318-9.218c1.894.512,11.537,5.01,20.31,9.218h3.47c-23.29-11.29-24.023-10.877-24.422-10.65-.687.39-2.472,3.975-5.308,10.65ZM618.8,292.38a.75.75,0,0,0-1,.343L604.465,320h1.67l13.013-26.618a.75.75,0,0,0-.344-1ZM340.6,320.024l5.112-6.3a.751.751,0,0,0-1.165-.947l-5.878,7.247Zm-20.431-2.6,5.2,2.6h3.354l-7.89-3.945a.75.75,0,1,0-.67,1.34Z"/> <path id="Path_10" data-name="Path 10" class="cls-4" d="M1056.33,278.065c-2.12-.41-6.936-1.345-13.5-2.616l2.087-25.688a.726.726,0,0,0,.09-1.1l2.647-32.6a.75.75,0,1,0-1.494-.12l-2.62,32.264-37.22-7.61,2.207-11.4,16.5,3.24-.764,7.487a.75.75,0,0,0,.67.822.676.676,0,0,0,.077,0,.75.75,0,0,0,.746-.674l.833-8.17,2.554-19.434a.75.75,0,1,0-1.487-.2l-2.453,18.668-16.39-3.22,3.582-18.493a.75.75,0,1,0-1.473-.284l-3.58,18.49-36.148-7.1,2.724-13.858a.75.75,0,1,0-1.472-.29l-2.87,14.594-2.33,11.866c-3.085-.532-16.19-2.985-25.537-4.747l2.34-13.272.7-.31-.56-.5,3.065-17.387a.75.75,0,1,0-1.478-.26l-2.883,16.362a18.877,18.877,0,0,1-4.9-10.118l-.01-.08c-.14-1.142-.038-6.02.014-7.833a.75.75,0,0,0-.728-.77.74.74,0,0,0-.77.727c-.02.61-.153,5.455-.047,7.5-17.014,5.424-47.94,15.2-53.038,16.52l-3.5-12.817.043-.017-4.6-13.317a.75.75,0,0,0-1.418.49l4.118,11.92-20.644,7.495c-1.768-5.6-4.042-12.582-4.453-12.814l-.37.654.013.037-.677.3c.245.55,2.406,7.012,4.112,12.32L806,230.9l-3.944-13.61c0-.012-.013-.02-.016-.03a.334.334,0,0,0-.007-.036c-.07-.18-7.138-18.126-7.62-21.662-.4-2.9,2.264-17.4,3.325-22.746l.825-3.58,21.86,5.3,2.97-6.4,66.366-27.29a.751.751,0,1,0-.57-1.39L859.4,151.71a.72.72,0,0,0-.027-.178c-.03-.084-3-8.44-3.3-9.51a106.548,106.548,0,0,1,2.1-11.37c17.927,3.4,22.04,3.914,23.1,3.914a.78.78,0,0,0,.4-.062c1.312-.657,1.58-5.622,1.58-5.67,0-.786-.016-1.468-23.55-4.958.59-2.473,1.1-4.4,1.367-5.072,2.053-.33,15.137,2.34,26.762,5.106a.75.75,0,0,0,.346-1.46c-27.21-6.475-28.017-5.1-28.322-4.58a59.489,59.489,0,0,0-1.693,6.23.74.74,0,0,0-.11.29.707.707,0,0,0,.007.14c-.375,1.565-.774,3.282-1.163,5.017a.715.715,0,0,0-.038.094.691.691,0,0,0,0,.072c-1.028,4.6-1.975,9.276-2.214,11.47-9.162-2.7-9.666-1.9-9.954-1.41l-.255.418a12.206,12.206,0,0,0-1.55,3.088l-18.2-3.03c1.624-7.834,3.424-16.317,3.9-17.58a14.4,14.4,0,0,1,4.49-2.57,7.18,7.18,0,0,0,.4,2.014c1.11,2.772,5.923,3.425,10.034,3.425a35.191,35.191,0,0,0,6.233-.492c.5-.168,1.438-.48,4.547-21.65a.75.75,0,0,0-1.484-.22c-1.062,7.23-2.39,15.142-3.235,18.738-1.624-.36-11.33-2.508-15.055-3.148-.014-5.182,1.865-14.7,2.765-18.64a.75.75,0,1,0-1.46-.334c-.342,1.49-2.795,12.456-2.8,18.814-1.458.112-4.03,1.884-5.468,2.962-.418.314-.8,1.324-4.495,19.16l0,.01v.008c-.466,2.26-.984,4.773-1.565,7.6-.78,3.813-1.474,7.193-1.75,8.436-4.492-.317-38.036-6.486-67.707-12.1l3.957-20.036v0l1.316-6.617,19.716,4.038a.76.76,0,0,0,.152.016.75.75,0,0,0,.15-1.485l-19.725-4.042,2.856-14.37,18.07,3.577a.75.75,0,1,0,.292-1.472l-18.07-3.578,2.983-15.01a.75.75,0,0,0-1.472-.292l-3.13,15.747-3.146,15.832-1.41,7.1-41.7,33.975-31.693-39.706c2.142-1.8,9.1-7.84,16.768-14.568,7.83,8.283,19.067,20.322,20.8,22.575-1.2,1.358-6.864,6.243-10.84,9.557a.75.75,0,1,0,.96,1.152c11.52-9.6,11.52-10.29,11.52-10.7,0-.365-.01-1.05-21.313-23.57,4.67-4.1,9.51-8.372,13.624-12.037l12.62,14.242c-1.206,1.263-2.03,2.16-2.256,2.488-1.4,2.017,4.785,8.924,10.217,14.363a.75.75,0,0,0,1.06-1.06c-5.033-5.04-10.26-11.27-10.044-12.45,1.06-1.533,18.284-18.623,24.83-25.08a.75.75,0,0,0-1.052-1.068c-.76.752-15.053,14.85-21.71,21.723L713.806,89.77l1.957-1.75a17.487,17.487,0,0,0,6.4-1.825c2.064-1.283,8.862-5.28,9.784-5.82l6.345-1.33a.75.75,0,0,0-.308-1.466l-6.433,1.345-7.9.934a12.821,12.821,0,0,0,.178-3.107,10.4,10.4,0,0,1,.023-1.536c.723-1.133,8.572-7.5,15.684-12.987a.75.75,0,0,0-.916-1.188c-7.263,5.605-15.974,12.55-16.226,13.81a9.474,9.474,0,0,0-.064,1.942c.033,1.226.075,2.753-.443,3.53-.39.515-4.3,4.076-9.612,8.814-.005,0-.012.006-.018.01l-.013.02c-4.192,3.74-9.246,8.21-14.12,12.5l-6.97-9.51,22.1-19.97a.751.751,0,1,0-1.006-1.115l-38.875,35.125a.751.751,0,0,0,1.006,1.114l15.654-14.144,6.96,9.49c-8.32,7.308-15.867,13.862-17.33,15.006-2.842,2.224-45.252,35.63-45.68,35.967a.751.751,0,1,0,.928,1.18c.115-.09,3.26-2.57,7.85-6.185,1.014,2.51,3.8,9.327,4.866,10.92.462.69,4.03,4.63,8.433,9.414l-5.71,5.1a.75.75,0,1,0,1,1.118l5.726-5.118c6.67,7.234,14.787,15.918,17.05,18.337-4.452,3.282-6.4,4.72-7.262,5.42a.74.74,0,0,0-.2-.583.75.75,0,0,0-1.062-.027c-.06.058-3.07,2.916-6.38,6.014-9.47-11.9-24.03-30.59-25.11-33.008.45-.88,3.11-3.54,5.49-5.65a.751.751,0,0,0-1-1.123c-1.317,1.17-5.643,5.1-6,6.544-.1.417-.408,1.692,25.523,34.264-3.1,2.9-6.216,5.758-7.215,6.535-2.11,1.64-15.187,13.988-15.946,15.353-.134.24-.5,1.023-1.26,2.632-.64,1.367-1.73,3.682-2.938,6.178-2.77-1.158-27.59-11.564-36.755-16.24-2.11-1.075-5.566-2.767-9.684-4.756l0,0h-.006c-5.723-2.765-12.72-6.1-19.177-9.166h-.005c-4.634-2.2-8.975-4.254-12.37-5.858h0c-3.066-1.45-5.354-2.527-6.363-3a16.859,16.859,0,0,0,1.074-3.148c-.017-1.335-2.612-2.832-12.624-7.28-2.062-.915-4.394-1.95-4.8-2.246a.75.75,0,0,0-1.18.92c.26.39.912.717,5.37,2.7,3.568,1.584,10.923,4.85,11.723,6a20.588,20.588,0,0,1-1.116,3.105c-.007.015-.02.023-.026.037a.689.689,0,0,0-.017.07c-2.587,6.246-8.69,19-10.085,20.78a39.654,39.654,0,0,1-4.437-2.132c-5.267-2.748-7.878-3.963-9.056-3.24-1.415.872-3.04,3.79-3.744,5.155l-12.24-5.98-11.155-5.35,12.29-24.388,10.654,5.524a.75.75,0,1,0,.69-1.332l-40.575-21.036c1.82-3.768,3.593-7.438,5.215-10.792l19.784,10.378a.751.751,0,0,0,.7-1.328l-19.83-10.4,6.94-14.34c.307-.4.885-1.69,1.7-6.613l15.74.935.046,0a.75.75,0,1,0,.044-1.5l-50.947-3.02c.63-4.076,1.22-6.967,1.45-7.82,1.2-.5,7.226-.43,17.933.21,1.443.088,2.148.13,2.408.13,1.375,0,6.654-5.47,10.84-10.06a.75.75,0,0,0-1.11-1.01c-1.624,1.78-3.357,3.61-4.913,5.19L462.719,87.5a.75.75,0,0,0-1.11,1.007l20.48,22.6a22.371,22.371,0,0,1-3.76,3.316c-.224,0-1.147-.055-2.316-.125-17.5-1.05-19.04-.43-19.394.64a80.38,80.38,0,0,0-1.583,8.376l-66.65-3.954h-.006L365,117.967c.486-9.087.874-15.813,1-16.606a.75.75,0,0,0-1.212-.786c-.233.206-.42.38-1.745,25.842h-4.4l-9.73,5.13v9.24l13.245,2.986c-.345,6.9-.74,14.9-1.193,24.19v0c-.908,19.13-2.583,48.28-3.475,50.18-.99,1.807-21.3,10.5-23.683,10.608-1.152-.1-4.235-.285-5.675-.372l4.62-63.143a.75.75,0,1,0-1.495-.11l-4.66,63.678c-1.22,1.594-10.09,13.353-14.208,23a39.608,39.608,0,0,0-3.042,12.978.721.721,0,0,0-.007.1c-.074,1.15-.1,2.24-.1,3.245a73.657,73.657,0,0,1-23.408-11.15v0l-.54-.393-.013-.01-5.83-4.248c-4.636-3.53-16.993-13.133-18.5-15.18a25.78,25.78,0,0,1-3.09-6.183.75.75,0,0,0-.994-.647l-.36.127-.113.362c-.223.717,1.842,5.175,3.35,7.227,1.748,2.383,15.087,12.65,18.18,15.016l-15.585,19.122c-4.815-3.306-10.97-7.78-16.694-12.1a.75.75,0,1,0-.9,1.2c20.72,15.632,25.1,17.48,26.262,17.48a.64.64,0,0,0,.406-.12c1.47-.98,10.836-15.9,13.626-20.375a75.227,75.227,0,0,0,24.235,11.43c.045,1.334.13,2.49.2,3.41.052.677.1,1.242.107,1.68.072,2.665-15.336,34.6-18.312,39.6a19.163,19.163,0,0,1-4.92,5.658h2.338a22.481,22.481,0,0,0,3.87-4.89c2.35-3.94,18.616-36.95,18.523-40.4-.012-.458-.057-1.047-.11-1.754-.07-.906-.148-1.992-.2-3.21a.74.74,0,0,0-.033-1.222c-.008-.56-.01-1.142,0-1.75l22.8,26.417a.744.744,0,0,0,.686,1.04.756.756,0,0,0,.184-.033L356.664,320h1.983L335.6,293.293l30.12-26.64,5,5a.75.75,0,0,0,1.06-1.06l-6-6-31.164,27.562-23.767-27.54a37.829,37.829,0,0,1,2.923-12.227c3.95-9.252,12.4-20.54,13.914-22.534,1.19.07,4.772.29,6,.392l.052,0c1.27,0,9.27-3.04,15.913-6.08.13,1.046.326,2.655.427,3.655a7.571,7.571,0,0,0,1.48,2.354.733.733,0,0,0,.16.206c2.9,3.657,9.006,10.118,13.2,14.473-2.218,2.068-4.673,4.342-7.277,6.743l0,0,0,0c-2.426,2.236-4.976,4.578-7.584,6.967-9.76-11.318-10.07-11.327-10.43-11.327-.882,0-4.4,3.19-4.458,4.292-.072,1.3,5.9,7.13,6.644,7.277.33.067,1,.2,3.9-2.95,1.02,1.174,2.112,2.434,3.23,3.728-6.963,6.37-14.234,12.98-20.445,18.6l-.247.223v.333a4.094,4.094,0,0,0,2.24,2.786.468.468,0,0,0,.13.022c.34,0,1.18-.51,6.082-4.9l2.535,2.977c-2.936,2.618-3.105,3.053-3.17,3.217a1.237,1.237,0,0,0,.184,1.078c.485.82,2.112,2.477,3.213,2.624a1.055,1.055,0,0,0,.132.01c1.114,0,2.675-1.76,3.828-3.3l16.008-13.748-.008-.01,7.21-6.432c4.975,5.728,5.36,5.735,5.68,5.735.9,0,2.495-1.62,3.194-2.735a3.1,3.1,0,0,0,.482-3.092,14.492,14.492,0,0,0-1.867-2.64,10.431,10.431,0,0,1-1.176-1.6c.664-.942,4.818-5.173,7.974-8.3,1.9,2.02,8.61,9.114,11.73,12.1,1.005.96,6.29,3.883,13.506,7.658-.7.747-1.413,1.49-2.128,2.224a44.125,44.125,0,0,0-4.813,5.484c-2.556,3.758-5.928,11.15-5.258,13.16a5.69,5.69,0,0,0,2,1.854l-9.406,18.364c-.988-.624-1.9-1.2-2.664-1.69a58.65,58.65,0,0,0-5.143-3.145.735.735,0,0,0-.922.453.765.765,0,0,0,.427.962c.346.147,2.628,1.6,4.834,3,1.238.787,2.363,1.5,3.413,2.158l.005.005h0c8.374,5.266,11.037,6.677,12.09,6.677a.76.76,0,0,0,.71-.428c.032-.05.9-1.524,2.116-3.662L409.884,320h3.264l-10.992-5.688c3.188-5.65,7.844-14.258,7.384-15.5l-.194-.418-.357-.108a105.236,105.236,0,0,1-11.677-6.22c-.02-.01-.032-.03-.053-.04s-.017,0-.025-.008a7.624,7.624,0,0,1-1.854-1.418c-.35-1.053,2.073-7.425,5.076-11.84a43.163,43.163,0,0,1,4.647-5.282c.82-.84,1.64-1.692,2.43-2.552,9.226,4.8,21.19,10.8,31.466,15.9-2.077,4.136-12.724,25.332-13.3,26.514a.75.75,0,1,0,1.35.653c.56-1.156,11.25-22.44,13.29-26.5,10.9,5.41,19.615,9.665,20.568,10.13a.75.75,0,1,0,.658-1.348c-3.728-1.82-8.036-3.933-12.635-6.2l20.66-40.624c4.184,2.02,8.258,3.995,11.974,5.8a.75.75,0,0,0,.657-1.348c-19.352-9.415-51.97-25.15-53.778-25.15h-.026c-.762.086-1.806.2-17.4,34.29l-.7,1.522a19.6,19.6,0,0,1-3.133,4.494c-7.365-3.842-12.573-6.713-13.5-7.6-3.592-3.43-12.023-12.41-12.192-12.59l-6.657-7.727c2.334-2.26,3.99-3.916,4.235-4.3.285-.45.85-1.477,1.564-2.826,2.464,1.62,4.43,2.907,5.993,3.925-4.847,3.888-4.423,4.5-4.07,5,.036.052,3.743,5.182,5.3,5.312.94.073,1.692-1.01,3.08-3.1.347-.52.833-1.25,1.136-1.617,2.587,1.585,13.574,8.1,15.63,8.1a.505.505,0,0,0,.22-.04c.273-.137.913-.456,5.437-10.958l.268-.62-.033-.02,3.078-8.447.21.1.118-1.063c.233-2.107,8.084-18.9,13.3-29.675l0,0,9.8-20.565c.315-.582,4.244-7.816,7.55-14.05l20.26,9.484c-4.835,10.038-8.78,18.27-9.434,19.757-1.7,3.864-3.577,4.08-5.565,4.306-2.457.28-3.954,7.216-4.483,10.185a.75.75,0,0,0,.607.87.766.766,0,0,0,.13.012.75.75,0,0,0,.74-.618c.818-4.592,2.333-8.86,3.175-8.958,2.1-.24,4.722-.54,6.768-5.19.355-.806,1.724-3.693,3.694-7.807l7.543,3.615-11.81,23.144a.75.75,0,0,0,1.337.68l11.826-23.176L504.6,208l12.9,6.3,20.164,9.855-11.84,23.965-12.31,25.707c-.2.28-1.39,1.86-2.668,1.2a20.89,20.89,0,0,1-2.83-2.368c-2.884-2.644-6.154-5.638-8.57-5.246-2.438.4-4.1,2.656-5.434,4.47a13.6,13.6,0,0,1-1.44,1.77c-.343.314-.714.686-1.1,1.075-1.264,1.267-2.838,2.843-3.97,2.843-2.482,0-4.22-.345-5.17-1.026a.751.751,0,1,0-.875,1.22c1.226.88,3.2,1.306,6.045,1.306,1.755,0,3.5-1.744,5.032-3.283.37-.372.725-.727,1.053-1.03a14.375,14.375,0,0,0,1.635-1.985c1.235-1.678,2.634-3.58,4.467-3.878,1.706-.274,5.08,2.82,7.315,4.87a19.719,19.719,0,0,0,3.153,2.593c2.053,1.07,3.932-.67,4.637-1.738l12.38-25.84,11.84-23.964,27.74,13.557-12.816,23.07L525.56,320h1.667l28.04-57.854,12.834-23.1,1.823.89h0l19.44,9.5v0l26,12.707-10.956,24.034-1.783,3.76c-4.786-2.587-17.16-9.19-18.8-9.19-2.73,0-13.546,25.4-13.578,25.657a1.245,1.245,0,0,0,.365.95c1.833,2.076,15.872,8.893,16.88,8.893.95,0,1.608-1.166,3.546-5.468.41-.912.8-1.776,1.123-2.417.822-1.627,3.172-2.136,3.874-2.255,1.015.5,3.164,1.875,3.38,3.49.184,1.386-2.96,6.58-5.61,10.4h1.823c2.1-3.085,5.55-8.53,5.273-10.6-.29-2.18-2.586-3.737-3.757-4.4l6.49-13.694.01-.02,2.12-4.477L616.718,262.8l9.44,4.613c4.938,2.548,10.5,5.44,16.106,8.376l-5.948,14.694c-7.028-3.907-16.974-9.448-17.42-9.732l-.42.62.72.21-1.447-.4c-.15.576-.15.576,3.2,2.453,1.708.957,3.987,2.228,6.265,3.5l8.535,4.75-3.27,8.08a.75.75,0,1,0,1.39.563l5.255-12.98c3.46,2.01,7.422,4.2,8.252,4.2,1.173,0,2.18-1.743,2.677-2.78a.751.751,0,1,0-1.354-.648,5.835,5.835,0,0,1-1.335,1.915,75.681,75.681,0,0,1-7.672-4.094l3.908-9.65c4.43,2.323,8.853,4.66,12.99,6.865l-10.532,23.225a.75.75,0,1,0,1.366.62l3.705-8.172c2.35,1.24,9.9,5.274,11.615,6.855a.75.75,0,1,0,1.016-1.1c-1.89-1.74-9.712-5.91-12.01-7.12l2.3-5.08,20.73,10.71a.751.751,0,0,0,.69-1.334l-20.8-10.743,3.243-7.15c10.632,5.68,19.08,10.353,20.213,11.4.343,1.487,2.526,4.84,4.448,7.194-2.312,5.055-4.837,10.493-6.994,15.094l-26.27-11.94a.75.75,0,0,0-.62,1.365L676.887,320h3.624l-3.566-1.62c1.512-3.227,4.13-8.837,6.71-14.47a10.284,10.284,0,0,0,.858.828l.01.01c1.827,1.516,12.533,7.707,15.187,9.234L697.087,320h1.636l2.616-6c3.035-5.35,6.567-11.2,7.234-11.734a46.281,46.281,0,0,1,4.21-2.18c-2.37,2.067-4.892,4.306-5.257,4.793-.014.02-.23.427-.578,1.1a.742.742,0,0,0-.207.4c-1.65,3.193-5.413,10.62-6.495,13.622h1.564c1.152-2.718,4.484-9.59,6.085-12.7l12.63,1.442a.734.734,0,0,0,.085.005.75.75,0,0,0,.084-1.495l-12.032-1.374c.024-.038.046-.074.063-.1.44-.575,5.725-5.176,9.04-8.02,1.843-.524,20.757-5.928,39.555-11.577,3.354-1.008,6.425-1.94,9.248-2.8l4.153,14.943c-2.02.166-3.674.258-4.387.258-1.68,0-37.813,9.742-45.04,11.7a.75.75,0,0,0,.393,1.447c17.135-4.63,43.168-11.554,44.647-11.643.79,0,2.6-.1,4.8-.284l2.13,7.667L725.278,320h5.935l42.45-11.088L776.746,320H778.3l-.48-1.728,47.81-14.24L830.258,320h6.59l29.19-8.674c1.1,4.536,1.825,7.15,2.326,8.674h1.568c-.585-1.77-1.58-5.512-2.454-9.1l14.652-4.353c.707,2.633,1.613,5.914,2.487,8.8-4.028,1.42-9.856,3.486-13,4.66h4.378c2.86-1.028,6.278-2.24,9.067-3.224.39,1.236.762,2.337,1.1,3.224h1.576c-.9-2.32-2.65-8.24-4.165-13.883l21.5-6.39,4.973,16.387L899.41,320h4.37l6.7-2.45.743,2.45h1.568l-6.28-20.7L932.1,291.8c6.3,23.777,7.22,24.1,7.665,24.248a.625.625,0,0,0,.193.023c1.38,0,7.893-2.13,19.362-6.333,1.11,4.3,2.118,8.145,2.676,10.265h1.55c-1.383-5.238-3.245-12.393-4.806-18.615,4.67-1.476,8.474-2.65,9.253-2.818,1.538-.325,15.57,2.89,24.51,5.1L990.695,316.9c-3.12-.385-12.795-.825-17.976-1.04a34.148,34.148,0,0,0-.084-5.5c2.254-.718,4.624-1.418,5.042-1.448a.75.75,0,0,0-.01-1.5,51.126,51.126,0,0,0-6.063,1.7l-.574.185.057.6c.135,1.39.4,5.26.033,6.44-.275.658-3.23,2.262-6.355,3.655h3.517a13.859,13.859,0,0,0,3.94-2.658c6.26.26,15.735.727,18.247,1.02-.08.46-.188,1.07-.29,1.638H991.7c.078-.437.155-.882.22-1.252.95.293,2.532.75,4.31,1.252h5.566c-4.09-1.135-8.175-2.287-9.64-2.746l1.913-14.024,2.034-9.96,14.52,2.8a120.52,120.52,0,0,0-4.432,23.93h1.5a119.512,119.512,0,0,1,4.414-23.645l38.81,7.484a.75.75,0,1,0,.283-1.473l-38.56-7.437c1.2-3.957,4.308-18.263,5.28-22.77,13.914,2.688,27.243,5.27,38.118,7.378a.75.75,0,0,0,.286-1.473ZM859.354,125.342c7.982,1.187,20.115,3.148,22.376,3.912a16.516,16.516,0,0,1-.755,3.842c-2.068-.136-14.37-2.372-22.49-3.91.292-1.324.586-2.626.87-3.844Zm-10.18-1.98c-.04.12-.08.233-.115.312-2.074.446-12.914,1.087-14.2-2.12a5.016,5.016,0,0,1-.276-1.26c3.012.547,9.94,2.037,14.586,3.068Zm-126.308-41.9,5.347-.632c-2.4,1.42-5.55,3.284-6.847,4.092a11.646,11.646,0,0,1-3.554,1.25C720.37,83.86,722.2,82.162,722.866,81.462ZM270.7,277.268c-.888-.208-3.545-1.84-7.115-4.255l15.543-19.072,4.7,3.422c-4.563,7.32-11.71,18.477-13.124,19.906Zm71.342-20a40.488,40.488,0,0,1-5.333-5.68,14.779,14.779,0,0,1,2.8-2.692c.76.772,2.718,2.98,5.21,5.837a20.532,20.532,0,0,1-2.674,2.534Zm65.99,42.232c-.573,1.973-4.745,9.71-7.553,14.722-.01.02-.03.03-.04.05s-.005.03-.012.043c-.96,1.714-1.755,3.1-2.182,3.81-1.443-.473-6.32-3.453-10.43-6.034l9.4-18.34a117.1,117.1,0,0,0,10.82,5.75Zm39.55-10.09c-2.35-1.16-4.767-2.356-7.216-3.57a.315.315,0,0,0-.028-.023c-.01-.005-.024,0-.035-.01-4.026-2-8.133-4.045-12.16-6.066l12.2-25.155,19.767,10.193Zm20.652-40.61-7.446,14.64L441,253.236l6.876-14.18C454.179,242.042,461.321,245.464,468.238,248.8Zm-56.556,16.393.7-1.524c12.007-26.246,15.39-32.29,16.3-33.362,1.57.5,8.69,3.78,17.837,8.1l-19.715,40.656c-6.594-3.312-12.918-6.526-18.25-9.3a20.264,20.264,0,0,0,3.127-4.58Zm93.37-88.96-6.23,12.356-28.9-13.53c2.11-4.382,4.365-9.055,6.575-13.63Zm-48.733-51.348,33.832,2.007a36.909,36.909,0,0,1-1.26,5.588c-2.518.163-20.768-.91-33.333-1.726.237-2.1.5-4.078.76-5.87Zm-.925,7.362c21.216,1.38,29.242,1.708,32.342,1.708.143,0,.26,0,.383,0-1.675,3.46-6.78,14.006-12.3,25.435l-21.64-11.22c-.008,0-.015,0-.022-.005.268-2.047.41-3.6.423-3.76l.072-.815h-.046c.12-3.908.415-7.777.79-11.34Zm-.576-7.45c-.292,2.016-.58,4.246-.836,6.6v0c-.42,3.85-.753,8.033-.88,12.183h-27.24c.972-9.985,1.753-19.013,1.872-20.4Zm-104.4,14.79v-7.134l8.6-4.536h3.947c-.213,4.12-.454,8.868-.728,14.335Zm3.024,90.584a72.478,72.478,0,0,0,9.815-4.443,6.14,6.14,0,0,0,2.127,2.826c1.287.8,8.618,3.792,11.023,4.765-.176.338-.326.62-.434.816-.393.656-4.283,4.4-9.95,9.7-4.836-5.02-9.918-10.51-12.58-13.665Zm27.55-5.776c-.75,1.446-1.647,3.192-2.732,5.317l-1.16,2.27c-3.18-1.285-9.84-4.025-10.923-4.7a5.1,5.1,0,0,1-1.652-2.425,3.492,3.492,0,0,0,.685-.69c.847-1.27,1.037-4.087,1.122-7.443,2.712,1.417,10.038,5.252,14.66,7.672Zm-14.624-9.285a18.1,18.1,0,0,1,.143-2.443c.13-.563,1.915-.513,2.873-.486a11.523,11.523,0,0,0,1.538-.02,1.77,1.77,0,0,0,1.267-.726,2.44,2.44,0,0,0,.41-1.12l13.562,6.263a10.905,10.905,0,0,1-1.462,1.43c-.39.272-1.134,1.484-3.012,5.058l-7.532-3.942c-4.65-2.434-6.762-3.54-7.788-4.014Zm-.4,30.827.806.834c-2.087,1.973-4.358,4.106-6.714,6.31l-.835-.888c2.368-2.184,4.642-4.293,6.743-6.255Zm-7.845,7.27.84.9c-2.325,2.175-4.716,4.4-7.08,6.593l-.844-.982c2.365-2.166,4.754-4.36,7.083-6.507ZM336.3,275a.054.054,0,0,1-.02.01.236.236,0,0,1-.016.023c-2.8,2.527-4.83,4.313-5.6,4.91a4.73,4.73,0,0,1-.8-.962c2.573-2.327,11-9.96,20.06-18.246q.424.492.85.99c-2.41,2.235-4.775,4.417-6.993,6.454,0,0-.01.005-.015.01s-.006.01-.01.014c-2.79,2.562-5.34,4.89-7.455,6.8Zm3.362,10.07a5.8,5.8,0,0,1-2.066-1.8c.437-.487,1.586-1.568,2.614-2.487l1.7,1.994a10.386,10.386,0,0,1-2.248,2.3Zm3.3-3.38-5.14-6.03c1.693-1.526,3.8-3.448,6.414-5.85l2.7,2.955a23.435,23.435,0,0,0-2.484,2.78c-.16.277-.617,1.08,1.61,3.485Zm4.24-3.642a8.163,8.163,0,0,1-1.378-1.866,29.987,29.987,0,0,1,2.12-2.308l1.81,1.982Zm3.692-3.17-5.556-6.084c1.882-1.734,4.01-3.7,6.418-5.935,1.928,2.24,3.847,4.48,5.567,6.495Zm7.558-6.51q-3.133-3.67-5.59-6.535l2.028-1.885c.63-.585,2.56-2.38,5.066-4.725,2.317,2.76,4.19,4.968,5.7,6.72Zm21.464-19.034c-3.83,3.783-8.2,8.22-8.44,9.008-.257.832.476,1.723,1.49,2.957a13.492,13.492,0,0,1,1.675,2.34,1.3,1.3,0,0,1-.087,1.043,6.757,6.757,0,0,1-2.14,2.526c-1.424-1.318-7.38-8.273-11.362-13.013,2.074-1.94,4.436-4.16,6.76-6.353l.653.677a.75.75,0,1,0,1.08-1.04l-.644-.666c1.723-1.63,3.387-3.214,4.858-4.628Zm-2.105-13.3c-.26.376-1.913,2.024-4.46,4.478-.01.008-.022.01-.033.02a.423.423,0,0,0-.04.052c-1.526,1.47-3.366,3.222-5.414,5.16l-.8-.827c5.685-5.323,9.816-9.317,10.22-10.05s1.29-2.465,2.314-4.47c.836-1.638,1.993-3.9,3.07-5.968v0a54.363,54.363,0,0,1,2.888-5.18,6.18,6.18,0,0,0,.7-.59c-.775,2.745-7.288,15.555-8.443,17.38Zm9.92-17.094a12.051,12.051,0,0,1,.553-1.4l12.822,6.326c-1.115,2.206-2.39,4.72-3.62,7.127l-11.994-6.7a42.656,42.656,0,0,0,2.24-5.354Zm-6.395,13.743c1.088-2.1,2.373-4.66,3.512-7.033l11.953,6.68c-1.786,3.484-3.373,6.54-4.05,7.75-1.78-1.1-7.344-4.724-11.415-7.4ZM407.283,250.1a153.129,153.129,0,0,1-14.643-7.9.862.862,0,0,0-.71-.292c-.642.045-1.08.657-2.25,2.418A16.534,16.534,0,0,1,387.9,246.7a26.7,26.7,0,0,1-3.91-4.338,32.249,32.249,0,0,1,3.958-3.563c4.68,3.032,4.833,3.034,5.045,3.034.485,0,.65-.007,5.12-8.77l13.59,7.594c-1.76,4.053-3.72,8.3-4.423,9.436Zm4.976-10.845L398.8,231.727c1.01-1.984,2.212-4.36,3.647-7.2l12.868,6.348Zm16.683-38.992v0c-1.252,2.585-11.433,23.66-13.19,29.16L388.9,216.17c3.012-6.478,10.93-21.942,14.322-28.5a.75.75,0,0,0-1.332-.69c-.512.99-10.7,20.693-14.354,28.58L372.67,208.7a56.764,56.764,0,0,1,3.173-10.373c1.486-3.1,3.22-6.9,3.915-8.43,2.764,1.324,4.285,1.872,5.1,1.872a1.158,1.158,0,0,0,.407-.064c1.408-.528,4.373-6.434,6.015-9.908a.75.75,0,0,0-1.356-.64c-1.88,3.978-4.357,8.53-5.165,9.124-1.357-.044-8.68-3.9-11.11-5.18-1.3-.684-1.94-1.02-2.192-1.124a1.065,1.065,0,0,0-.912.047c-1.076.56-1.887,3.57-2.275,5.318a.75.75,0,0,0,1.464.325,16.429,16.429,0,0,1,1.4-4.18c.373.186,1.053.544,1.813.943,2.165,1.14,3.96,2.064,5.46,2.81-.68,1.5-2.425,5.325-3.918,8.44a56.035,56.035,0,0,0-3.215,10.377l-.485-.224.287,1.443v0a2.075,2.075,0,0,1-.107,1.28.28.28,0,0,1-.224.116,10.616,10.616,0,0,1-1.32.01c-1.68-.048-3.976-.113-4.38,1.65a22.412,22.412,0,0,0-.192,3.36c-.052,2.586-.13,6.5-.894,7.642a3.009,3.009,0,0,1-.735.656c-.02.014-.04.025-.058.04-2.034,1.406-7.18,3.58-10.732,4.916a6.349,6.349,0,0,1-.863-1.27c-.12-1.18-.37-3.2-.49-4.17,3.98-1.88,7.207-3.673,7.733-4.65,1.3-2.4,3.27-42.752,3.653-50.82.537-11,1.623-32.86,2.458-48.573l22.613,1.34-.908,13.62h-6.18l-.887,18.09,3.98,3.184-9.4,17.69a.75.75,0,1,0,1.324.7l9.99-18.787L381.1,151.82l.78-15.9h6.153l1-15.03,37.2,2.206c-.5,5.776-1.2,13.56-1.953,21.23v.01c-1.262,12.863-2.657,25.4-3.434,27.574-1.574,4.4-9.293,19.62-9.37,19.772a.75.75,0,1,0,1.337.68c.3-.6,7.105-14.008,9.16-19.2l16.444,7.206ZM439.1,179.036l-16.647-7.295c.86-3.557,2.162-15.485,3.26-26.653H453c-.244,2.36-1.04,9.21-2.356,12.1-1.47,3.233-9.79,18.61-11.546,21.846Zm9.253-14.074c1.686-3.193,3.115-5.954,3.66-7.15a35.281,35.281,0,0,0,1.923-8.078l21.226,11c-2.218,4.593-4.483,9.286-6.6,13.685Zm15.838,22.014c1.465-3.058,3.2-6.676,5.078-10.566l28.875,13.52-5.408,10.73ZM595.66,304.654c-1.053.193-3.744.887-4.83,3.034-.33.657-.73,1.544-1.152,2.478a30.992,30.992,0,0,1-2.3,4.533c-2.262-.726-14.2-6.736-15.587-8.275.844-2.766,10.213-22.416,12.168-24.15,1.6.386,10.218,4.8,18.03,9.023ZM970.9,221.807l36.152,7.1-2.206,11.394-36.13-7.386Zm33.66,19.967-4.9,25.333c-5.438-1.048-10.942-2.108-16.362-3.15,1.464-4.618,4.9-21.566,5.66-25.374Zm-36.1-7.382,19.03,3.89c-1.59,7.94-4.515,21.95-5.667,25.39-6.055-1.162-11.98-2.3-17.566-3.367,1.1-6.556,2.473-15.012,4.2-25.913ZM981.28,265.1c-1.44,4.348-4.7,19.223-5.465,22.728l-17.658-3.4c.344-.276.677-.52.953-.72.312-.228.566-.416.727-.56.19-.172.676-.61,4.164-21.36,5.44,1.042,11.254,2.158,17.278,3.315Zm-18.517-5.08c-9.758-1.865-18.375-3.5-24.676-4.68l3.39-23.69,25.494,2.518c-1.255,7.9-2.793,17.392-4.207,25.852ZM825.53,264l18.193-5.478,4.93,18.286c-6.123,1.844-12.274,3.7-18.252,5.492Zm3.434,18.73c-2.472.745-4.913,1.478-7.3,2.2l-5.267-18.174,7.7-2.32Zm16.2-24.64,19.5-5.873,5.27,18.185-12.22,3.68c-2.523.76-5.07,1.525-7.624,2.3Zm20.936-6.3L877,248.5l.837-.027,5.25,17.968q-5.493,1.65-11.722,3.526Zm13.292-3.362,5.57-.18,4.125-1.23,4.9,16.156-9.456,2.84Zm15.032,16.18,4.835,15.93-9.642,2.873-4.663-15.957c3.257-.98,6.428-1.932,9.47-2.846Zm-3.9-18.017,34.9-10.386c.266,2.677.8,11.413,1.134,17.38-2.77.7-12.707,3.633-31.132,9.16Zm-5.8.163-2.127.07,57.5-17.316,0,.767Zm55.213-14.867-3.317,23.178c-4.262-.795-7.26-1.34-8.56-1.548-.238-4.268-.843-14.756-1.18-17.744Zm10.04-.9-8.387-.828,0-.75c2.543.48,5.44,1.025,8.386,1.578Zm-13.346-27.5a20.776,20.776,0,0,0,5.44,10.38c-3.463,1.545-14.59,6.543-16.454,7.856-1.44,1.016-12.34,2.783-18.872,3.66a.75.75,0,1,0,.2,1.485c1.766-.236,17.322-2.358,19.537-3.92,1.51-1.063,10.436-5.14,15.916-7.583l-2.21,12.553L890.1,242.994l-6.3-23.066c6.59-1.73,46.26-14.352,52.82-16.442Zm-47.956,39.94-10.59,3.19-1.4.422-.024.007-10.9,3.283c-.618-3.135-2.843-14.42-4.455-22.537,5.446-2.072,17.663-6.634,21.047-7.528Zm-10.173-37.242,3.453,12.637c-4,1.07-17.433,6.142-20.95,7.478-.73-3.66-1.285-6.435-1.427-7.083-.014-.063-.74-2.45-1.71-5.54Zm-22,7.987c.817,2.574,1.46,4.678,1.61,5.366.45,2.06,5.3,26.667,6.2,31.225l-48.332,14.555-9.553-32.968Zm-10.782-73.19.146-.236c1.053-.07,5.235.947,8.883,2.028.39,1.205,1.44,4.21,2.24,6.48-5.713-2.352-11.566-4.865-12.666-5.53a10.41,10.41,0,0,1,1.4-2.742Zm-91.6-14.585-3.556,18.01c-5.21-.986-10.282-1.952-15.036-2.862ZM667.83,179.447c-1.953-2.1-4.008-4.31-6.018-6.48a3.675,3.675,0,0,1,2.647.176,14.24,14.24,0,0,1,3.606,4.276,5.59,5.59,0,0,1-.235,2.027Zm1.213,1.3c.325-1.112.784-3.027.4-3.92a15.368,15.368,0,0,0-4.142-4.93c-1.524-1.032-3.63-.467-4.642-.2l-.013,0c-5.966-6.448-11.25-12.224-11.766-13-.908-1.36-3.48-7.546-4.886-11.052,11.964-9.423,31.963-25.174,36.015-28.357L711.693,159l-36.365,28.484c-1.672-1.786-3.87-4.138-6.29-6.737ZM630.119,232.3c-2.093,4.278-4.367,8.687-5.27,9.563-1.1-.4-5.256-2.5-10.9-5.443l4.57-9.037c5.694,2.44,10.328,4.385,11.6,4.917Zm-12.98-5.51-4.52,8.936c-3.88-2.028-8.356-4.394-12.973-6.85l3.864-8.055c4.393,1.973,9.253,4.09,13.63,5.97ZM594.049,216.4c2.14,1.068,4.96,2.384,8.092,3.8l-3.82,7.966c-2.553-1.36-5.134-2.74-7.67-4.1Zm-9.7-4.776c3.435,1.66,6.354,3.09,8.352,4.1l-3.38,7.633c-2.94-1.577-5.8-3.117-8.46-4.55Zm-19.14-9.152c2.767,1.313,5.615,2.668,8.413,4l-3.027,7.857-3.763-1.893c.523-1.176.648-1.793.494-2.2-.364-.972-2.624-2.592-4.008-3.515Zm.677,8.225a5.338,5.338,0,0,1-.392,1.07l-8.338-4.192a9.939,9.939,0,0,1,1.167-1.652A30.665,30.665,0,0,1,562,207.644a19.849,19.849,0,0,1,3.9,3.05Zm-13.1-14.105c3.127,1.477,6.97,3.295,11.066,5.238l-1.84,4.134a20.961,20.961,0,0,0-3.6-1.57c-.46-.1-.93-.2-2.6,2.507l-6.465-3.253Zm2.257,11.6c-.99,1.728-2.307,4.22-4.088,7.8-3.413-1.815-5.166-2.72-6.1-3.148l3.828-7.85Zm-16.722,14.63-19.49-9.523c.872-1.682,2.26-3.97,3.143-4.517.876-.24,5.26,2.042,7.616,3.272,3.882,2.024,4.942,2.514,5.643,2.28,1.37-.455,7.593-13.763,10.6-21.023l5.594,2.638Zm12.15,5.006c-.274.27-.472.467-.617.632l-10.185-4.978,4.533-9.293c1.11.532,3.653,1.855,6.087,3.147l-.476.968-.238.484c-.47.938.39,1.875,1.388,2.96.773.843,1.735,1.89,1.784,2.672.068,1.1-1.457,2.6-2.276,3.406Zm.8,1.323.256-.254c1.128-1.11,2.832-2.787,2.72-4.568-.08-1.312-1.194-2.523-2.176-3.592a7.705,7.705,0,0,1-1.1-1.37l.2-.4c2.48-5.062,4.13-8.174,5.228-10.1l8.452,4.25c-.6,1.19-1.337,2.552-1.888,3.57a28.033,28.033,0,0,0-2.23,4.53c-.227,1.083.75,2.054,1.784,3.083.672.667,1.59,1.58,1.58,2.1-.02.936-2,4.622-3.574,7.268Zm18.626,9.1-8.03-3.924c1.14-1.916,3.688-6.366,3.72-7.9.026-1.158-1.014-2.19-2.02-3.19-.494-.493-1.414-1.407-1.373-1.71a38.453,38.453,0,0,1,2.08-4.124c.81-1.495,1.437-2.673,1.91-3.612l5.216,2.623,3.58-9.293c2.8,1.34,5.52,2.642,8.018,3.847l-3.8,7.83-.02.043-.29.6,0,0Zm1.348.66,8.966-18.754c2.4,1.293,5.3,2.855,8.468,4.56l-9.143,18.244Zm18.073,8.832-8.435-4.122L590,225.429c2.462,1.32,5.055,2.708,7.673,4.1Zm36.367,17.773-9.022-4.41-26-12.705L599,230.238c12.446,6.625,24.99,13.175,25.944,13.175.428,0,.9-.233,1.91-1.787a103.728,103.728,0,0,1,8.922,5.45L631.826,255l-.02-.01-3.523,7.675Zm22.813-.73,13.28,6.467-2.62,6.126-13.178-6.594Zm-3.862,5.325L629.9,262.738l2.628-5.727,14.62,7.12Zm19.79-1.238c7.88,4.2,18.99,10.194,21.245,11.6l-3.124,6.247L661.6,275.477Zm-2.058,1-13.29-6.472,2.683-6.39,13.39,6.355Zm-14.64-7.13-14.555-7.088,3.772-7.57c2.617,1.906,10.22,6.346,13.48,8.232Zm-4.886,11.642c-4.642-2.425-9.867-5.138-15.758-8.178l2-2.2,14.966,7.49Zm14.358,7.57c-3.7-1.97-8-4.246-13.024-6.873l1.222-2.912,13.17,6.59Zm1.328.71,2.483-5.806,20.842,11.194-3.272,6c-1.74-1.262-6.565-4.175-20.053-11.39Zm24.74,18.474a26.637,26.637,0,0,1-3.645-5.86l4.27-7.834-.023-.012,2.9-5.8c1.34,1.73,2.853,3.993,2.855,4.784-.126.857-2.926,7.2-6.357,14.722Zm24.408-.077c-1.08.8-5.466,8.377-7.29,11.578-4.026-2.313-10.584-6.152-13.564-8.1l24.293-5.306a33.4,33.4,0,0,0-3.44,1.833Zm9.542-4.7-32.01,6.993c-.27-.253-.567-.567-.877-.92,3.53-7.732,6.792-15.112,6.792-15.97,0-1.93-3.522-6.21-3.924-6.693l0,0c-.005-.006-.012-.01-.017-.015-.77-.812-13.914-7.872-22.16-12.26l2.078-4.86-15.373-7.3c-6.537-3.77-13.812-8.158-14.432-8.868l-.022-.023c-.01-.013-.022-.024-.033-.036-1.01-1.205-7.58-4.932-9.6-6.065,1.433-2.483,3.68-6.943,7.437-14.94.612-1.3,1.1-2.335,1.207-2.534.616-.993,11.594-11.535,14.97-14.42,8.836,11.69,24.88,32.937,25.345,33.63a.75.75,0,0,0,1.25-.827c-.523-.793-21.994-29.2-25.435-33.757,2.934-2.5,11.91-11,13.867-12.853l.628.085.026-.02.492.56c.336-.295,5.133-3.848,8.275-6.164l.68-.5-.018-.02,20.058-15.71c1.505,1.98,3.925,5.158,6.462,8.473-1.213,1.057-3.627,3.383-3.627,5.153,0,1.913,3.525,6.6,5.42,8.038a2.434,2.434,0,0,0,1.36.59,1.14,1.14,0,0,0,.312-.044c1.1-.31,3.45-2.24,4.63-3.252,1.118,1.418,1.88,2.354,2.048,2.495.434.36,1.15.99,2.005,1.763-3.95,3.45-17.1,15.005-17.83,16.6-1.178,2.55,13.01,18.99,13.183,19.09a5.924,5.924,0,0,0,2.52.322c1.05,0,2.426-.058,4.186-.154.7-.038,1.267-.07,1.54-.07.842,0,2.44-1.182,7.432-5.5,1.057-.914,1.97-1.7,2.394-2.022.162-.12.464-.34.873-.637,12.582-9.113,14.187-11.594,14.048-12.917-.258-2.462-11.834-17.513-14.152-20.505a.75.75,0,0,0-1.186.92c6.685,8.63,13.692,18.373,13.846,19.732-.02.537-1.254,2.614-11.8,10.366-2.822-4.658-5.684-9.656-5.837-10.4a2.8,2.8,0,0,1,.532-1.36,5.633,5.633,0,0,0,.97-3.792c-.453-2.872-11.648-12.49-11.742-12.568-.466-.45-4.787-6.04-9.506-12.2v0h0c-2.342-3.06-4.78-6.255-6.9-9.036l15.032-11.776.01.01,9-7.334c9.236,11.918,22.71,29.42,23.494,30.754a.75.75,0,0,0,1.45-.27c0-.335-.012-.766-23.78-31.432L734,142.78c1.527.292,8.117,1.552,17,3.233h0c7.522,1.423,16.68,3.146,25.8,4.838,12.54,2.327,22.545,4.14,29.74,5.385,8.666,1.5,12.055,2.032,13.442,2.032.882,0,.954-.215,1.06-.53.11-.334.61-2.757,1.908-9.088.41-2.005.9-4.41,1.426-6.933l19.015,3.167c1.292.82,6.074,2.92,14.25,6.264l.315.886a.744.744,0,0,0,.123.217l-35.806,14.726-2.7,5.817-20.7-5.018,2.188-10.714a.75.75,0,0,0-1.47-.3l-2.332,11.42-.843,3.65-30.654-4.24a.751.751,0,1,0-.206,1.487l14.26,1.972c.52,2.4,2.65,12.273,2.948,13.466a1.34,1.34,0,0,0,.65.838,3.325,3.325,0,0,0,1.62.32,16.233,16.233,0,0,0,3.824-.617.751.751,0,1,0-.4-1.447c-1.815.5-3.795.713-4.257.468-.328-1.353-2.158-9.82-2.8-12.81l14.7,2.033c-.717,3.7-3.646,19.1-3.187,22.468.5,3.684,7.3,20.97,7.7,21.978l13.912,48-17.145,5.163c-1.785-.1-8.816,1.45-40.965,10.918-19.838,5.842-39.79,11.947-39.99,12.008a.75.75,0,0,0,.44,1.434c26.268-8.04,64.235-19.334,76.5-22.228-11.7,4.513-49.734,15.792-76.16,23.32Zm-13.43-113.82c2.257,2.946,4.528,5.9,6.256,8.11a23.2,23.2,0,0,1-4.036,2.966c-1.123-.355-5.26-5.618-5.26-7.116,0-.914,1.625-2.706,3.04-3.96Zm18.973,28.648c.24,1.27,4.565,8.485,6.095,11.01l-.415.3c-.418.3-.727.528-.893.652-.466.35-1.352,1.117-2.475,2.088-1.855,1.6-5.714,4.944-6.45,5.137-.29,0-.88.03-1.623.07a37.407,37.407,0,0,1-5.837.056c-1.232-.96-12.268-15.028-12.566-17.255.974-1.455,11-10.425,17.538-16.136,3.367,3.11,7.918,7.6,8.12,8.882a4.292,4.292,0,0,1-.8,2.824,3.556,3.556,0,0,0-.7,2.372ZM768,282.946c26.323-8.088,29.54-9.91,30.084-10.677l16.865-5.078,5.267,18.172c-21.612,6.483-38.935,11.628-40.514,11.9-2.242.387-5,.7-7.465.933Zm9.416,33.884-4.77-17.163c2.416-.228,5.087-.54,7.31-.925,1.658-.287,18.688-5.34,40.677-11.938l4.576,15.79Zm44.653-30.456c11.26-3.378,23.73-7.134,36.07-10.85,8.575-2.583,17.222-5.187,25.365-7.636l4.663,15.955-61.52,18.323Zm9.728,33.565-4.732-16.33,72.618-21.63,4.952,16.317Zm74.277-22.068-4.963-16.353a.732.732,0,0,0-.416-1.373l-4.845-15.964c17.537-5.26,30.566-9.13,31.457-9.26.43.03,4.018.68,9.82,1.766h.008c6.26,1.173,15.1,2.853,25.375,4.818-1.787,10.648-3.332,19.354-3.78,20.61-.13.106-.3.23-.507.378a17.319,17.319,0,0,0-2.045,1.676l-5.25.67-3.69-17.985a.75.75,0,1,0-1.47.3l3.69,17.99Zm27.46-6.492,16.95-4.972,4.383-.56a4.61,4.61,0,0,0-.62,2.532c.066,1.17,1.247,6.2,2.693,12.005-7.5,2.376-16.56,5.3-19.2,6.157-1.383-4.728-2.993-10.594-4.205-15.162Zm25.406,16.9c-6.565,2.4-16.548,5.92-18.58,6.288a61.968,61.968,0,0,1-2.2-6.588c2.542-.82,11.627-3.756,19.14-6.137C957.84,303.968,958.4,306.159,958.942,308.279Zm33.812-6.088c-5.18-1.28-22.825-5.564-25.08-5.087-.813.175-4.626,1.35-9.3,2.827-1.456-5.842-2.568-10.587-2.626-11.635a3.745,3.745,0,0,1,1.07-2.6l37.814,7.293Zm2.172-10.673-17.64-3.4c1.532-7.07,4.333-19.457,5.474-22.73,5.42,1.043,10.994,2.116,16.607,3.2Zm16.246,3.133L996.4,291.8l4.44-22.933c5.212,1.005,10.445,2.014,15.61,3.012-1.736,8.048-4.425,20.067-5.277,22.77Zm-10.048-27.256,4.9-25.316,37.383,7.643-2.068,25.445c-10.512-2.035-25.04-4.845-40.217-7.77ZM201.455,310.76a.753.753,0,0,0-1.01.32l-4.62,8.944h1.688l4.264-8.254a.75.75,0,0,0-.322-1.01Zm-49.473,7.99c.6.014,1.292.04,1.992.077L153.4,320h1.672l.524-1.068a11.9,11.9,0,0,1,2.6.38c.33.145.854.4,1.425.688h3.28c-.854-.446-3.16-1.644-4.1-2.06a10.064,10.064,0,0,0-2.5-.453L167.046,295.6a.75.75,0,0,0-1.347-.66l-11.007,22.42c-1.065-.064-2.037-.1-2.518-.108l-24.733-11.56a.75.75,0,0,0-.634,1.36l25.017,11.692Zm-19.5-40.478a.747.747,0,0,0-.988.385L113.326,320h1.638l17.907-40.736a.75.75,0,0,0-.384-.988ZM27.625,263.46l11.1,5.62,3.525-12.262,2.338,6.04,1.033,2c-.664,1.445-5.137,11.2-6.2,14.274a77.162,77.162,0,0,1-4.672,8.737l-.62-.68v1.732c-1.555,2.63-3,4.987-3.594,5.96l-9.71-2.605a.751.751,0,1,0-.39,1.45l10.79,2.894.293-.476c.12-.193,1.21-1.96,2.612-4.292v4.364l-10.56,23.808h1.642l10.418-23.49v-5.47l14.825,16.3a47.39,47.39,0,0,1-1.392,6.226c-.517,1.24-1.49,4.946-1.875,6.438h1.55c.423-1.63,1.27-4.807,1.71-5.86a53.409,53.409,0,0,0,1.547-6.915l.06-.36L35.8,289.029a81.623,81.623,0,0,0,5.03-9.41c.88-2.54,4.3-10.09,5.658-13.07l4.208,8.14.223.11c.16.076,15.88,7.753,18.326,9.186,1.758,1.03,4.665,6.454,5.922,9.03a29.694,29.694,0,0,0-4.845,5.912l-10.018,21.1h1.66l2.918-6.15,11.308,6.15h4.3L94.909,291.21c3.017,1.994,7.766,7.816,8.1,11.528.316,3.538-1.222,14.425-1.64,17.286h1.516c.467-3.207,1.943-13.76,1.617-17.42-.39-4.38-5.593-10.633-8.916-12.744L109.1,262.85a.75.75,0,0,0-1.342-.672L94.2,289.268c-4.355-1.2-14.193.53-17.343,2.468-.164.1-.325.213-.487.326-1.112-2.254-4.134-8.063-6.366-9.37-2.363-1.384-16.19-8.15-18.2-9.132l-5.853-11.317L32.43,227.313v0l-5.354-13.83a.75.75,0,0,0-1.4.54l4.707,12.16-3.708-1.618-6.76-.627-1.452,28.128,9.162.753Zm50.018,29.554c2.688-1.655,11.984-3.32,15.88-2.39l-14.6,29.18-13.4-7.286,6.113-12.875c.028-.047,2.946-4.748,6-6.63ZM20.037,250.687l1.3-25.123,4.854.422,4.957,2.162L41.35,254.5l-3.57,12.416-8.655-4.38V251.435Z"/> <path id="Path_11" data-name="Path 11" class="cls-4" d="M24.492,200.644a.75.75,0,0,0-1.054.124l-6.655,8.43-2.03,15.417c-.008.1-.17,2.453-.424,6.09L0,218.406v1.978l14.2,12.19c-.21,3.034-.467,6.71-.74,10.62l-6.12,7.943L0,244.45v2.03l6.423,5.848L0,260.665v2.458l7.536-9.782,4.9,4.467c-.544,7.747-1.016,14.4-1.188,16.635-.1,1.29-.268,3.907-.475,7.27L0,271.714v2.046l10.66,9.888c-.4,6.535-.9,15.153-1.32,22.445L0,297.843v2L9.23,308c-.325,5.675-.586,10.276-.686,12.027h1.5c.33-5.81,2.247-39.575,2.7-45.466.495-6.43,3.47-49.406,3.5-49.793L18.217,209.8l6.4-8.106a.75.75,0,0,0-.125-1.053ZM12.572,255.9l-4.118-3.75,4.82-6.256c-.233,3.32-.47,6.733-.7,10.006ZM8.188,188.808a.75.75,0,0,0-1.058.072c-3.63,4.16-5.813,6.683-7.13,8.226v2.314c1.588-1.883,5.505-6.4,8.26-9.554a.75.75,0,0,0-.072-1.058ZM3.83,106.78c-.278-.225-2.07-2.1-3.83-3.96V105c1.36,1.434,2.657,2.774,2.925,2.975a.732.732,0,0,0,.44.148.753.753,0,0,0,.465-1.344ZM74.738,0,64.96,11.474a.75.75,0,1,0,1.143.972L76.71,0ZM120.05,0,105.737,17.217c-2.74-3.15-7.2-8.258-10.5-11.888L99.642,0H97.7L94.21,4.212a27.787,27.787,0,0,0-3.125-3.133C90.053.562,89.418,1.5,89.078,2c-.454.67-.712.954-1.23.884-.61-.08-2.386-1.275-4.477-2.88H80.94c2.4,1.93,5.452,4.2,6.713,4.37a2.713,2.713,0,0,0,2.67-1.532c.062-.092.145-.214.217-.308.43.384,1.416,1.43,2.71,2.846L78.887,22.73a.75.75,0,1,0,1.156.957L94.266,6.5c3.073,3.4,7.326,8.238,10.5,11.893L92.337,33.6a.75.75,0,0,0,1.162.95l12.826-15.69v0L122,0Z"/> <path id="Path_12" data-name="Path 12" class="cls-4" d="M212.505,304.58l-48.243-29.862-79.43-55.355a56.247,56.247,0,0,1,3.11-8.55c.58-1.258,1.347-2.614,2.158-4.05,2.063-3.65,4.4-7.787,4.65-12.1.332-5.788,3.163-29.72,3.975-32.81.074-.28.16-.624.255-1.017.6-2.428,1.706-6.922,3.69-9.876l12.3,12.4a.751.751,0,1,0,1.066-1.057l-12.427-12.528A4.63,4.63,0,0,1,107,148.083c4.26,0,13.69,5.638,19.93,9.37,2.263,1.353,4.218,2.52,5.56,3.214.92.475,1.968.938,3.077,1.38l-9.712,16.4a.75.75,0,1,0,1.29.763l9.844-16.627c5.013,1.82,10.888,3.124,13.383,2.995a66.427,66.427,0,0,1,9.792.988c-1.046,11.27-2.483,28.835-2.246,31.873.33,4.268,4.977,31.047,5.175,32.185a.75.75,0,0,0,.738.622.732.732,0,0,0,.13-.01.75.75,0,0,0,.61-.868c-.05-.278-4.832-27.848-5.16-32.045-.233-3.018,1.2-20.526,2.235-31.662a.73.73,0,0,0,.12-1.27c.416-4.41.75-7.585.85-8.006.19-.8,2.094-4.715,3.773-8.172,1.592-3.276,3.094-6.37,3.643-7.78.923-2.375,15.5-21.075,21.04-28.08a.75.75,0,0,0-1.177-.93c-2.053,2.6-20.088,25.45-21.262,28.467-.526,1.353-2.085,4.563-3.592,7.668a86.837,86.837,0,0,0-3.883,8.476c-.1.423-.437,3.6-.855,8.034a66.5,66.5,0,0,0-10.01-.99c-3.068.166-12.094-2.158-17.118-4.75-1.3-.67-3.236-1.83-5.478-3.17-6.764-4.043-16.026-9.58-20.7-9.58a6,6,0,0,0-4.445,2.133l-6.56-6.614c1.287-5.33,3.968-16.838,3.46-18.234-.494-1.358-8.685-9.054-11.93-12.068,41.163-50.812,50.715-62.842,52.93-65.85a5.6,5.6,0,0,0,1.185.932c.8.514,1.288.825,1.238,2.087a26.439,26.439,0,0,1-.378,3.176c-.3,1.873-.585,3.642.07,5.046s.714,5.56.68,7.04a.75.75,0,0,0,.733.768H144a.75.75,0,0,0,.75-.733c.013-.58.1-5.732-.82-7.71-.46-.986-.223-2.463.05-4.173a27.535,27.535,0,0,0,.4-3.355,3.4,3.4,0,0,0-1.928-3.41,2.313,2.313,0,0,1-1.338-1.635c-.577-3.027-.63-23.817-.08-25.25C141.66,17.586,147,4.3,147,3V0h-3.1L106.144,44.73a.75.75,0,0,0,1.146.967L145.5.427V2.97c-.126,1.148-5.026,13.658-5.783,15.046-.97,1.776-.45,24.3-.08,26.25.02.1.048.18.072.27l-.012.016c-.826,1.26-15.65,19.684-30.9,38.564L89.4,67.18c6.025-8.3,11.112-15.48,11.212-15.62a.751.751,0,0,0-1.224-.87c-.1.143-5.156,7.28-11.15,15.54L71.8,52.81c.822-.66,1.528-1.243,1.954-1.634.137-.126,13.31-13.945,12.717-16.125C86.127,33.778,63.808,15.781,43.991,0H41.583c4,3.18,8.377,6.682,12.8,10.234L50.26,16.7l-8.59,11.52L16.727,7.854,23.144,0H21.207l-5.643,6.91L7.1,0H4.73l9.886,8.07L1.726,23.85,0,22.447v1.93l.778.633L0,25.965v2.372l1.945-2.38c3.51,2.85,8.927,7.25,14.982,12.173L0,57.6v2.286l3.58-4.12c2.5,2.49,11.374,11.22,14.16,12.254a22.788,22.788,0,0,0,3.984.99c.423.077.82.153,1.2.234L9.437,83.888,0,76.536v1.9L16.788,91.516a37.045,37.045,0,0,1-5.8,4C9.742,95.482,2.8,89.972,0,87.455V89.43c2.463,2.142,5.87,4.72,5.923,4.76,3.2,2.36,4.408,2.833,5.054,2.833a1.22,1.22,0,0,0,.37-.056c1.47-.453,5.253-3.387,6.645-4.49,1.635,1.35,7.145,5.92,9.113,7.69-9.854,11.5-17.81,20.82-17.95,21-.086.114-.213.284-.368.5L0,114.172v1.97l7.905,6.74C5.835,125.767,1.98,131.239,0,134.058v2.608c.164-.234,6.22-8.86,9.05-12.81l7.89,6.725c-1.578,1.835-6.732,7.85-10.99,13.1l0,0,0,0c-.616.76-1.217,1.507-1.782,2.22-5.03,6.348-4.23,9.213-3.845,10.59.03.106.057.2.076.288.447,2.01,32.37,24.4,32.8,24.7h0l0,0c5.207,3.63,13.43,8.726,21.195,13.4l.013.01.008,0c10.512,6.334,20.173,11.9,20.34,11.993l.22.126,2.554-.33-.485,7.224L20.187,173.61a97.37,97.37,0,0,0-10.012-6.22L0,161.893v1.7l9.462,5.11a95.886,95.886,0,0,1,9.858,6.126l57.6,40.84L76.766,218c-.747,1.1-3.183,4.86-3.013,6.82.186,2.147,2.5,6.33,3.643,7.876A.75.75,0,1,0,78.6,231.8c-1.22-1.66-3.213-5.465-3.357-7.12-.1-1.2,1.705-4.32,2.87-6.008l.117-.17.123-1.828,4.76,3.317a15.2,15.2,0,0,0-.525,5.368c.3,1.92,1.83,3.56,3.452,5.295a17.77,17.77,0,0,1,3.678,4.966c1.64,3.915-.03,13.586-.047,13.684a.75.75,0,1,0,1.477.26c.073-.415,1.764-10.205-.047-14.525a19.174,19.174,0,0,0-3.965-5.41c-1.46-1.56-2.84-3.035-3.065-4.5a12.75,12.75,0,0,1,.378-4.21l78.986,55.046,48.35,29.926L241.7,320.024h3.512ZM98.035,124.343c.2,1.04-1.648,9.76-3.56,17.655l-9.51,12.037c-1.143-4.97-5.243-8.08-11.986-9.028-6.724-.947-10.332,1.575-13.514,3.8-.34.236-.675.47-1.012.7-2.872,1.95-5.28,6.02-6.215,7.747l-1.033-.76,17.322-21.06-.006-.006,18.056-22.452c4.692,4.362,11.03,10.48,11.454,11.37ZM83.749,155.866l-.835,27.466a14.363,14.363,0,0,1-8.035,7.276c-4.6,1.512-10.1.375-16.37-3.377l-.025-.014c-1.476-.83-4.752-6.778-6.517-10.424-.792-7.733,1.045-17.172,1.247-18.17.356-.7,3-5.788,6.08-7.876.344-.233.685-.472,1.03-.712,3.1-2.165,6.3-4.406,12.446-3.54,6.807.954,10.5,4.108,10.98,9.372ZM50.341,175.2l-7.223-6.45,7.2-11.046,1.35,1a73.859,73.859,0,0,0-1.328,16.5Zm-.322-19.623L31.1,140.186c1.913-2.346,9.353-11.46,17.533-21.468,2.412,2.568,14.774,14.02,17.838,16.852ZM88.517,68.4l19.34,15.887c-7.69,9.517-15.41,19.06-21.436,26.5l0,0-19,23.626c-6.81-6.294-16.54-15.388-17.83-16.856,9.306-11.385,19.32-23.617,23.113-28.194C76.388,84.9,82.779,76.284,88.516,68.4Zm-1.163-.952C81.62,75.33,75.227,83.958,71.547,88.4c-3.78,4.562-13.733,16.72-23.01,28.07-1.947-1.8-6.6-5.708-12.63-10.76-2.972-2.487-5.6-4.69-6.742-5.687,4.24-4.94,8.786-10.226,13.186-15.335l.007,0,.005-.008c11.983-13.917,22.862-26.5,23.391-26.992.643-.584,2.213-1.825,3.73-3.025l1.12-.885Zm-33.06,1.07c-3.68,4.262-8.03,9.32-12.554,14.587-2.775-2.54-14.553-13.3-15.915-14.325-.087-.065-.192-.108-.285-.166L37.9,55.182c7.94,6.456,14.44,11.74,16.4,13.332ZM38.917,54.077c1.807-1.964,7.876-8.443,10.837-10.18a18.646,18.646,0,0,0,3.95-3.922L69.413,52.8l-.86.678c-1.608,1.272-3.127,2.473-3.808,3.092-.442.4-4.155,4.657-9.47,10.81-2-1.628-8.468-6.888-16.36-13.3Zm46.048-18.63c-.805,2.118-10.59,13.13-12.222,14.626-.442.4-1.223,1.045-2.128,1.77L54.638,38.8c3.31-4.243,6.784-9.64,7.586-10.9a4.266,4.266,0,0,0,2.373.038c2.61-.708,4.315-3.787,5.04-5.388C77.682,29.1,83.894,34.271,84.965,35.447ZM55.56,11.176c4.432,3.56,8.848,7.125,12.87,10.393-.514,1.21-2.025,4.327-4.228,4.923a3.627,3.627,0,0,1-3.343-1.066c-4.5-3.8-7.908-7.233-9.036-8.4Zm-4.612,7.105c1.32,1.35,4.64,4.658,8.943,8.293a7.983,7.983,0,0,0,.96.693c-1.587,2.492-4.617,7.04-7.374,10.586L42.834,29.166ZM12.9,32.928l8.918-10.44a.75.75,0,1,0-1.14-.974L11.737,31.98C8.222,29.124,5.165,26.64,2.891,24.8L15.78,9.015,52.545,39.027A17.227,17.227,0,0,1,49,42.6c-3.207,1.88-9.468,8.585-11.246,10.524-8.033-6.532-17.336-14.1-24.848-20.2Zm9.09,34.6a21.569,21.569,0,0,1-3.73-.92C16.037,65.785,8.046,58.1,4.568,54.628L18.09,39.078c6.082,4.944,12.71,10.33,18.645,15.158l-12.65,13.74c-.636-.18-1.34-.308-2.094-.445ZM19.185,91.517l.022-.017-8.584-6.688L24.5,69.74a2.73,2.73,0,0,1,.425.235c1.125.844,10.557,9.43,15.84,14.264-4.245,4.942-8.606,10.028-12.685,14.79-1.968-1.77-7.025-5.967-8.9-7.514ZM9.932,122.639c.176-.24.32-.434.412-.555.718-.934,8.41-9.935,17.845-20.927,1.156,1.014,3.68,3.127,6.754,5.7,4.343,3.637,10.57,8.85,12.645,10.77-8.23,10.067-15.733,19.26-17.655,21.613l-11.46-9.32Zm8.16,8.9,31.036,25.24-7.615,11.68-1.766,2.488L7.57,144.066c4.154-5.1,9.007-10.764,10.522-12.524ZM1.832,156.357c-.02-.08-.044-.167-.07-.26-.32-1.138-.98-3.506,3.576-9.255.412-.52.846-1.06,1.288-1.61l32.25,26.947-5.432,7.657C20.228,170.6,3.08,157.984,1.832,156.358ZM34.677,180.69l7.588-10.7,8.36,7.467c.663,1.367,4.186,8.483,6.544,10.618l-2.706,5.11c-7.23-4.365-14.752-9.034-19.787-12.5Zm43.175,24.45-2.572.334c-1.473-.85-10.1-5.835-19.53-11.51l2.67-5.045c6.39,3.666,12.088,4.712,16.95,3.106a15.07,15.07,0,0,0,7.452-5.612l-.3,9.89Zm5.67,13.31-5.048-3.518.6-8.89,4.94-9.345L85.243,156.1l9.988-12.64,6.374,6.425c-2.27,3.218-3.442,7.994-4.08,10.592-.1.384-.177.72-.25.994-.853,3.24-3.677,27.1-4.023,33.1-.227,3.96-2.474,7.938-4.456,11.445-.827,1.464-1.608,2.847-2.213,4.162a60.994,60.994,0,0,0-3.06,8.262ZM284.632,0c-1.42,1.57-3.86,4.386-8.22,9.41-7.7,8.88-20.6,23.743-21.963,24.528-1.7.743-8.3.356-9.842-.024-1.925-.858-20.83-19.324-21.53-20.425-.08-.24-.177-1.366.61-6.644l.04-.3A60.019,60.019,0,0,1,228.975,0h-1.988c-2.34,2.713-4.622,5.518-4.73,6.27l-.052.354c-.668,4.476-.822,6.616-.532,7.39.394,1.05,20.574,20.852,22.52,21.34a36.346,36.346,0,0,0,6.35.51,13.166,13.166,0,0,0,4.508-.552c1.195-.522,8.206-8.452,22.5-24.92C281.49,5.848,285.24,1.523,286.64,0Z"/> <path id="Path_13" data-name="Path 13" class="cls-4" d="M337.306,76.434c-3.245-.164-8.8-.7-9.887-1.432-1.11-.747-6.075-6.206-9.447-10.03,5.5-4.868,12.068-11.6,11.942-13.37-.174-2.443-12.467-14.378-16.23-17.977a.75.75,0,1,0-1.037,1.084c7.574,7.243,15.544,15.585,15.77,16.97-.17,1.515-6.845,8.108-11.977,12.647-.006,0-.014.006-.02.012s-.01.013-.016.02a33.917,33.917,0,0,1-5.593,4.38c-.946-.355-4.02-3.678-7.06-7.144a.748.748,0,0,0-.07-.287.735.735,0,0,0-.538-.408c-1.713-1.964-3.37-3.914-4.58-5.338-1.83-2.153-3.277-3.854-3.867-4.44-1.756-1.747-12.4-15.162-14.553-17.875,11.428-13.2,28.513-29.863,32.013-33.253H310c-7.927,7.7-39.473,38.788-41.727,47.652a140.2,140.2,0,0,0-1.958,15.368c-9.917-.376-17.424-.62-18.4-.514-1.966.22-4.516,3.757-7.4,8.01-.508.746-.935,1.378-1.242,1.786-1.694,2.258-5.675,26.92-6.647,36.75-.02.21-.043.432-.066.652l-19.9-1.076a.763.763,0,0,0-.79.71.75.75,0,0,0,.708.788l19.818,1.072c-1.2,10.85-4.287,31.9-4.384,32.583l0,.013,0,.014-1.137,16.14a.75.75,0,0,0,.7.8.325.325,0,0,0,.054,0,.75.75,0,0,0,.747-.7l1-14.276c3.56,4.273,14.08,16.763,19.62,21.78.43.39.846.81,1.248,1.25C235.51,184.961,235.5,185.9,235.5,186.244a3.76,3.76,0,0,0,1.04,2.236c-.423.533-.676.882-.824,1.115l-.008.007-19.39,20.32c-3.844-4.293-7.768-8.38-8.83-8.543-2.11-.32-18.608,14.936-21.507,18.115-.976,1.07-1.2,1.468-1.083,1.932.258,1.03,14.07,20.235,19.995,28.444a.75.75,0,1,0,1.216-.877c-7.38-10.226-18.4-25.645-19.655-27.75,1.71-2.32,18.353-17.41,20.85-18.35,2.05,1.112,14.41,15.21,16.208,17.78a11.177,11.177,0,0,1,1.39,3.17c.462,1.45.9,2.82,2.206,3.45,1.82.876,19.57,9.376,19.57,9.376l.648-1.352s-17.75-8.5-19.568-9.375c-.725-.35-1.034-1.323-1.425-2.555a12.53,12.53,0,0,0-1.59-3.575c-.488-.7-3.8-4.68-7.42-8.768l18.748-19.65c.15.212.32.436.517.692a11.59,11.59,0,0,1,2.072,3.5c.41,1.366-.553,3.78-1.19,5.375a6.047,6.047,0,0,0-.71,2.5c.05.415.172,1.387,10.892,7.07a.75.75,0,0,0,.7-1.326c-4.43-2.35-9.28-5.172-10.09-6.024a14.856,14.856,0,0,1,.6-1.667c.758-1.9,1.793-4.495,1.233-6.36a12.776,12.776,0,0,0-2.32-3.984c-.27-.347-.593-.765-.72-.96.13-.19.376-.5.685-.876a2.767,2.767,0,0,0,.787.115c1.852,0,4.3-1.608,6.657-4.48,2.236-2.72,7.072-8.537,8.86-10.686a62.8,62.8,0,0,1,5.577,15.612c.493,2.39-1.324,8.69-5.4,18.73l-.29.715c-1.063,2.66.538,8.51.724,9.168a.75.75,0,0,0,.722.546.763.763,0,0,0,.2-.027.75.75,0,0,0,.518-.926c-.467-1.653-1.516-6.35-.775-8.2l.287-.707c2.713-6.675,6.23-15.97,5.48-19.6-.273-1.325-2.4-11.04-7.12-18.352.072-.077.15-.16.22-.238a.748.748,0,0,0-1.083-1.03,22.405,22.405,0,0,0-3.1-3.534c-6.075-5.5-18.68-20.666-20.45-22.805.156-1.08.68-4.693,1.33-9.306,4.076.2,20.908,1.04,21.49,1.04a.75.75,0,1,0,0-1.5c-.53,0-14.832-.71-21.28-1.03.98-6.994,2.165-15.758,2.81-21.567l28.737,1.554c-.495,7.88-.848,13.89-.97,16.01-9.36-.44-22.84-1.1-23.653-1.2a.75.75,0,0,0-.324,1.463c.485.12,14.876.813,23.932,1.238V134a3.482,3.482,0,0,0-2.433,1.815c-.4.873-.7,4.8-1.148,11.154-.237,3.352-.46,6.52-.662,7.924-.377,2.64-4.1,6.354-5.5,7.563a.75.75,0,1,0,.98,1.136c.223-.192,5.47-4.752,6-8.487.208-1.457.433-4.65.672-8.032.3-4.18.7-9.9,1.018-10.638a1.763,1.763,0,0,1,1.01-.854l-1.488,25.168H274.67v7.057a.75.75,0,1,0,1.5,0v-7.057h13.77l.06-.685c.026-.3,2.63-30.275,2.878-41.173.027-1.187.06-2.7.093-4.42l41.94,2.266h.042a.75.75,0,0,0,.04-1.5L293,112.969c.286-14.558.747-41.888.752-42.207a.75.75,0,0,0-.737-.763.76.76,0,0,0-.763.737c-.005.32-.465,27.585-.75,42.152l-27.26-1.475c.608-9.555,1.41-21.525,2.257-32.556h19.085l-.086-.828c-.094-.9-.464-3.918-1.3-4.895-1.084-1.265-11.6-.71-12.394-.112-.217.163-.71.533-1.106,4.334h-4.08c.352-4.533.712-8.875,1.068-12.79,5.92.227,12.064.476,16.69.663,5.822.236,9.667.392,10.128.392,1.385,0,6.168-2.11,8.15-3.014,5.034,5.735,7.126,7.64,8.176,7.64a.62.62,0,0,0,.075,0c.727-.066,3.105-1.846,5.943-4.29,1.922,2.18,8.217,9.263,9.738,10.29,1.752,1.18,9.18,1.61,10.65,1.685h.04a.75.75,0,0,0,.036-1.5ZM253.244,172.9c-1.38,1.662-6.81,8.19-9.222,11.124-1.99,2.424-3.86,3.662-5.08,3.892,3.126-3.627,9.276-10.41,13.98-15.533.11.172.217.344.322.518Zm-2.023-2.936c.29.367.575.742.85,1.13-8.362,9.09-12.506,13.764-14.555,16.2a2.5,2.5,0,0,1-.506-.943c.78-1.434,8.828-10.48,14.21-16.39Zm40.25-55.575c-.036,1.744-.068,3.27-.1,4.468-.226,9.93-2.422,35.842-2.813,40.392H261.67l1.5-25.43-.05,0v-4.18c.025-.416.417-7.2,1.02-16.73Zm-28.734-3.057-28.674-1.55.06-.584c1.078-10.918,5.057-34.272,6.353-36,.317-.422.76-1.073,1.282-1.844,1.462-2.154,4.887-7.2,6.326-7.36.892-.1,9.05.174,18.094.517-1.264,13.845-2.557,32.892-3.44,46.82Zm10.008-37.08c1.564-.338,9.184-.594,10.354-.084a10.739,10.739,0,0,1,.8,3.19h-11.7a19.11,19.11,0,0,1,.538-3.108ZM294.5,64.124c-.43,0-4.683-.172-10.066-.39-5.75-.233-11.465-.462-16.614-.66a138.361,138.361,0,0,1,1.907-15.057c.686-2.7,4.418-7.75,9.42-13.61,2.53,3.2,12.7,15.995,14.49,17.78.546.54,2.045,2.305,3.78,4.348,1.58,1.857,2.966,3.473,4.2,4.9-2.776,1.248-6.31,2.7-7.12,2.7ZM377.48,0c-2.5,2.395-7.36,6.825-10.66,9.794a.75.75,0,1,0,1,1.115c1.047-.942,9.3-8.37,11.79-10.91ZM420.3,5.638a.7.7,0,0,0-.058-.086.7.7,0,0,0-.06-.038c-1.994-2.13-3.83-4.063-5.22-5.514h-2.018c1.32,1.365,3.4,3.565,5.735,6.07-4.857,4.915-13.66,13.7-15.273,14.813-2.426,1.68-2.85,5.79-2.87,6.006l-1.8,43.35-29.87-2.117,3.156-55.8a.75.75,0,0,0-1.5-.084l-3.154,55.777L337.948,65.93a.75.75,0,1,0-.107,1.5l29.446,2.087-1.54,27.193a.75.75,0,0,0,.708.79l.043,0a.75.75,0,0,0,.75-.708l1.536-27.17L399.4,71.79h.054a.744.744,0,0,0,.28-.055.737.737,0,0,0,.082-.05.416.416,0,0,0,.22-.19.729.729,0,0,0,.094-.134.774.774,0,0,0,.033-.124.712.712,0,0,0,.04-.144l0-.01,0-.012,1.826-44.08c.1-1,.684-3.81,2.227-4.877,1.975-1.367,12.837-12.315,15.44-14.95,5.748,6.19,12.49,13.654,13.05,14.924v8.527a.75.75,0,0,0,1.5,0V22c0-1.2-7.7-9.684-13.95-16.362ZM527.16,0c1.594,1.706,3.688,4.635,3.6,5.745-.327,1.25-7.524,7.476-14.293,12.77a.751.751,0,0,0,.924,1.183c4.41-3.45,14.685-11.7,14.86-13.8.116-1.4-1.44-3.935-3.093-5.9Zm39.2,0-37.4,32.67a.75.75,0,1,0,.987,1.13L567.993.565a.74.74,0,0,0,.25-.565Zm61.232,11.47c-13.154-.16-27.865-.793-29.164-1.6-.6-.657-.494-5.308-.026-9.868h-1.51c-.375,3.62-.777,9.565.43,10.882,1.44,1.57,21.636,1.983,30.252,2.088h.01a.75.75,0,0,0,.008-1.5ZM741.22,21.5c-7.73,0-16.51-.317-17.617-.908C722.31,19.9,709.968,9.1,701.685,1.741c.315-.517.66-1.1,1.035-1.743h-1.744A39.516,39.516,0,0,1,698.8,3.416c-1.65.093-12.9-.64-21.192-1.177-6.137-.4-11.438-.738-12.485-.738-.676,0-1.4-.64-2.068-1.5h-1.84c.98,1.52,2.334,3,3.908,3,1,0,6.277.34,12.39.735,3,.194,5.555.356,7.78.5.843,10.34,4.417,53.622,5.41,55.605a25.076,25.076,0,0,0,2.868,3.68c1.787,2.077,4.488,5.214,4.553,6.516-.067,1.4-7.356,7.57-14.07,12.49a.75.75,0,0,0,.887,1.21c4.458-3.267,14.812-11.147,14.68-13.768-.083-1.69-2.09-4.144-4.913-7.424a26.356,26.356,0,0,1-2.656-3.356c-.49-1.23-1.935-16.292-3.358-32.53l27.664.538h.016a.75.75,0,0,0,.014-1.5l-27.826-.54c-.623-7.15-1.235-14.44-1.756-20.825,7.045.435,10.1.584,11.485.584.87,0,1.08-.06,1.218-.142a7.087,7.087,0,0,0,1.366-1.74c3.937,3.5,20.252,17.94,22.02,18.884,1.93,1.028,15.48,1.084,18.343,1.084a.754.754,0,0,0,.808-.75.79.79,0,0,0-.827-.75Z"/> <path id="Path_14" data-name="Path 14" class="cls-4" d="M830.292,6.83l-15.77-3.362L815.357,0h-1.542l-.76,3.155L800.585.5l.1-.5h-1.532l-.19.92-.973,4.722L773.58,1.592l.3-1.592h-1.527L769.77,13.586l-27.555-5.65a.75.75,0,1,0-.3,1.47l27.575,5.653-2.745,14.42-25.452-5.216a.75.75,0,0,0-.3,1.47l25.47,5.22-2.82,14.824v.008l-.594,3.115-8.68,5.947-14.505-4.225a.75.75,0,1,0-.42,1.44l14.62,4.26,6.113,7.522-5.654,21.524a.75.75,0,0,0,.536.916.76.76,0,0,0,.19.025.75.75,0,0,0,.726-.56l4.9-18.676,23.4,5.065-3.485,16.9a.75.75,0,0,0,.583.886.738.738,0,0,0,.152.016.75.75,0,0,0,.734-.6l3.482-16.882,30.443,6.59a.75.75,0,1,0,.317-1.466l-30.457-6.593.25-1.208,30.446,6.434a.777.777,0,0,0,.156.016.75.75,0,0,0,.153-1.484L786.6,68.31l2.7-13.085,30.36,6.074a.728.728,0,0,0,.15.014.75.75,0,0,0,.145-1.485L789.6,53.755l.334-1.62,30.248,6.43a.75.75,0,1,0,.31-1.465l-30.255-6.432,2.937-14.24L823.3,42.6a.759.759,0,0,0,.15.015.75.75,0,0,0,.15-1.486l-13.65-2.8L811.6,25.893c1.153.236,2.328.476,3.51.72h0c3.754.77,7.56,1.56,10.86,2.247a.75.75,0,1,0,.305-1.468c-1.06-.22-5.207-1.084-10.068-2.084l4.746-18.934,9.02,1.922a.75.75,0,0,0,.314-1.466Zm-30.01-4.864L812.7,4.614l-4.588,19.04c-5.66-1.148-10.592-2.12-11.237-2.157a1.957,1.957,0,0,1-.585-.19ZM773.3,3.064l24.39,4.048-2.77,13.426c-.8-.5-1.667-1.113-2.365-1.6a26.385,26.385,0,0,0-2.72-1.772c-1.58-.79-14.993-2.792-18.588-3.317Zm-12.734,58.88-4.97-6.12,7.055-4.833ZM784.58,70.67l-23.32-5.048.282-1.075,23.286,4.922Zm.55-2.67-23.256-4.915,2.447-12.856,23.507,4.7Zm3-14.538L764.6,48.755l.367-1.926,23.5,4.995Zm.64-3.106-23.52-5,2.683-14.1L791.7,36.128Zm4.535-21.99v0l-1.3,6.29-23.794-4.878,2.753-14.462c6.75.986,17.1,2.636,18.2,3.184a26.473,26.473,0,0,1,2.528,1.66c1.13.792,2.09,1.45,2.905,1.936L793.3,28.364Zm15.172,9.67-15-3.076,1.143-5.543,14.585,3.136Zm.926-6.975-14.48-3.112,1.062-5.15a2.852,2.852,0,0,0,.8.2c.605.036,6.4,1.186,13.34,2.6Zm5.338-6.055c-1.694-.348-3.442-.7-5.155-1.054l4.585-19.024,5.32,1.134ZM1280,26.843c-3.866-.93-8.18-2.03-9.355-2.475a9.031,9.031,0,0,1,.965-2.9A50.9,50.9,0,0,1,1280,22.9V21.358c-8.5-1.908-9.077-1.34-9.363-1.054-.794.794-1.8,3.972-1.384,4.85.17.365.367.776,10.747,3.236Z"/> </g> <g id="основные_дороги" data-name="основные дороги"> <path id="Path_15" data-name="Path 15" class="cls-5" d="M651.906,0,579.058,65.128a99.55,99.55,0,0,0-23.04,30.555l-108.716,223A2.987,2.987,0,0,0,447,320h6.338L561.41,98.312A93.567,93.567,0,0,1,583.063,69.6L660.908,0Z"/> <path id="Path_16" data-name="Path 16" class="cls-5" d="M497,0a2.99,2.99,0,0,0,.754,1.99c.93,1.05,93.128,105.14,103.026,116.028,10.1,11.11,81.664,100.557,85.724,106.646a149.574,149.574,0,0,1,16.633,35.23C707.244,273.04,717.573,308.284,721,320h6.252c-2.79-9.54-14.042-47.993-18.387-61.895a156.112,156.112,0,0,0-17.367-36.77c-4.092-6.138-76.12-96.182-86.276-107.353C596.108,103.96,516.887,14.54,504.005,0ZM649,311a2.986,2.986,0,0,1-1.317-.306L367.711,173.6a48.445,48.445,0,0,0-19.963-4.944l-53.056-1.607a3,3,0,1,1,.183-6l53.055,1.607a54.4,54.4,0,0,1,22.422,5.554l279.97,137.09A3,3,0,0,1,649,311ZM473.373,0l-35.54,30.863,6.555,7.55L488.626,0H473.373Z"/> <path id="Path_17" data-name="Path 17" class="cls-5" d="M201.155,320.024c5.583-10.882,37.706-73.547,43.12-85.28,5.675-12.295,18.962-41.083,30.366-55.6,7.226-9.2,140.87-126.176,146.555-131.152a3,3,0,1,1,3.95,4.516C377.13,94.528,284.866,175.844,279.36,182.854c-10.97,13.96-24.05,42.3-29.636,54.4-5.182,11.228-33.5,66.537-41.813,82.743ZM438.84,52.255l4.54-3.92,89.7,103.944-4.543,3.92ZM427,125l-.114,0a2,2,0,0,1-1.885-2.11l3.752-66.6a2,2,0,1,1,3.994.224L429,123.112A2,2,0,0,1,427,125Z"/> <path id="Path_18" data-name="Path 18" class="cls-5" d="M338.875,0l-9.86,165,5.99.358L344.726,2.67l75.588,36.873,2.63-5.392L352.94,0ZM45.942,0C59.89,11.258,242.63,158.762,254.08,168.3c12.782,10.652,22.65,24.372,27.074,37.644,2.464,7.39,2.3,12.927-.5,16.454-4.117,5.2-12.818,4.844-15.386,4.608-12.41-1.13-21.464,9.317-21.844,9.762a3,3,0,1,0,4.56,3.9c.074-.086,7.458-8.53,16.743-7.686,4.26.387,14.807.495,20.63-6.86,4.13-5.214,4.63-12.642,1.486-22.077-4.767-14.3-15.31-29.008-28.926-40.355C247.29,154.837,89.923,27.792,55.493,0Z"/> <path id="Path_19" data-name="Path 19" class="cls-5" d="M274.377,231.063a16.92,16.92,0,0,1-14.95-8.52c-3.406-5.677-1.957-15.93-.606-17.478l1.435-1.644,2.01.858a3,3,0,0,1,1.645,3.764c-.44,1.736-1.273,8.19.662,11.415,1.374,2.29,5.5,7.36,14.105,4.992a3,3,0,1,1,1.59,5.785,22.242,22.242,0,0,1-5.89.828Zm-11.983-21.33v0Zm0,0h0Zm.617-.4a3.012,3.012,0,0,1-.616.4,2.992,2.992,0,0,0,.615-.4ZM0,187.493l120.4,87.423a112.027,112.027,0,0,0,18.54,10.9L212.431,320h14.23L141.467,280.38a105.971,105.971,0,0,1-17.545-10.32L0,180.078ZM1044.43,320,1111.87,0h6.142l-67.446,320h-6.132Z"/> <path id="Path_20" data-name="Path 20" class="cls-5" d="M703.158,253.878a3,3,0,0,1-.966-5.84l176.344-59.95a60.472,60.472,0,0,1,31.068-2.083l159.5,31.3a3,3,0,0,1-1.158,5.89l-159.5-31.3a54.474,54.474,0,0,0-27.982,1.876L704.124,253.715a3,3,0,0,1-.966.16Z"/> <path id="Path_21" data-name="Path 21" class="cls-5" d="M1009.97,0,970.23,204.63a3,3,0,1,0,5.888,1.144L1016.09,0ZM907.392,0,885.912,101.92a52.36,52.36,0,0,0-.933,15.325l6.144,71.017a2.5,2.5,0,0,0,2.488,2.284c.073,0,.145,0,.22-.01a2.5,2.5,0,0,0,2.274-2.7l-6.145-71.016a47.359,47.359,0,0,1,.844-13.863L912.5,0ZM829.064,0,798.88,154.855a2.5,2.5,0,1,0,4.907.957L834.157,0Z"/> <path id="Path_22" data-name="Path 22" class="cls-5" d="M740.05,0l-4.67,82.7,347.836,68.092,4.818.914a2.5,2.5,0,1,0,.932-4.912l-4.8-.91L740.62,78.63,745.058,0ZM1266.1,320.024l-90.958-18.837a3,3,0,1,1,1.216-5.875l90.165,18.672L1280,300.508v8.484L1268.99,320ZM432.135,56.59a14.152,14.152,0,1,1,14.152-14.151A14.152,14.152,0,0,1,432.135,56.59Zm0-23.8a9.652,9.652,0,1,0,9.652,9.652,9.652,9.652,0,0,0-9.652-9.652Z"/> <path id="Path_23" data-name="Path 23" class="cls-5" d="M423.172,52.252a2,2,0,0,1-1.314-3.51L439.8,33.129a2,2,0,1,1,2.625,3.017L424.483,51.76a1.993,1.993,0,0,1-1.31.492ZM321.278,143.186a3,3,0,0,1-3-3v-4.532L365,94.066l6.315-1.884a3,3,0,1,1,1.715,5.75L368,99.434l-43.72,38.912v1.84a3,3,0,0,1-3,3ZM1046.39,0l69.17,13.7a2,2,0,1,1-.778,3.923L1025.8,0Zm-764.1,205.994c-1.24-26.95-.042-28.686.353-29.256.85-1.23,4.275-3.047,21.83-10.81,2.25-.995,4.558-2.016,5.835-2.6a58.047,58.047,0,0,0-5.245-8.94l3.292-2.273c4.45,6.446,6.5,10.675,6.087,12.57a2.466,2.466,0,0,1-1.134,1.618c-.558.335-2.322,1.123-7.22,3.29-5.864,2.593-17.8,7.872-20.074,9.432-.482,2.633-.253,15.392.272,26.79ZM285.774,179.2ZM557.738,101a2,2,0,0,1-1.795-2.88c.2-.4,4.87-9.765,13.61-10.808,6.1-.727,12.4,2.775,18.737,10.41a2,2,0,0,1-3.08,2.554c-5.41-6.524-10.52-9.547-15.184-8.992-6.6.788-10.45,8.516-10.49,8.594a2,2,0,0,1-1.8,1.122Z"/> <path id="Path_24" data-name="Path 24" class="cls-5" d="M588.987,102.317a2,2,0,0,1-1.5-.672c-18.137-20.416-2.46-40.423-2.3-40.623a2,2,0,1,1,3.12,2.505c-.592.744-13.67,17.63,2.17,35.462a2,2,0,0,1-1.493,3.327Z"/> <path id="Path_25" data-name="Path 25" class="cls-5" d="M570.837,69.884a28.585,28.585,0,0,1-16.07-5.133,2,2,0,1,1,2.462-3.152c.61.472,14.81,11.15,30.423-2.814a2,2,0,0,1,2.666,2.983c-6.93,6.2-13.723,8.117-19.483,8.117Z"/> <path id="Path_26" data-name="Path 26" class="cls-5" d="M557.1,102.317a2,2,0,0,1-1.9-2.643c.086-.248,8.3-25.025-2.533-37.24a2,2,0,1,1,2.992-2.656c12.38,13.96,3.7,40.077,3.33,41.182A2,2,0,0,1,557.1,102.317ZM625.224,0l-1.387,26.282a3,3,0,0,0,2.838,3.154c.054,0,.107,0,.16,0a3,3,0,0,0,2.994-2.842l1.4-26.6Z"/> <circle id="Ellipse_1" data-name="Ellipse 1" class="cls-5" cx="5.626" cy="5.626" r="5.626" transform="translate(468.711 264.453)"/> <path id="Path_27" data-name="Path 27" class="cls-5" d="M275.915,173.514c-12.81,0-23.325-7.743-23.482-7.862l2.4-3.2h0c.893.67,21.393,15.665,38.6.115l2.683,2.97a29.373,29.373,0,0,1-20.208,7.974Z"/> </g> </g> <path id="gis-1" data-name="Path 33" class="cls-8" d="M156.8,892.4s223.858,179.245,232.583,187.969c17.052,15.069,31.795,34.242,25.048,53.949-11.565,14.656-31.195,6.527-46.913,38.2S320.269,1264,320.269,1264l-219.369.9V892Z" /> <path id="gis-2" data-name="Path 34" class="cls-8" d="M459.5,903s56.675,29.008,72.078,36.411c18.42,9.621,13.754,15.117,23.14,24.855,9.151,9.738,21.588,4.458,33.582,17.934,11.5,13.4,45.764,52.769,58.454,67.243s12.492,30.932,1.784,49.173-70.439,142.76-70.439,142.76"/> <path id="gis-3" data-name="Path 35" class="cls-8" d="M569.183,1255.961s90.81-188.658,104.884-216.805,18.82-45.984,58.258-77.689c13.146-11.857,69.854-62.817,69.854-63.152" /> <path id="gis-4" data-name="Path 36" class="cls-8" d="M1173.3,1265.6l80.6-386h219.4v385.3Z"/> <path id="gis-5" data-name="Path 40" class="cls-8" d="M1550.3,1317.8,659.8,788.1h890.5Z"/> <image x="0" y="-5" xlink:href="car-1.svg"> <animateMotion begin="1s" dur="18s" repeatCount="indefinite" rotate="auto" restart="whenNotActive" fill="freeze" > <mpath xlink:href="#gis-1" /> </animateMotion> </image> <image x="0" y="-5" xlink:href="car-1.svg"> <animateMotion begin="7s" dur="18s" repeatCount="indefinite" rotate="auto" restart="whenNotActive" fill="freeze" > <mpath xlink:href="#gis-1" /> </animateMotion> </image> <image x="0" y="-5" xlink:href="car-1.svg"> <animateMotion begin="13s" dur="18s" repeatCount="indefinite" rotate="auto" restart="whenNotActive" fill="freeze" > <mpath xlink:href="#gis-1" /> </animateMotion> </image> <image x="0" y="-3" xlink:href="car-2.svg"> <animateMotion begin="-1s" dur="6s" repeatCount="indefinite" rotate="auto" restart="whenNotActive" fill="freeze" > <mpath xlink:href="#gis-3" /> </animateMotion> </image> <image x="0" y="-6" xlink:href="car-4.svg"> <animateMotion begin="0s" dur="15s" repeatCount="indefinite" rotate="auto" restart="whenNotActive" fill="freeze" > <mpath xlink:href="#gis-4" /> </animateMotion> </image> <image x="0" y="-6" xlink:href="car-4.svg"> <animateMotion begin="5s" dur="15s" repeatCount="indefinite" rotate="auto" restart="whenNotActive" fill="freeze" > <mpath xlink:href="#gis-4" /> </animateMotion> </image> <image x="0" y="-6" xlink:href="car-4.svg"> <animateMotion begin="10s" dur="15s" repeatCount="indefinite" rotate="auto" restart="whenNotActive" fill="freeze" > <mpath xlink:href="#gis-4" /> </animateMotion> </image> <image x="0" y="-5" xlink:href="car-3.svg"> <animateMotion begin="0s" dur="6s" repeatCount="indefinite" rotate="auto" restart="whenNotActive" fill="freeze" > <mpath xlink:href="#gis-2" /> </animateMotion> </image> <image x="0" y="-40" xlink:href="s.svg"> <animateMotion begin="0s" dur="10s" repeatCount="indefinite" rotate="auto" restart="whenNotActive" fill="freeze" > <mpath xlink:href="#gis-5" /> </animateMotion> </image> <image x="0" y="-40" xlink:href="s.svg"> <animateMotion begin="5s" dur="10s" repeatCount="indefinite" rotate="auto" restart="whenNotActive" fill="freeze" > <mpath xlink:href="#gis-5" /> </animateMotion> </image> </g> </svg>