<svg width="16" height="18" viewBox="0 0 16 18" class="svg" xmlns="http://www.w3.org/2000/svg">
<path d="M14.4014 0.399907H1.59677C1.17319 0.400919 0.767305 0.569896 0.468145 0.869773C0.168985 1.16965 0.000975639 1.57594 0.000976848 1.99952V15.9995C0.000851313 16.2097 0.0421318 16.4178 0.122464 16.612C0.202796 16.8061 0.3206 16.9826 0.469151 17.1312C0.617702 17.2799 0.79409 17.3978 0.988227 17.4782C1.18236 17.5587 1.39045 17.6001 1.60059 17.6001H14.4052C14.8294 17.6001 15.2363 17.4316 15.5363 17.1316C15.8363 16.8316 16.0048 16.4247 16.0048 16.0005V1.99952C16.0048 1.78913 15.9633 1.58081 15.8827 1.38649C15.802 1.19216 15.6839 1.01566 15.5349 0.867075C15.386 0.718487 15.2092 0.600741 15.0147 0.520577C14.8202 0.440414 14.6118 0.399404 14.4014 0.399907V0.399907ZM0.800791 16.0005V1.99952C0.800791 1.7874 0.885053 1.58397 1.03505 1.43398C1.18504 1.28398 1.38847 1.19972 1.60059 1.19972H2.00098V16.8003H1.60059C1.38847 16.8003 1.18504 16.716 1.03505 16.566C0.885053 16.416 0.800791 16.2126 0.800791 16.0005V16.0005ZM15.2012 16.0005C15.2012 16.2126 15.1169 16.416 14.9669 16.566C14.8169 16.716 14.6135 16.8003 14.4014 16.8003H2.80078V1.19972H14.4014C14.6135 1.19972 14.8169 1.28398 14.9669 1.43398C15.1169 1.58397 15.2012 1.7874 15.2012 1.99952V16.0005Z" fill="black"/>
<path d="M14.4368 7.40894C14.383 7.34332 14.3027 7.30501 14.2185 7.30501H13.148C12.8838 6.60819 12.5396 5.92545 12.1484 5.66774C10.7951 4.77742 7.20543 4.77742 5.85211 5.66774C5.46061 5.92574 5.11785 6.60932 4.85225 7.30501H3.7817C3.69664 7.30501 3.61665 7.34332 3.56342 7.40894C3.50991 7.47429 3.4885 7.56076 3.50596 7.64385L3.66453 8.41221C3.69157 8.54318 3.80705 8.63669 3.94027 8.63669H4.2574C3.95125 8.98988 3.80282 9.43462 3.80085 9.87964C3.79888 10.4294 4.00758 10.9263 4.38922 11.2778C4.39344 11.2814 4.39767 11.284 4.40161 11.2876V12.3627C4.40161 12.5957 4.59088 12.7852 4.82408 12.7852H5.81155C6.04475 12.7852 6.23402 12.5957 6.23402 12.3627V11.9307H11.7659V12.3627C11.7659 12.5957 11.9552 12.7852 12.1884 12.7852H13.1758C13.4085 12.7852 13.5983 12.5957 13.5983 12.3627V11.3088C14.0033 10.9378 14.1968 10.4275 14.1994 9.91794C14.2011 9.45772 14.0459 8.99664 13.7217 8.63612H14.0599C14.1937 8.63612 14.3092 8.54261 14.3357 8.41136L14.4945 7.64328C14.5109 7.56076 14.4903 7.47485 14.4368 7.40894ZM6.31598 6.37329C7.3947 5.66323 10.6052 5.66323 11.6834 6.37329C11.8929 6.51074 12.1625 7.06645 12.4095 7.74693H5.59045C5.8369 7.06673 6.10644 6.5113 6.31598 6.37329ZM5.0525 9.98554C5.0525 9.52644 5.42484 9.15465 5.88365 9.15465C6.34302 9.15465 6.7148 9.52644 6.7148 9.98554C6.7148 10.4446 6.34302 10.8167 5.88365 10.8167C5.42484 10.8167 5.0525 10.4446 5.0525 9.98554ZM12.1273 10.8167C11.6685 10.8167 11.2961 10.4446 11.2961 9.98554C11.2961 9.52644 11.6685 9.15465 12.1273 9.15465C12.5866 9.15465 12.9584 9.52644 12.9584 9.98554C12.9584 10.4446 12.5861 10.8167 12.1273 10.8167Z" fill="black"/>
</svg>
