<svg width="57" height="19" viewBox="0 0 57 19" fill="none" xmlns="http://www.w3.org/2000/svg">
<path d="M24.6999 17.7487H20.0825L22.9706 0.324219H27.5877L24.6999 17.7487Z" fill="#00579F"/>
<path d="M41.4383 0.749642C40.5276 0.397082 39.083 0.0078125 37.2969 0.0078125C32.7371 0.0078125 29.5261 2.38038 29.5064 5.77244C29.4685 8.2751 31.8053 9.66514 33.5531 10.4996C35.3395 11.3523 35.9468 11.9089 35.9468 12.6689C35.9286 13.8362 34.5033 14.3743 33.1739 14.3743C31.3304 14.3743 30.3426 14.0969 28.8416 13.4475L28.2335 13.1691L27.5874 17.0805C28.6704 17.5619 30.6656 17.9891 32.7371 18.0078C37.582 18.0078 40.7361 15.672 40.7735 12.0572C40.7919 10.0736 39.558 8.55375 36.8977 7.31178C35.2827 6.51452 34.2937 5.97693 34.2937 5.16119C34.3126 4.41961 35.1302 3.66004 36.9532 3.66004C38.4543 3.62284 39.5572 3.97491 40.3927 4.32722L40.8104 4.51225L41.4383 0.749642Z" fill="#00579F"/>
<path d="M47.575 11.5758C47.9553 10.5748 49.4185 6.7006 49.4185 6.7006C49.3993 6.7378 49.798 5.6811 50.026 5.0324L50.3487 6.5338C50.3487 6.5338 51.2231 10.7046 51.413 11.5758C50.6913 11.5758 48.487 11.5758 47.575 11.5758ZM53.2746 0.324219H49.7031C48.6017 0.324219 47.7649 0.639083 47.2897 1.76993L40.4312 17.7484H45.276C45.276 17.7484 46.0737 15.5979 46.2451 15.1347C46.7766 15.1347 51.4897 15.1347 52.1735 15.1347C52.306 15.7464 52.7244 17.7484 52.7244 17.7484H56.9997L53.2746 0.324219Z" fill="#00579F"/>
<path d="M16.2256 0.324219L11.7037 12.206L11.2095 9.79627C10.3735 7.0157 7.75161 3.99468 4.82568 2.49255L8.96763 17.7302H13.8504L21.1082 0.324219H16.2256Z" fill="#00579F"/>
<path d="M7.50494 0.324219H0.076001L0 0.676285C5.79504 2.12225 9.63298 5.60768 11.2098 9.79701L9.59485 1.7889C9.32897 0.676039 8.51189 0.360928 7.50494 0.324219Z" fill="#FAA61A"/>
</svg>
