<svg width="24" height="25" viewBox="0 0 24 25" fill="none" xmlns="http://www.w3.org/2000/svg">
<g clip-path="url(#clip0_7292_27)">
<path d="M18.5333 11.1571H5.46664C4.43571 11.1571 3.59998 12.1339 3.59998 13.3389V20.9753C3.59998 22.1803 4.43571 23.1571 5.46664 23.1571H18.5333C19.5642 23.1571 20.4 22.1803 20.4 20.9753V13.3389C20.4 12.1339 19.5642 11.1571 18.5333 11.1571Z" stroke="current" stroke-width="1.5" stroke-linecap="round" stroke-linejoin="round"/>
<path d="M7.20001 11.1572V6.89058C7.20001 5.4761 7.70573 4.11954 8.6059 3.11935C9.50607 2.11915 10.727 1.55725 12 1.55725C13.2731 1.55725 14.494 2.11915 15.3941 3.11935C16.2943 4.11954 16.8 5.4761 16.8 6.89058V11.1572" stroke="current" stroke-width="1.5" stroke-linecap="round" stroke-linejoin="round"/>
</g>
<defs>
<clipPath id="clip0_7292_27">
<rect width="24" height="24" fill="white" transform="translate(0 0.357178)"/>
</clipPath>
</defs>
</svg>
