{ "build": {
    "tests": ["test_utils.es"
             ,"test_swipelistener.es"
             ,"test_browser.es"
             ,"test_browserfix_url.es"
             ,"test_pulldown.es"
             ,"test_selectlists_register.es"
             ,"test_autosuggest.es"
             ,"test_merge.es"
             ,"test_datatransfer.es"
             ,"test_dialogapi.es"
             ]
  }
}
