{
    "type": "sqlite",
    "database":"./src/database/database.sqlite",
    "migrations": ["./src/database/migrations/**.ts"],
    "entities": ["./src/entities/**.ts"],
    "cli":{
        "entitiesDir": "src/entities",
        "migrationsDir": "./src/database/migrations"
    }
}