[
	{
		"name": "Football",
		"category": "Sporting Goods",
		"price": 49.99,
		"inStock": true
	},
	{
		"name": "Ipod Touch",
		"category": "Electronics",
		"price": 99.99,
		"inStock": true
	},
	{
		"name": "Basketball",
		"category": "Sporting Goods",
		"price": 29.99,
		"inStock": false
	},
	{
		"name": "Iphone 5",
		"category": "Electronics",
		"price": 399.99,
		"inStock": false
	},
	{
		"name": "Nexus 7",
		"category": "Electronics",
		"price": 199.99,
		"inStock": true
	},
	{
		"name": "Baseball",
		"category": "Sporting Goods",
		"price": 9.99,
		"inStock": true
	}
]
