<?xml version="1.0" encoding="UTF-8" standalone="no"?>
<!-- Created with Inkscape (http://www.inkscape.org/) -->

<svg
   xmlns:dc="http://purl.org/dc/elements/1.1/"
   xmlns:cc="http://creativecommons.org/ns#"
   xmlns:rdf="http://www.w3.org/1999/02/22-rdf-syntax-ns#"
   xmlns:svg="http://www.w3.org/2000/svg"
   xmlns="http://www.w3.org/2000/svg"
   xmlns:xlink="http://www.w3.org/1999/xlink"
   xmlns:sodipodi="http://sodipodi.sourceforge.net/DTD/sodipodi-0.dtd"
   xmlns:inkscape="http://www.inkscape.org/namespaces/inkscape"
   width="64"
   height="64"
   viewBox="0 0 16.933333 16.933334"
   version="1.1"
   id="svg8"
   sodipodi:docname="icL-dark.svg"
   inkscape:version="0.92.2 2405546, 2018-03-11"
   inkscape:export-filename="/home/lixcode/Qt/icL-colorful-dark.png"
   inkscape:export-xdpi="1564.4938"
   inkscape:export-ydpi="1564.4938">
  <defs
     id="defs2">
    <linearGradient
       inkscape:collect="always"
       id="linearGradient942">
      <stop
         style="stop-color:#117aff;stop-opacity:1"
         offset="0"
         id="stop938" />
      <stop
         style="stop-color:#32ff5a;stop-opacity:0"
         offset="1"
         id="stop940" />
    </linearGradient>
    <linearGradient
       id="linearGradient932"
       inkscape:collect="always">
      <stop
         id="stop928"
         offset="0"
         style="stop-color:#9031ff;stop-opacity:1" />
      <stop
         id="stop930"
         offset="1"
         style="stop-color:#ff3232;stop-opacity:0" />
    </linearGradient>
    <linearGradient
       inkscape:collect="always"
       id="linearGradient922">
      <stop
         style="stop-color:#ff56a4;stop-opacity:1"
         offset="0"
         id="stop918" />
      <stop
         style="stop-color:#ff0e7d;stop-opacity:0"
         offset="1"
         id="stop920" />
    </linearGradient>
    <linearGradient
       id="linearGradient912"
       inkscape:collect="always">
      <stop
         id="stop908"
         offset="0"
         style="stop-color:#a020ff;stop-opacity:1" />
      <stop
         id="stop910"
         offset="1"
         style="stop-color:#9c20ff;stop-opacity:0" />
    </linearGradient>
    <linearGradient
       inkscape:collect="always"
       id="linearGradient900">
      <stop
         style="stop-color:#6defff;stop-opacity:1"
         offset="0"
         id="stop896" />
      <stop
         style="stop-color:#20e5ff;stop-opacity:0"
         offset="1"
         id="stop898" />
    </linearGradient>
    <radialGradient
       inkscape:collect="always"
       xlink:href="#linearGradient900"
       id="radialGradient902"
       cx="2.921082"
       cy="282.7204"
       fx="2.921082"
       fy="282.7204"
       r="8.3121799"
       gradientTransform="matrix(1,0,0,1.0000343,-8.41875e-7,-0.00989486)"
       gradientUnits="userSpaceOnUse" />
    <radialGradient
       inkscape:collect="always"
       xlink:href="#linearGradient912"
       id="radialGradient906"
       gradientUnits="userSpaceOnUse"
       gradientTransform="matrix(1,0,0,1.0000343,-1.541875e-6,-0.00989486)"
       cx="12.156371"
       cy="281.75061"
       fx="12.156371"
       fy="281.75061"
       r="8.3121799" />
    <radialGradient
       inkscape:collect="always"
       xlink:href="#linearGradient922"
       id="radialGradient916"
       gradientUnits="userSpaceOnUse"
       gradientTransform="matrix(1,0,0,1.0000343,-7.58125e-7,-0.00989486)"
       cx="16.225494"
       cy="286.32693"
       fx="16.225494"
       fy="286.32693"
       r="8.3121799" />
    <radialGradient
       inkscape:collect="always"
       xlink:href="#linearGradient932"
       id="radialGradient926"
       gradientUnits="userSpaceOnUse"
       gradientTransform="matrix(1,0,0,1.0000343,-7.61875e-7,-0.00989486)"
       cx="13.225308"
       cy="295.11459"
       fx="13.225308"
       fy="295.11459"
       r="8.3121799" />
    <radialGradient
       inkscape:collect="always"
       xlink:href="#linearGradient942"
       id="radialGradient936"
       gradientUnits="userSpaceOnUse"
       gradientTransform="matrix(1,0,0,1.0000343,-1.238125e-6,-0.00989486)"
       cx="2.2876222"
       cy="293.79172"
       fx="2.2876222"
       fy="293.79172"
       r="8.3121799" />
  </defs>
  <sodipodi:namedview
     id="base"
     pagecolor="#131313"
     bordercolor="#666666"
     borderopacity="1.0"
     inkscape:pageopacity="0"
     inkscape:pageshadow="2"
     inkscape:zoom="8"
     inkscape:cx="33.823177"
     inkscape:cy="29.613613"
     inkscape:document-units="px"
     inkscape:current-layer="layer1"
     showgrid="false"
     units="px"
     showguides="false"
     inkscape:guide-bbox="true"
     inkscape:object-paths="false"
     inkscape:snap-intersection-paths="true"
     inkscape:window-width="1920"
     inkscape:window-height="1052"
     inkscape:window-x="0"
     inkscape:window-y="28"
     inkscape:window-maximized="1"
     inkscape:snap-page="true"
     inkscape:snap-global="false">
    <sodipodi:guide
       position="8.4666667,9.9223816"
       orientation="1,0"
       id="guide815"
       inkscape:locked="false"
       inkscape:label=""
       inkscape:color="rgb(0,0,255)" />
    <sodipodi:guide
       position="-2.3051996,8.4666667"
       orientation="0,1"
       id="guide817"
       inkscape:locked="false"
       inkscape:label=""
       inkscape:color="rgb(0,0,255)" />
    <sodipodi:guide
       position="-5.1115296,0.52916667"
       orientation="0,1"
       id="guide819"
       inkscape:locked="false"
       inkscape:label=""
       inkscape:color="rgb(0,0,255)" />
    <sodipodi:guide
       position="0.52916667,20.011807"
       orientation="1,0"
       id="guide823"
       inkscape:locked="false"
       inkscape:label=""
       inkscape:color="rgb(0,0,255)" />
    <sodipodi:guide
       position="7.9375003,8.466667"
       orientation="1,0"
       id="guide881"
       inkscape:locked="false" />
    <sodipodi:guide
       position="8.4666664,7.9374937"
       orientation="0,1"
       id="guide883"
       inkscape:locked="false" />
    <sodipodi:guide
       position="9.6620162,8.466667"
       orientation="1,0"
       id="guide885"
       inkscape:locked="false" />
    <sodipodi:guide
       position="10.054167,8.466667"
       orientation="1,0"
       id="guide887"
       inkscape:locked="false" />
    <sodipodi:guide
       position="8.4666664,10.054159"
       orientation="0,1"
       id="guide889"
       inkscape:locked="false" />
    <sodipodi:guide
       position="8.9958339,8.4666667"
       orientation="1,0"
       id="guide891"
       inkscape:locked="false" />
  </sodipodi:namedview>
  <metadata
     id="metadata5">
    <rdf:RDF>
      <cc:Work
         rdf:about="">
        <dc:format>image/svg+xml</dc:format>
        <dc:type
           rdf:resource="http://purl.org/dc/dcmitype/StillImage" />
        <dc:title></dc:title>
      </cc:Work>
    </rdf:RDF>
  </metadata>
  <g
     inkscape:label="Layer 1"
     inkscape:groupmode="layer"
     id="layer1"
     transform="translate(0,-280.06665)">
    <circle
       style="opacity:1;fill:#262626;fill-opacity:1;stroke:none;stroke-width:0.52900004;stroke-linejoin:bevel;stroke-miterlimit:4;stroke-dasharray:none;stroke-opacity:1"
       id="path825"
       cx="8.4666672"
       cy="288.53333"
       r="7.9375" />
    <path
       style="opacity:1;fill:#9696ff;fill-opacity:1;stroke:none;stroke-width:0.43785021;stroke-linejoin:bevel;stroke-miterlimit:4;stroke-dasharray:none;stroke-opacity:1"
       d="m 8.4666353,280.22085 c -4.5873342,0 -8.31189031,3.72514 -8.31189019,8.31247 0,4.58733 3.72455599,8.31246 8.31189019,8.31246 4.5873347,0 8.3124697,-3.72513 8.3124697,-8.31246 0,-4.58733 -3.725135,-8.31247 -8.3124697,-8.31247 z m 0,0.59375 c 4.2664497,0 7.7187227,3.45227 7.7187227,7.71872 0,2.3888 -1.082972,4.5217 -2.784353,5.93689 H 12.62403 l 0.05682,-8.60644 -0.593749,-0.004 -0.05914,8.90622 a 0.29690365,0.29690365 0 0 0 0.298034,0.29803 h 0.256285 c -1.191009,0.75153 -2.6016522,1.1875 -4.1156467,1.1875 -4.2664492,0 -7.71814233,-3.45169 -7.71814233,-7.71814 0,-4.26645 3.45169313,-7.71872 7.71814233,-7.71872 z m 0,5.93747 a 1.7812436,1.7812436 0 0 0 -1.7812435,1.78125 1.7812436,1.7812436 0 0 0 1.7812435,1.78124 1.7812436,1.7812436 0 0 0 1.7812437,-1.78124 1.7812436,1.7812436 0 0 0 -1.7812437,-1.78125 z m 2.9698987,4.15682 c -0.741963,0 -1.430555,0.39592 -1.8015373,1.03848 -0.370982,0.64256 -0.370982,1.43498 0,2.07753 0.3709823,0.64256 1.0595743,1.03906 1.8015373,1.03906 v -0.59375 c -0.53079,0 -1.021252,-0.28134 -1.286646,-0.74102 -0.2653958,-0.45968 -0.2653958,-1.02585 0,-1.48553 0.265394,-0.45968 0.755856,-0.74103 1.286646,-0.74103 z m -3.2679322,0.59374 v 3.56133 h 0.5937479 v -3.56133 z"
       id="path827"
       inkscape:connector-curvature="0" />
    <path
       inkscape:connector-curvature="0"
       id="path894"
       d="m 8.4666329,280.22085 c -4.5873331,0 -8.31188874,3.72514 -8.31188874,8.31247 0,4.58733 3.72455564,8.31246 8.31188874,8.31246 4.5873341,0 8.3124691,-3.72513 8.3124691,-8.31246 0,-4.58733 -3.725135,-8.31247 -8.3124691,-8.31247 z m 0,0.59375 c 4.2664491,0 7.7187221,3.45227 7.7187221,7.71872 0,2.3888 -1.082972,4.5217 -2.784353,5.93689 h -0.776975 l 0.05682,-8.60644 -0.593749,-0.004 -0.05914,8.90622 a 0.29690365,0.29690365 0 0 0 0.298034,0.29803 h 0.256285 c -1.191009,0.75153 -2.6016517,1.1875 -4.1156461,1.1875 -4.2664478,0 -7.71814047,-3.45169 -7.71814047,-7.71814 0,-4.26645 3.45169267,-7.71872 7.71814047,-7.71872 z m 0,5.93747 a 1.7812436,1.7812436 0 0 0 -1.7812421,1.78125 1.7812436,1.7812436 0 0 0 1.7812421,1.78124 1.7812436,1.7812436 0 0 0 1.7812431,-1.78124 1.7812436,1.7812436 0 0 0 -1.7812431,-1.78125 z m 2.9698981,4.15682 c -0.741963,0 -1.430555,0.39592 -1.8015367,1.03848 -0.3709817,0.64256 -0.3709817,1.43498 0,2.07753 0.3709817,0.64256 1.0595737,1.03906 1.8015367,1.03906 v -0.59375 c -0.53079,0 -1.021252,-0.28134 -1.286646,-0.74102 -0.2653957,-0.45968 -0.2653957,-1.02585 0,-1.48553 0.265394,-0.45968 0.755856,-0.74103 1.286646,-0.74103 z m -3.2679308,0.59374 v 3.56133 h 0.5937477 v -3.56133 z"
       style="opacity:1;fill:url(#radialGradient902);fill-opacity:1;stroke:none;stroke-width:0.43785021;stroke-linejoin:bevel;stroke-miterlimit:4;stroke-dasharray:none;stroke-opacity:1" />
    <path
       style="opacity:1;fill:url(#radialGradient906);fill-opacity:1;stroke:none;stroke-width:0.43785021;stroke-linejoin:bevel;stroke-miterlimit:4;stroke-dasharray:none;stroke-opacity:1"
       d="m 8.4666329,280.22085 c -4.5873328,0 -8.31188944,3.72514 -8.31188844,8.31247 0,4.58733 3.72455564,8.31246 8.31188844,8.31246 4.5873341,0 8.3124691,-3.72513 8.3124691,-8.31246 0,-4.58733 -3.725135,-8.31247 -8.3124691,-8.31247 z m 0,0.59375 c 4.2664491,0 7.7187221,3.45227 7.7187221,7.71872 0,2.3888 -1.082972,4.5217 -2.784353,5.93689 h -0.776975 l 0.05682,-8.60644 -0.593749,-0.004 -0.05914,8.90622 a 0.29690365,0.29690365 0 0 0 0.298034,0.29803 h 0.256285 c -1.191009,0.75153 -2.6016517,1.1875 -4.1156461,1.1875 -4.2664478,0 -7.71814147,-3.45169 -7.71814147,-7.71814 0,-4.26645 3.45169367,-7.71872 7.71814147,-7.71872 z m 0,5.93747 a 1.7812436,1.7812436 0 0 0 -1.7812418,1.78125 1.7812436,1.7812436 0 0 0 1.7812418,1.78124 1.7812436,1.7812436 0 0 0 1.7812431,-1.78124 1.7812436,1.7812436 0 0 0 -1.7812431,-1.78125 z m 2.9698981,4.15682 c -0.741963,0 -1.430555,0.39592 -1.8015377,1.03848 -0.3709817,0.64256 -0.3709817,1.43498 0,2.07753 0.3709827,0.64256 1.0595747,1.03906 1.8015377,1.03906 v -0.59375 c -0.53079,0 -1.021252,-0.28134 -1.286646,-0.74102 -0.2653957,-0.45968 -0.2653957,-1.02585 0,-1.48553 0.265394,-0.45968 0.755856,-0.74103 1.286646,-0.74103 z m -3.2679308,0.59374 v 3.56133 h 0.5937467 v -3.56133 z"
       id="path904"
       inkscape:connector-curvature="0" />
    <path
       inkscape:connector-curvature="0"
       id="path914"
       d="m 8.4666347,280.22085 c -4.5873337,0 -8.31189044,3.72514 -8.31188944,8.31247 0,4.58733 3.72455574,8.31246 8.31188944,8.31246 4.5873353,0 8.3124703,-3.72513 8.3124703,-8.31246 0,-4.58733 -3.725135,-8.31247 -8.3124703,-8.31247 z m 0,0.59375 c 4.2664503,0 7.7187233,3.45227 7.7187233,7.71872 0,2.3888 -1.082972,4.5217 -2.784353,5.93689 H 12.62403 l 0.05682,-8.60644 -0.593749,-0.004 -0.05914,8.90622 a 0.29690365,0.29690365 0 0 0 0.298034,0.29803 h 0.256285 c -1.191009,0.75153 -2.6016523,1.1875 -4.1156473,1.1875 -4.2664487,0 -7.71814274,-3.45169 -7.71814274,-7.71814 0,-4.26645 3.45169404,-7.71872 7.71814274,-7.71872 z m 0,5.93747 a 1.7812436,1.7812436 0 0 0 -1.781243,1.78125 1.7812436,1.7812436 0 0 0 1.781243,1.78124 1.7812436,1.7812436 0 0 0 1.7812443,-1.78124 1.7812436,1.7812436 0 0 0 -1.7812443,-1.78125 z m 2.9698993,4.15682 c -0.741963,0 -1.430555,0.39592 -1.8015383,1.03848 -0.370982,0.64256 -0.370982,1.43498 0,2.07753 0.3709833,0.64256 1.0595753,1.03906 1.8015383,1.03906 v -0.59375 c -0.53079,0 -1.021252,-0.28134 -1.286646,-0.74102 -0.2653963,-0.45968 -0.2653963,-1.02585 0,-1.48553 0.265394,-0.45968 0.755856,-0.74103 1.286646,-0.74103 z m -3.2679323,0.59374 v 3.56133 h 0.593747 v -3.56133 z"
       style="opacity:1;fill:url(#radialGradient916);fill-opacity:1;stroke:none;stroke-width:0.43785021;stroke-linejoin:bevel;stroke-miterlimit:4;stroke-dasharray:none;stroke-opacity:1" />
    <path
       style="opacity:1;fill:url(#radialGradient926);fill-opacity:1;stroke:none;stroke-width:0.43785021;stroke-linejoin:bevel;stroke-miterlimit:4;stroke-dasharray:none;stroke-opacity:1"
       d="m 8.466635,280.22085 c -4.5873337,0 -8.31189075,3.72514 -8.31188975,8.31247 0,4.58733 3.72455605,8.31246 8.31188975,8.31246 4.587335,0 8.31247,-3.72513 8.31247,-8.31246 0,-4.58733 -3.725135,-8.31247 -8.31247,-8.31247 z m 0,0.59375 c 4.26645,0 7.718723,3.45227 7.718723,7.71872 0,2.3888 -1.082972,4.5217 -2.784353,5.93689 H 12.62403 l 0.05682,-8.60644 -0.593749,-0.004 -0.05914,8.90622 a 0.29690365,0.29690365 0 0 0 0.298034,0.29803 h 0.256285 c -1.191009,0.75153 -2.6016517,1.1875 -4.115647,1.1875 -4.2664487,0 -7.71814277,-3.45169 -7.71814277,-7.71814 0,-4.26645 3.45169407,-7.71872 7.71814277,-7.71872 z m 0,5.93747 a 1.7812436,1.7812436 0 0 0 -1.781243,1.78125 1.7812436,1.7812436 0 0 0 1.781243,1.78124 1.7812436,1.7812436 0 0 0 1.781244,-1.78124 1.7812436,1.7812436 0 0 0 -1.781244,-1.78125 z m 2.969899,4.15682 c -0.741963,0 -1.430555,0.39592 -1.8015377,1.03848 -0.3709823,0.64256 -0.3709823,1.43498 0,2.07753 0.3709827,0.64256 1.0595747,1.03906 1.8015377,1.03906 v -0.59375 c -0.53079,0 -1.021252,-0.28134 -1.286646,-0.74102 -0.2653957,-0.45968 -0.2653957,-1.02585 0,-1.48553 0.265394,-0.45968 0.755856,-0.74103 1.286646,-0.74103 z m -3.267932,0.59374 v 3.56133 h 0.593747 v -3.56133 z"
       id="path924"
       inkscape:connector-curvature="0" />
    <path
       inkscape:connector-curvature="0"
       id="path934"
       d="m 8.4666329,280.22085 c -4.5873325,0 -8.31188914,3.72514 -8.31188814,8.31247 0,4.58733 3.72455564,8.31246 8.31188814,8.31246 4.5873341,0 8.3124691,-3.72513 8.3124691,-8.31246 0,-4.58733 -3.725135,-8.31247 -8.3124691,-8.31247 z m 0,0.59375 c 4.2664491,0 7.7187221,3.45227 7.7187221,7.71872 0,2.3888 -1.082972,4.5217 -2.784353,5.93689 h -0.776975 l 0.05682,-8.60644 -0.593749,-0.004 -0.05914,8.90622 a 0.29690365,0.29690365 0 0 0 0.298034,0.29803 h 0.256285 c -1.191009,0.75153 -2.6016517,1.1875 -4.1156461,1.1875 -4.2664475,0 -7.71814117,-3.45169 -7.71814117,-7.71814 0,-4.26645 3.45169367,-7.71872 7.71814117,-7.71872 z m 0,5.93747 a 1.7812436,1.7812436 0 0 0 -1.7812418,1.78125 1.7812436,1.7812436 0 0 0 1.7812418,1.78124 1.7812436,1.7812436 0 0 0 1.7812431,-1.78124 1.7812436,1.7812436 0 0 0 -1.7812431,-1.78125 z m 2.9698981,4.15682 c -0.741963,0 -1.430555,0.39592 -1.8015377,1.03848 -0.3709817,0.64256 -0.3709817,1.43498 0,2.07753 0.3709827,0.64256 1.0595747,1.03906 1.8015377,1.03906 v -0.59375 c -0.53079,0 -1.021252,-0.28134 -1.286646,-0.74102 -0.2653957,-0.45968 -0.2653957,-1.02585 0,-1.48553 0.265394,-0.45968 0.755856,-0.74103 1.286646,-0.74103 z m -3.2679308,0.59374 v 3.56133 h 0.5937467 v -3.56133 z"
       style="opacity:1;fill:url(#radialGradient936);fill-opacity:1;stroke:none;stroke-width:0.43785021;stroke-linejoin:bevel;stroke-miterlimit:4;stroke-dasharray:none;stroke-opacity:1" />
  </g>
</svg>
