<?xml version="1.0" encoding="UTF-8" standalone="no"?>
<!-- Created with Inkscape (http://www.inkscape.org/) -->

<svg
   xmlns:dc="http://purl.org/dc/elements/1.1/"
   xmlns:cc="http://creativecommons.org/ns#"
   xmlns:rdf="http://www.w3.org/1999/02/22-rdf-syntax-ns#"
   xmlns:svg="http://www.w3.org/2000/svg"
   xmlns="http://www.w3.org/2000/svg"
   xmlns:sodipodi="http://sodipodi.sourceforge.net/DTD/sodipodi-0.dtd"
   xmlns:inkscape="http://www.inkscape.org/namespaces/inkscape"
   width="64"
   height="64"
   viewBox="0 0 16.933333 16.933334"
   version="1.1"
   id="svg8"
   sodipodi:docname="docs.svg"
   inkscape:version="0.92.2 2405546, 2018-03-11"
   inkscape:export-filename="/home/lixcode/Изображения/docs.png"
   inkscape:export-xdpi="1536"
   inkscape:export-ydpi="1536">
  <defs
     id="defs2" />
  <sodipodi:namedview
     id="base"
     pagecolor="#ffffff"
     bordercolor="#666666"
     borderopacity="1.0"
     inkscape:pageopacity="0.0"
     inkscape:pageshadow="2"
     inkscape:zoom="5.6"
     inkscape:cx="8.072596"
     inkscape:cy="29.602816"
     inkscape:document-units="px"
     inkscape:current-layer="layer1"
     showgrid="false"
     units="px"
     showguides="false"
     inkscape:guide-bbox="true"
     inkscape:object-paths="false"
     inkscape:snap-intersection-paths="true"
     inkscape:window-width="1920"
     inkscape:window-height="1052"
     inkscape:window-x="0"
     inkscape:window-y="28"
     inkscape:window-maximized="1">
    <sodipodi:guide
       position="-5.1115296,0.52916667"
       orientation="0,1"
       id="guide819"
       inkscape:locked="false"
       inkscape:label=""
       inkscape:color="rgb(0,0,255)" />
    <sodipodi:guide
       position="2.6458334,20.011807"
       orientation="1,0"
       id="guide823"
       inkscape:locked="false"
       inkscape:label=""
       inkscape:color="rgb(0,0,255)" />
    <sodipodi:guide
       position="13.229167,5.8799299"
       orientation="1,0"
       id="guide852"
       inkscape:locked="false"
       inkscape:label=""
       inkscape:color="rgb(0,0,255)" />
    <sodipodi:guide
       position="19.205915,13.25279"
       orientation="0,1"
       id="guide886"
       inkscape:locked="false"
       inkscape:label=""
       inkscape:color="rgb(0,0,255)" />
    <sodipodi:guide
       position="12.449591,2.6458334"
       orientation="0,1"
       id="guide888"
       inkscape:locked="false"
       inkscape:label=""
       inkscape:color="rgb(0,0,255)" />
    <sodipodi:guide
       position="8.4666667,8.7406998"
       orientation="1,0"
       id="guide890"
       inkscape:locked="false"
       inkscape:label=""
       inkscape:color="rgb(0,0,255)" />
    <sodipodi:guide
       position="9.5250001,8.0792414"
       orientation="1,0"
       id="guide892"
       inkscape:locked="false"
       inkscape:label=""
       inkscape:color="rgb(0,0,255)" />
    <sodipodi:guide
       position="-3.8978794,9.5250001"
       orientation="0,1"
       id="guide894"
       inkscape:locked="false"
       inkscape:label=""
       inkscape:color="rgb(0,0,255)" />
    <sodipodi:guide
       position="16.286124,6.3500001"
       orientation="0,1"
       id="guide917"
       inkscape:locked="false"
       inkscape:label=""
       inkscape:color="rgb(0,0,255)" />
    <sodipodi:guide
       position="7.4083332,13.229164"
       orientation="1,0"
       id="guide938"
       inkscape:locked="false" />
  </sodipodi:namedview>
  <metadata
     id="metadata5">
    <rdf:RDF>
      <cc:Work
         rdf:about="">
        <dc:format>image/svg+xml</dc:format>
        <dc:type
           rdf:resource="http://purl.org/dc/dcmitype/StillImage" />
        <dc:title />
      </cc:Work>
    </rdf:RDF>
  </metadata>
  <g
     inkscape:label="Layer 1"
     inkscape:groupmode="layer"
     id="layer1"
     transform="translate(0,-280.06665)">
    <circle
       style="opacity:1;fill:#723aff;fill-opacity:1;stroke:none;stroke-width:0.52900004;stroke-linejoin:bevel;stroke-miterlimit:4;stroke-dasharray:none;stroke-opacity:1"
       id="path825"
       cx="8.4666672"
       cy="288.53333"
       r="7.9375" />
    <path
       inkscape:connector-curvature="0"
       style="opacity:1;fill:#000000;fill-opacity:0.09803922;stroke:none;stroke-width:0.06349975;stroke-miterlimit:4;stroke-dasharray:none;stroke-opacity:1"
       d="m 7.2649394,280.64174 a 7.9374958,7.9374406 0 0 0 -6.6883942,6.68835 z m 2.8924726,0.1076 -9.4734629,9.47341 a 7.9374958,7.9374406 0 0 0 0.8339955,2.16598 L 12.324162,281.58259 a 7.9374958,7.9374406 0 0 0 -2.16675,-0.83325 z m 3.871017,2.12898 -11.2182851,11.2182 a 7.9374958,7.9374406 0 0 0 1.7042671,1.29573 l 10.806218,-10.80614 a 7.9374958,7.9374406 0 0 0 -1.2922,-1.70779 z m 2.126195,3.87377 -9.4734622,9.47341 a 7.9374958,7.9374406 0 0 0 1.7381245,0.1994 7.9374958,7.9374406 0 0 0 1.154348,-0.0918 l 6.6883937,-6.68835 a 7.9374958,7.9374406 0 0 0 0.09476,-1.15725 7.9374958,7.9374406 0 0 0 -0.202158,-1.73533 z"
       id="path7656" />
    <circle
       style="opacity:1;fill:none;fill-opacity:1;stroke:#000000;stroke-width:0.5291667;stroke-linejoin:round;stroke-miterlimit:4;stroke-dasharray:none;stroke-opacity:1"
       id="path864"
       cx="8.4666672"
       cy="288.53333"
       r="7.1437502" />
    <circle
       r="1.5875"
       cy="286.56635"
       cx="6.0420461"
       id="circle850"
       style="opacity:1;fill:#fdfeff;fill-opacity:1;stroke:none;stroke-width:0.39022595;stroke-linejoin:bevel;stroke-miterlimit:4;stroke-dasharray:none;stroke-opacity:1" />
    <g
       id="g950"
       transform="translate(-1.3229172,-0.52916325)">
      <path
         id="path896"
         d="m 9.5250006,283.77081 a 3.7041671,3.7041671 0 0 1 3.7041674,3.70417"
         style="opacity:1;fill:none;fill-opacity:1;stroke:#fcfcfc;stroke-width:1.05833334;stroke-linecap:square;stroke-linejoin:miter;stroke-miterlimit:4;stroke-dasharray:none;stroke-dashoffset:0;stroke-opacity:1"
         inkscape:connector-curvature="0" />
      <path
         id="path919"
         d="M 13.229168,290.64993 A 3.7041671,3.7041671 0 0 1 9.5250007,294.3541"
         style="opacity:1;fill:none;fill-opacity:1;stroke:#fcfcfc;stroke-width:1.05833334;stroke-linecap:square;stroke-linejoin:miter;stroke-miterlimit:4;stroke-dasharray:none;stroke-dashoffset:0;stroke-opacity:1"
         inkscape:connector-curvature="0" />
      <path
         inkscape:connector-curvature="0"
         id="path921"
         d="m 7.4083334,290.12082 v 4.23333"
         style="opacity:1;fill:none;fill-opacity:1;stroke:#fcfcfc;stroke-width:1.0583334;stroke-linecap:square;stroke-linejoin:miter;stroke-miterlimit:4;stroke-dasharray:none;stroke-dashoffset:0;stroke-opacity:1"
         sodipodi:nodetypes="cc" />
      <path
         inkscape:connector-curvature="0"
         id="path923"
         d="m 13.229167,287.47498 10e-7,3.175"
         style="opacity:1;fill:none;fill-opacity:1;stroke:#fcfcfc;stroke-width:1.05833334;stroke-linecap:butt;stroke-linejoin:miter;stroke-miterlimit:4;stroke-dasharray:none;stroke-dashoffset:0;stroke-opacity:1" />
      <path
         inkscape:connector-curvature="0"
         id="path940"
         d="M 7.4083333,283.77082 H 9.5250002"
         style="opacity:1;fill:none;fill-opacity:1;stroke:#fcfcfc;stroke-width:1.05833334;stroke-linecap:butt;stroke-linejoin:miter;stroke-miterlimit:4;stroke-dasharray:none;stroke-dashoffset:0;stroke-opacity:1" />
      <path
         inkscape:connector-curvature="0"
         id="path942"
         d="M 7.4083333,294.35415 H 9.5250002"
         style="opacity:1;fill:none;fill-opacity:1;stroke:#fcfcfc;stroke-width:1.05833334;stroke-linecap:butt;stroke-linejoin:miter;stroke-miterlimit:4;stroke-dasharray:none;stroke-dashoffset:0;stroke-opacity:1" />
    </g>
  </g>
</svg>
