[
  {
    "name": "Mojito",
    "cdb_id": "11000",
    "alternate_name": null,
    "tags": "IBA,ContemporaryClassic,Alcoholic,USA",
    "category": "Cocktail",
    "instructions": "Muddle mint leaves with sugar and lime juice. Add a splash of soda water and fill the glass with cracked ice. Pour the rum and top with soda water. Garnish and serve with straw.",
    "image": "https://www.thecocktaildb.com/images/media/drink/rxtqps1478251029.jpg",
    "ingredients": [
      "Light rum",
      "Lime",
      "Sugar",
      "Mint",
      "Soda water"
    ],
    "measures": "2-3 oz, Juice of 1, 2 tsp, 2-4"
  },
  {
    "name": "Old Fashioned",
    "cdb_id": "11001",
    "alternate_name": null,
    "tags": "IBA,Classic,Alcoholic,Expensive",
    "category": "Cocktail",
    "instructions": "Place sugar cube in old fashioned glass and saturate with bitters, add a dash of plain water. Muddle until dissolved.\r\nFill the glass with ice cubes and add whiskey.\r\n\r\nGarnish with orange twist, and a cocktail cherry.",
    "image": "https://www.thecocktaildb.com/images/media/drink/vrwquq1478252802.jpg",
    "ingredients": [
      "Bourbon",
      "Angostura bitters",
      "Sugar",
      "Water"
    ],
    "measures": "4.5 cL, 2 dashes, 1 cube, dash"
  },
  {
    "name": "Long Island Tea",
    "cdb_id": "11002",
    "alternate_name": null,
    "tags": "Strong,Asia,StrongFlavor,Brunch,Vegetarian",
    "category": "Ordinary Drink",
    "instructions": "Combine all ingredients (except cola) and pour over ice in a highball glass. Add the splash of cola for color. Decorate with a slice of lemon and serve.",
    "image": "https://www.thecocktaildb.com/images/media/drink/ywxwqs1439906072.jpg",
    "ingredients": [
      "Vodka",
      "Light rum",
      "Gin",
      "Tequila",
      "Lemon",
      "Coca-Cola"
    ],
    "measures": "1/2 oz, 1/2 oz, 1/2 oz, 1/2 oz, Juice of 1/2, 1 splash"
  },
  {
    "name": "Negroni",
    "cdb_id": "11003",
    "alternate_name": null,
    "tags": "IBA,Classic",
    "category": "Ordinary Drink",
    "instructions": "Stir into glass over ice, garnish and serve.",
    "image": "https://www.thecocktaildb.com/images/media/drink/qgdu971561574065.jpg",
    "ingredients": [
      "Gin",
      "Campari",
      "Sweet Vermouth"
    ],
    "measures": "1 oz, 1 oz, 1 oz"
  },
  {
    "name": "Whiskey Sour",
    "cdb_id": "11004",
    "alternate_name": null,
    "tags": "IBA,Classic,Alcoholic",
    "category": "Ordinary Drink",
    "instructions": "Shake with ice. Strain into chilled glass, garnish and serve. If served 'On the rocks', strain ingredients into old-fashioned glass filled with ice.",
    "image": "https://www.thecocktaildb.com/images/media/drink/zxd8v41576797287.jpg",
    "ingredients": [
      "Blended whiskey",
      "Lemon",
      "Powdered sugar",
      "Cherry",
      "Lemon"
    ],
    "measures": "2 oz, Juice of 1/2, 1/2 tsp, 1, 1/2 slice"
  },
  {
    "name": "Dry Martini",
    "cdb_id": "11005",
    "alternate_name": null,
    "tags": "IBA,Classic",
    "category": "Cocktail",
    "instructions": "Straight: Pour all ingredients into mixing glass with ice cubes. Stir well. Strain in chilled martini cocktail glass. Squeeze oil from lemon peel onto the drink, or garnish with olive.",
    "image": "https://www.thecocktaildb.com/images/media/drink/9uqt9p1576519019.jpg",
    "ingredients": [
      "Gin",
      "Dry Vermouth",
      "Olive"
    ],
    "measures": "1 2/3 oz, 1/3 oz, 1"
  },
  {
    "name": "Daiquiri",
    "cdb_id": "11006",
    "alternate_name": null,
    "tags": "IBA,Classic,Beach",
    "category": "Ordinary Drink",
    "instructions": "Pour all ingredients into shaker with ice cubes. Shake well. Strain in chilled cocktail glass.",
    "image": "https://www.thecocktaildb.com/images/media/drink/usuuur1439906797.jpg",
    "ingredients": [
      "Light rum",
      "Lime",
      "Powdered sugar"
    ],
    "measures": "1 1/2 oz, Juice of 1/2, 1 tsp"
  },
  {
    "name": "Margarita",
    "cdb_id": "11007",
    "alternate_name": null,
    "tags": "IBA,ContemporaryClassic",
    "category": "Ordinary Drink",
    "instructions": "Rub the rim of the glass with the lime slice to make the salt stick to it. Take care to moisten only the outer rim and sprinkle the salt on it. The salt should present to the lips of the imbiber and never mix into the cocktail. Shake the other ingredients with ice, then carefully pour into the glass.",
    "image": "https://www.thecocktaildb.com/images/media/drink/wpxpvu1439905379.jpg",
    "ingredients": [
      "Tequila",
      "Triple sec",
      "Lime juice",
      "Salt"
    ],
    "measures": "1 1/2 oz, 1/2 oz, 1 oz"
  },
  {
    "name": "Manhattan",
    "cdb_id": "11008",
    "alternate_name": null,
    "tags": "IBA,Classic",
    "category": "Cocktail",
    "instructions": "Stirred over ice, strained into a chilled glass, garnished, and served up.",
    "image": "https://www.thecocktaildb.com/images/media/drink/ec2jtz1504350429.jpg",
    "ingredients": [
      "Sweet Vermouth",
      "Bourbon",
      "Angostura bitters",
      "Ice",
      "Maraschino cherry",
      "Orange peel"
    ],
    "measures": "3/4 oz, 2 1/2 oz Blended, dash, 2 or 3, 1, 1 twist of"
  },
  {
    "name": "Moscow Mule",
    "cdb_id": "11009",
    "alternate_name": null,
    "tags": "IBA,ContemporaryClassic",
    "category": "Punch / Party Drink",
    "instructions": "Combine vodka and ginger beer in a highball glass filled with ice. Add lime juice. Stir gently. Garnish.",
    "image": "https://www.thecocktaildb.com/images/media/drink/3pylqc1504370988.jpg",
    "ingredients": [
      "Vodka",
      "Lime juice",
      "Ginger ale"
    ],
    "measures": "2 oz, 2 oz, 8 oz"
  },
  {
    "name": "After Dinner Cocktail",
    "cdb_id": "11010",
    "alternate_name": null,
    "tags": "DinnerParty",
    "category": "Ordinary Drink",
    "instructions": "Shake all ingredients (except lime wedge) with ice and strain into a cocktail glass. Add the wedge of lime and serve.",
    "image": "https://www.thecocktaildb.com/images/media/drink/vtytxq1483387578.jpg",
    "ingredients": [
      "Apricot brandy",
      "Triple sec",
      "Lime",
      "Lime"
    ],
    "measures": "1 oz, 1 oz, Juice of 1, 1"
  },
  {
    "name": "After Supper Cocktail",
    "cdb_id": "11011",
    "alternate_name": null,
    "tags": null,
    "category": "Ordinary Drink",
    "instructions": "Shake all ingredients with ice, strain into a cocktail glass, and serve.",
    "image": "https://www.thecocktaildb.com/images/media/drink/quyxwu1483387610.jpg",
    "ingredients": [
      "Triple sec",
      "Apricot brandy",
      "Lemon juice"
    ],
    "measures": "1 oz, 1 oz, 1/2 tsp"
  },
  {
    "name": "Alabama Slammer",
    "cdb_id": "11012",
    "alternate_name": null,
    "tags": null,
    "category": "Ordinary Drink",
    "instructions": "Pour all ingredients (except for lemon juice) over ice in a highball glass. Stir, add a dash of lemon juice, and serve.",
    "image": "https://www.thecocktaildb.com/images/media/drink/qtwxwr1483387647.jpg",
    "ingredients": [
      "Southern Comfort",
      "Amaretto",
      "Sloe gin",
      "Lemon juice"
    ],
    "measures": "1 oz, 1 oz, 1/2 oz, 1 dash"
  },
  {
    "name": "Alaska Cocktail",
    "cdb_id": "11013",
    "alternate_name": null,
    "tags": null,
    "category": "Ordinary Drink",
    "instructions": "Stir all ingredients with ice, strain contents into a cocktail glass. Drop in a twist of lemon and serve.",
    "image": "https://www.thecocktaildb.com/images/media/drink/wsyryt1483387720.jpg",
    "ingredients": [
      "Orange bitters",
      "Gin",
      "Yellow Chartreuse",
      "Lemon peel"
    ],
    "measures": "2 dashes, 1 1/2 oz, 3/4 oz, Twist of"
  },
  {
    "name": "Alexander",
    "cdb_id": "11014",
    "alternate_name": null,
    "tags": "IBA,Classic,Dairy",
    "category": "Ordinary Drink",
    "instructions": "Shake all ingredients with ice and strain contents into a cocktail glass. Sprinkle nutmeg on top and serve.",
    "image": "https://www.thecocktaildb.com/images/media/drink/urystu1478253039.jpg",
    "ingredients": [
      "Gin",
      "Creme de Cacao",
      "Light cream",
      "Nutmeg"
    ],
    "measures": "1/2 oz, 1/2 oz white, 2 oz"
  },
  {
    "name": "Brandy Alexander",
    "cdb_id": "11016",
    "alternate_name": null,
    "tags": null,
    "category": "Ordinary Drink",
    "instructions": "Shake all ingredients (except nutmeg) with ice and strain contents into a cocktail glass. Sprinkle nutmeg on top and serve.",
    "image": "https://www.thecocktaildb.com/images/media/drink/tvqxvr1483387746.jpg",
    "ingredients": [
      "Brandy",
      "Creme de Cacao",
      "Light cream",
      "Nutmeg"
    ],
    "measures": "1 oz, 1 oz white, 1 oz"
  },
  {
    "name": "Alfie Cocktail",
    "cdb_id": "11019",
    "alternate_name": null,
    "tags": "Alcoholic",
    "category": "Ordinary Drink",
    "instructions": "Combine and shake all ingredients with ice, strain into a cocktail glass, and serve.",
    "image": "https://www.thecocktaildb.com/images/media/drink/ypxsqy1483387829.jpg",
    "ingredients": [
      "Lemon vodka",
      "Triple sec",
      "Pineapple juice"
    ],
    "measures": "1 1/2 oz, 1 dash, 1 tblsp"
  },
  {
    "name": "Algonquin",
    "cdb_id": "11020",
    "alternate_name": null,
    "tags": null,
    "category": "Ordinary Drink",
    "instructions": "Combine and shake all ingredients with ice, strain contents into a cocktail glass, and serve.",
    "image": "https://www.thecocktaildb.com/images/media/drink/uwryxx1483387873.jpg",
    "ingredients": [
      "Blended whiskey",
      "Dry Vermouth",
      "Pineapple juice"
    ],
    "measures": "1 1/2 oz, 1 oz, 1 oz"
  },
  {
    "name": "Allegheny",
    "cdb_id": "11021",
    "alternate_name": null,
    "tags": null,
    "category": "Ordinary Drink",
    "instructions": "Shake all ingredients (except lemon peel) with ice and strain into a cocktail glass. Top with the twist of lemon peel and serve.",
    "image": "https://www.thecocktaildb.com/images/media/drink/uwvyts1483387934.jpg",
    "ingredients": [
      "Dry Vermouth",
      "Bourbon",
      "Blackberry brandy",
      "Lemon juice",
      "Lemon peel"
    ],
    "measures": "1 oz, 1 oz, 1 1/2 tsp, 1 1/2 tsp, 1 twist of"
  },
  {
    "name": "Allies Cocktail",
    "cdb_id": "11022",
    "alternate_name": null,
    "tags": null,
    "category": "Ordinary Drink",
    "instructions": "Stir all ingredients with ice, strain contents into a cocktail glass, and serve.",
    "image": "https://www.thecocktaildb.com/images/media/drink/qvprvp1483388104.jpg",
    "ingredients": [
      "Dry Vermouth",
      "Gin",
      "Kummel"
    ],
    "measures": "1 oz, 1 oz, 1/2 tsp"
  },
  {
    "name": "Almeria",
    "cdb_id": "11023",
    "alternate_name": null,
    "tags": null,
    "category": "Ordinary Drink",
    "instructions": "In a shaker half-filled with ice cubes, combine all of the ingredients. Shake well. Strain into a cocktail glass.",
    "image": "https://www.thecocktaildb.com/images/media/drink/rwsyyu1483388181.jpg",
    "ingredients": [
      "Dark rum",
      "Kahlua",
      "Egg white"
    ],
    "measures": "2 oz, 1 oz, 1"
  },
  {
    "name": "Almond Joy",
    "cdb_id": "11024",
    "alternate_name": null,
    "tags": null,
    "category": "Ordinary Drink",
    "instructions": "Shake all ingredients with ice, strain into a cocktail glass, and serve.",
    "image": "https://www.thecocktaildb.com/images/media/drink/xutuqs1483388296.jpg",
    "ingredients": [
      "Amaretto",
      "Creme de Cacao",
      "Light cream"
    ],
    "measures": "1/2 oz, 1/2 oz white, 2 oz"
  },
  {
    "name": "Amaretto And Cream",
    "cdb_id": "11025",
    "alternate_name": null,
    "tags": null,
    "category": "Ordinary Drink",
    "instructions": "Shake well with cracked ice, strain contents into a cocktail glass, and serve.",
    "image": "https://www.thecocktaildb.com/images/media/drink/dj8n0r1504375018.jpg",
    "ingredients": [
      "Amaretto",
      "Light cream"
    ],
    "measures": "1 1/2 oz, 1 1/2 oz"
  },
  {
    "name": "Amaretto Mist",
    "cdb_id": "11026",
    "alternate_name": null,
    "tags": null,
    "category": "Ordinary Drink",
    "instructions": "Pour amaretto in an old-fashioned glass over crushed ice. Add the wedge of lime and serve. (A wedge of lemon may be substituted for lime, if preferred.)",
    "image": "https://www.thecocktaildb.com/images/media/drink/utpxxq1483388370.jpg",
    "ingredients": [
      "Amaretto",
      "Lime"
    ],
    "measures": "1 1/2 oz, 1"
  },
  {
    "name": "Amaretto Rose",
    "cdb_id": "11027",
    "alternate_name": null,
    "tags": null,
    "category": "Ordinary Drink",
    "instructions": "Pour amaretto and lime juice over ice in a collins glass. Fill with club soda and serve.",
    "image": "https://www.thecocktaildb.com/images/media/drink/3jm41q1493069578.jpg",
    "ingredients": [
      "Amaretto",
      "Lime juice",
      "Club soda"
    ],
    "measures": "1 1/2 oz, 1/2 oz"
  },
  {
    "name": "Amaretto Stinger",
    "cdb_id": "11028",
    "alternate_name": null,
    "tags": null,
    "category": "Ordinary Drink",
    "instructions": "Shake ingredients well with cracked ice, strain into a cocktail glass, and serve.",
    "image": "https://www.thecocktaildb.com/images/media/drink/vvop4w1493069934.jpg",
    "ingredients": [
      "Amaretto",
      "White Creme de Menthe"
    ],
    "measures": "1 1/2 oz, 3/4 oz"
  },
  {
    "name": "Amaretto Tea",
    "cdb_id": "11029",
    "alternate_name": null,
    "tags": null,
    "category": "Ordinary Drink",
    "instructions": "Pour hot tea into a pousse-cafe glass, using a spoon in glass to prevent cracking. Add amaretto, but do not stir. Top with chilled whipped cream and serve.",
    "image": "https://www.thecocktaildb.com/images/media/drink/b7qzo21493070167.jpg",
    "ingredients": [
      "Tea",
      "Amaretto",
      "Whipped cream"
    ],
    "measures": "6 oz hot, 2 oz, Chilled"
  },
  {
    "name": "Angel Face",
    "cdb_id": "11034",
    "alternate_name": null,
    "tags": "IBA,Classic",
    "category": "Ordinary Drink",
    "instructions": "Shake all ingredients with ice and strain contents into a cocktail glass.",
    "image": "https://www.thecocktaildb.com/images/media/drink/vqpptp1478253178.jpg",
    "ingredients": [
      "Apricot brandy",
      "Apple brandy",
      "Gin"
    ],
    "measures": "1/2 oz, 1/2 oz, 1 oz"
  },
  {
    "name": "Applecar",
    "cdb_id": "11046",
    "alternate_name": null,
    "tags": null,
    "category": "Ordinary Drink",
    "instructions": "Shake all ingredients with ice, strain into a cocktail glass, and serve.",
    "image": "https://www.thecocktaildb.com/images/media/drink/sbffau1504389764.jpg",
    "ingredients": [
      "Applejack",
      "Triple sec",
      "Lemon juice"
    ],
    "measures": "1 oz, 1 oz, 1 oz"
  },
  {
    "name": "Apricot Lady",
    "cdb_id": "11050",
    "alternate_name": null,
    "tags": "Cold",
    "category": "Ordinary Drink",
    "instructions": "In a shaker half-filled with ice cubes, combine the rum, apricot brandy, triple sec, lemon juice, and egg white. Shake well. Strain into an old-fashioned glass almost filled with ice cubes. Garnish with the orange slice.",
    "image": "https://www.thecocktaildb.com/images/media/drink/146f251504389814.jpg",
    "ingredients": [
      "Light rum",
      "Apricot brandy",
      "Triple sec",
      "Lemon juice",
      "Egg white",
      "Orange"
    ],
    "measures": "1 1/2 oz, 1 oz, 1 tsp, 1/2 oz, 1, 1"
  },
  {
    "name": "Archbishop",
    "cdb_id": "11052",
    "alternate_name": null,
    "tags": null,
    "category": "Ordinary Drink",
    "instructions": "In an old-fashioned glass almost filled with ice cubes, combine all of the ingredients. Stir well.",
    "image": "https://www.thecocktaildb.com/images/media/drink/xpqwrt1441207307.jpg",
    "ingredients": [
      "Gin",
      "Wine",
      "Benedictine",
      "Lime"
    ],
    "measures": "2 oz, 1 oz Green Ginger, 1 tsp, 1"
  },
  {
    "name": "Arise My Love",
    "cdb_id": "11053",
    "alternate_name": null,
    "tags": null,
    "category": "Ordinary Drink",
    "instructions": "Put creme de menthe into a champagne flute. Fill with chilled champagne and serve.",
    "image": "https://www.thecocktaildb.com/images/media/drink/wyrrwv1441207432.jpg",
    "ingredients": [
      "Champagne",
      "Green Creme de Menthe"
    ],
    "measures": "Chilled, 1 tsp"
  },
  {
    "name": "Arthur Tompkins",
    "cdb_id": "11054",
    "alternate_name": null,
    "tags": null,
    "category": "Ordinary Drink",
    "instructions": "In a shaker half-filled with ice cubes, combine the gin, Grand Marnier, and lemon juice. Shake well. Strain into a sour glass and garnish with the lemon twist.",
    "image": "https://www.thecocktaildb.com/images/media/drink/7onfhz1493067921.jpg",
    "ingredients": [
      "Gin",
      "Grand Marnier",
      "Lemon juice",
      "Lemon peel"
    ],
    "measures": "2 oz, 1/2 oz, 2 tsp, 1 twist of"
  },
  {
    "name": "Artillery",
    "cdb_id": "11055",
    "alternate_name": null,
    "tags": null,
    "category": "Ordinary Drink",
    "instructions": "Stir all ingredients with ice, strain into a cocktail glass, and serve.",
    "image": "https://www.thecocktaildb.com/images/media/drink/g1vnbe1493067747.jpg",
    "ingredients": [
      "Sweet Vermouth",
      "Gin",
      "Bitters"
    ],
    "measures": "1 1/2 tsp, 1 1/2 oz, 2 dashes"
  },
  {
    "name": "Balmoral",
    "cdb_id": "11060",
    "alternate_name": null,
    "tags": null,
    "category": "Ordinary Drink",
    "instructions": "In a mixing glass half-filled with ice cubes, combine all of the ingredients. Stir well. Strain into a cocktail glass.",
    "image": "https://www.thecocktaildb.com/images/media/drink/vysuyq1441206297.jpg",
    "ingredients": [
      "Scotch",
      "Sweet Vermouth",
      "Dry Vermouth",
      "Bitters"
    ],
    "measures": "1 1/2 oz, 1/2 oz, 1/2 oz, 2 dashes"
  },
  {
    "name": "Banana Daiquiri",
    "cdb_id": "11064",
    "alternate_name": null,
    "tags": "Fruity",
    "category": "Ordinary Drink",
    "instructions": "Pour all ingredients into shaker with ice cubes. Shake well. Strain in chilled cocktail glass.",
    "image": "https://www.thecocktaildb.com/images/media/drink/k1xatq1504389300.jpg",
    "ingredients": [
      "Light rum",
      "Triple sec",
      "Banana",
      "Lime juice",
      "Sugar",
      "Cherry"
    ],
    "measures": "1 1/2 oz, 1 tblsp, 1, 1 1/2 oz, 1 tsp, 1"
  },
  {
    "name": "Bermuda Highball",
    "cdb_id": "11084",
    "alternate_name": null,
    "tags": null,
    "category": "Ordinary Drink",
    "instructions": "Pour brandy, gin, and dry vermouth into a highball glass over ice cubes. Fill with carbonated water and stir. Add the twist of lemon and serve. (Ginger ale may be substituted for carbonated water, if preferred.)",
    "image": "https://www.thecocktaildb.com/images/media/drink/qrvtww1441206528.jpg",
    "ingredients": [
      "Brandy",
      "Gin",
      "Dry Vermouth",
      "Carbonated water",
      "Lemon peel"
    ],
    "measures": "3/4 oz, 3/4 oz, 3/4 oz"
  },
  {
    "name": "Black Russian",
    "cdb_id": "11102",
    "alternate_name": null,
    "tags": "IBA,ContemporaryClassic",
    "category": "Ordinary Drink",
    "instructions": "Pour the ingredients into an old fashioned glass filled with ice cubes. Stir gently.",
    "image": "https://www.thecocktaildb.com/images/media/drink/2k5gbb1504367689.jpg",
    "ingredients": [
      "Coffee liqueur",
      "Vodka"
    ],
    "measures": "3/4 oz, 1 1/2 oz"
  },
  {
    "name": "Blackthorn",
    "cdb_id": "11106",
    "alternate_name": null,
    "tags": null,
    "category": "Ordinary Drink",
    "instructions": "Stir sloe gin and vermouth with ice and strain into a cocktail glass. Add the twist of lemon peel and serve.",
    "image": "https://www.thecocktaildb.com/images/media/drink/xvswvy1441209430.jpg",
    "ingredients": [
      "Sweet Vermouth",
      "Sloe gin",
      "Lemon peel"
    ],
    "measures": "1 oz, 1 1/2 oz, 1 twist of"
  },
  {
    "name": "Bloody Maria",
    "cdb_id": "11112",
    "alternate_name": null,
    "tags": "Breakfast,Brunch,Hangover",
    "category": "Ordinary Drink",
    "instructions": "Shake all ingredients (except lemon slice) with cracked ice and strain into an old-fashioned glass over ice cubes. Add the slice of lemon and serve.",
    "image": "https://www.thecocktaildb.com/images/media/drink/yz0j6z1504389461.jpg",
    "ingredients": [
      "Tequila",
      "Tomato juice",
      "Lemon juice",
      "Tabasco sauce",
      "Celery salt",
      "Lemon"
    ],
    "measures": "1 oz, 2 oz, 1 dash, 1 dash, 1 dash, 1 slice"
  },
  {
    "name": "Bloody Mary",
    "cdb_id": "11113",
    "alternate_name": null,
    "tags": "IBA,ContemporaryClassic",
    "category": "Ordinary Drink",
    "instructions": "Stirring gently, pour all ingredients into highball glass. Garnish.",
    "image": "https://www.thecocktaildb.com/images/media/drink/uyquuu1439906954.jpg",
    "ingredients": [
      "Vodka",
      "Tomato juice",
      "Lemon juice",
      "Worcestershire sauce",
      "Tabasco sauce",
      "Lime"
    ],
    "measures": "1 1/2 oz, 3 oz, 1 dash, 1/2 tsp, 2-3 drops, 1 wedge"
  },
  {
    "name": "Blue Lagoon",
    "cdb_id": "11117",
    "alternate_name": null,
    "tags": null,
    "category": "Ordinary Drink",
    "instructions": "Pour vodka and curacao over ice in a highball glass. Fill with lemonade, top with the cherry, and serve.",
    "image": "https://www.thecocktaildb.com/images/media/drink/vak0e51504389504.jpg",
    "ingredients": [
      "Vodka",
      "Blue Curacao",
      "Lemonade",
      "Cherry"
    ],
    "measures": "1 oz, 1 oz"
  },
  {
    "name": "Blue Margarita",
    "cdb_id": "11118",
    "alternate_name": null,
    "tags": null,
    "category": "Ordinary Drink",
    "instructions": "Rub rim of cocktail glass with lime juice. Dip rim in coarse salt. Shake tequila, blue curacao, and lime juice with ice, strain into the salt-rimmed glass, and serve.",
    "image": "https://www.thecocktaildb.com/images/media/drink/qtvvyq1439905913.jpg",
    "ingredients": [
      "Tequila",
      "Blue Curacao",
      "Lime juice",
      "Salt"
    ],
    "measures": "1 1/2 oz, 1 oz, 1 oz, Coarse"
  },
  {
    "name": "Blue Mountain",
    "cdb_id": "11119",
    "alternate_name": null,
    "tags": null,
    "category": "Ordinary Drink",
    "instructions": "In a shaker half-filled with ice cubes, combine all of the ingredients. Shake well. Strain into an old-fashioned glass alomst filled with ice cubes.",
    "image": "https://www.thecocktaildb.com/images/media/drink/vsxssp1441209853.jpg",
    "ingredients": [
      "Añejo rum",
      "Tia maria",
      "Vodka",
      "Orange juice",
      "Lemon juice"
    ],
    "measures": "1 1/2 oz, 1/2 oz, 1/2 oz, 1 oz, 1 tsp"
  },
  {
    "name": "Bluebird",
    "cdb_id": "11120",
    "alternate_name": null,
    "tags": null,
    "category": "Ordinary Drink",
    "instructions": "In a mixing glass half-filled with crushed ice, combine the gin, triple sec, Curacao, and bitters. Stir well. Strain into a cocktail glass and garnish with the lemon twist and the cherry.",
    "image": "https://www.thecocktaildb.com/images/media/drink/vxypsq1441209971.jpg",
    "ingredients": [
      "Gin",
      "Triple sec",
      "Blue Curacao",
      "Bitters",
      "Maraschino cherry",
      "Lemon peel"
    ],
    "measures": "1 1/2 oz, 1/2 oz, 1/2 oz, 2 dashes, 1, 1 twist of"
  },
  {
    "name": "Bobby Burns Cocktail",
    "cdb_id": "11121",
    "alternate_name": null,
    "tags": null,
    "category": "Ordinary Drink",
    "instructions": "Stir all ingredients (except lemon peel) with ice and strain into a cocktail glass. Add the twist of lemon peel and serve.",
    "image": "https://www.thecocktaildb.com/images/media/drink/km6se51484411608.jpg",
    "ingredients": [
      "Sweet Vermouth",
      "Scotch",
      "Benedictine",
      "Lemon peel"
    ],
    "measures": "1 1/2 oz, 1 1/2 oz, 1 1/4 tsp, 1 twist of"
  },
  {
    "name": "Boomerang",
    "cdb_id": "11124",
    "alternate_name": null,
    "tags": null,
    "category": "Ordinary Drink",
    "instructions": "In a mixing glass half-filled with ice cubes, combine the gin, vermouth, bitters, and maraschino liqueur. Stir well. Strain into a cocktail glass and garnish with the cherry.",
    "image": "https://www.thecocktaildb.com/images/media/drink/3m6yz81504389551.jpg",
    "ingredients": [
      "Gin",
      "Dry Vermouth",
      "Bitters",
      "Maraschino liqueur",
      "Maraschino cherry"
    ],
    "measures": "2 oz, 1/2 oz, 2 dashes, 1/2 tsp, 1"
  },
  {
    "name": "Boston Sidecar",
    "cdb_id": "11128",
    "alternate_name": null,
    "tags": null,
    "category": "Ordinary Drink",
    "instructions": "Shake all ingredients with ice, strain into a cocktail glass, and serve.",
    "image": "https://www.thecocktaildb.com/images/media/drink/qzs5d11504365962.jpg",
    "ingredients": [
      "Light rum",
      "Brandy",
      "Triple sec",
      "Lime"
    ],
    "measures": "3/4 oz, 3/4 oz, 3/4 oz, Juice of 1/2"
  },
  {
    "name": "Boston Sour",
    "cdb_id": "11129",
    "alternate_name": null,
    "tags": null,
    "category": "Ordinary Drink",
    "instructions": "Shake juice of lemon, powdered sugar, blended whiskey, and egg white with cracked ice and strain into a whiskey sour glass. Add the slice of lemon, top with the cherry, and serve.",
    "image": "https://www.thecocktaildb.com/images/media/drink/kxlgbi1504366100.jpg",
    "ingredients": [
      "Blended whiskey",
      "Lemon",
      "Powdered sugar",
      "Egg white",
      "Lemon",
      "Cherry"
    ],
    "measures": "2 oz, Juice of 1/2, 1 tsp, 1, 1 slice, 1"
  },
  {
    "name": "Classic Old-Fashioned",
    "cdb_id": "11145",
    "alternate_name": null,
    "tags": null,
    "category": "Ordinary Drink",
    "instructions": "In an old-fashioned glass, muddle the bitters and water into the sugar cube, using the back of a teaspoon. Almost fill the glass with ice cubes and add the bourbon. Garnish with the orange slice and the cherry. Serve with a swizzle stick.",
    "image": "https://www.thecocktaildb.com/images/media/drink/anhof61504366173.jpg",
    "ingredients": [
      "Bitters",
      "Water",
      "Sugar",
      "Bourbon",
      "Orange",
      "Maraschino cherry"
    ],
    "measures": "3 dashes, 1 tsp, 1, 3 oz, 1, 1"
  },
  {
    "name": "Bourbon Sling",
    "cdb_id": "11146",
    "alternate_name": null,
    "tags": null,
    "category": "Ordinary Drink",
    "instructions": "In a shaker half-filled with ice cubes, combine the sugar, water, lemon juice, and bourbon. Shake well. Strain well. Strain into a highball glass. Garnish with the lemon twist.",
    "image": "https://www.thecocktaildb.com/images/media/drink/3s36ql1504366260.jpg",
    "ingredients": [
      "Sugar",
      "Water",
      "Lemon juice",
      "Bourbon",
      "Lemon peel"
    ],
    "measures": "1 tsp superfine, 2 tsp, 1 oz, 2 oz, 1 twist of"
  },
  {
    "name": "Bourbon Sour",
    "cdb_id": "11147",
    "alternate_name": null,
    "tags": null,
    "category": "Ordinary Drink",
    "instructions": "In a shaker half-filled with ice cubes, combine the bourbon, lemon juice, and sugar. Shake well. Strain into a whiskey sour glass, garnish with the orange slice and cherry.",
    "image": "https://www.thecocktaildb.com/images/media/drink/dms3io1504366318.jpg",
    "ingredients": [
      "Bourbon",
      "Lemon juice",
      "Sugar",
      "Orange",
      "Maraschino cherry"
    ],
    "measures": "2 oz, 1 oz, 1/2 tsp superfine, 1, 1"
  },
  {
    "name": "Boxcar",
    "cdb_id": "11149",
    "alternate_name": null,
    "tags": null,
    "category": "Ordinary Drink",
    "instructions": "In a shaker half-filled with ice cubes, combine all of the ingredients. Shake well. Strain into a sour glass.",
    "image": "https://www.thecocktaildb.com/images/media/drink/pwgtpa1504366376.jpg",
    "ingredients": [
      "Gin",
      "Triple sec",
      "Lemon juice",
      "Grenadine",
      "Egg white"
    ],
    "measures": "1 1/2 oz, 1 oz, 1 tsp, 1/2 tsp, 1"
  },
  {
    "name": "Brandy Cobbler",
    "cdb_id": "11157",
    "alternate_name": null,
    "tags": null,
    "category": "Ordinary Drink",
    "instructions": "In an old-fashioned glass, dissolve the sugar in the club soda. Add crushed ice until the glass is almost full. Add the brandy. Stir well. Garnish with the cherry and the orange and lemon slices.",
    "image": "https://www.thecocktaildb.com/images/media/drink/vtvutr1439465836.jpg",
    "ingredients": [
      "Sugar",
      "Club soda",
      "Lemon",
      "Brandy",
      "Maraschino cherry",
      "Orange"
    ],
    "measures": "1 tsp superfine, 3 oz, 1, 2 oz, 1, 1"
  },
  {
    "name": "Brandy Flip",
    "cdb_id": "11164",
    "alternate_name": null,
    "tags": null,
    "category": "Ordinary Drink",
    "instructions": "In a shaker half-filled with ice cubes, combine the brandy, egg, sugar, and cream. Shake well. Strain into a sour glass and garnish with the nutmeg.",
    "image": "https://www.thecocktaildb.com/images/media/drink/6ty09d1504366461.jpg",
    "ingredients": [
      "Brandy",
      "Egg",
      "Sugar",
      "Light cream",
      "Nutmeg"
    ],
    "measures": "2 oz, 1 whole, 1 tsp superfine, 1/2 oz, 1/8 tsp grated"
  },
  {
    "name": "Brandy Sour",
    "cdb_id": "11170",
    "alternate_name": null,
    "tags": null,
    "category": "Ordinary Drink",
    "instructions": "Shake brandy, juice of lemon, and powdered sugar with ice and strain into a whiskey sour glass. Decorate with the lemon slice, top with the cherry, and serve.",
    "image": "https://www.thecocktaildb.com/images/media/drink/tu0mts1504366540.jpg",
    "ingredients": [
      "Brandy",
      "Lemon",
      "Powdered sugar",
      "Lemon",
      "Cherry"
    ],
    "measures": "2 oz, Juice of 1/2, 1/2 tsp, 1/2 slice, 1"
  },
  {
    "name": "Caipirinha",
    "cdb_id": "11202",
    "alternate_name": null,
    "tags": "ContemporaryClassic,IBA",
    "category": "Ordinary Drink",
    "instructions": "Place lime and sugar into old fashioned glass and muddle (mash the two ingredients together using a muddler or a wooden spoon). Fill the glass with ice and add the Cachaça.",
    "image": "https://www.thecocktaildb.com/images/media/drink/xyrppt1469090521.jpg",
    "ingredients": [
      "Sugar",
      "Lime",
      "Cachaca"
    ],
    "measures": "2 tsp, 1, 2 1/2 oz"
  },
  {
    "name": "California Lemonade",
    "cdb_id": "11205",
    "alternate_name": null,
    "tags": null,
    "category": "Ordinary Drink",
    "instructions": "Shake all ingredients (except carbonated water) with ice and strain into a collins glass over shaved ice. Fill with carbonated water and stir. Decorate with slices of orange and lemon. Add the cherry and serve with a straw.",
    "image": "https://www.thecocktaildb.com/images/media/drink/qvvxwy1472406424.jpg",
    "ingredients": [
      "Blended whiskey",
      "Lemon",
      "Lime",
      "Powdered sugar",
      "Grenadine",
      "Carbonated water"
    ],
    "measures": "2 oz, Juice of 1, Juice of 1, 1 tblsp, 1/4 tsp"
  },
  {
    "name": "Casa Blanca",
    "cdb_id": "11222",
    "alternate_name": null,
    "tags": null,
    "category": "Ordinary Drink",
    "instructions": "Shake all ingredients with ice, strain into a cocktail glass, and serve.",
    "image": "https://www.thecocktaildb.com/images/media/drink/usspxq1441553762.jpg",
    "ingredients": [
      "Light rum",
      "Triple sec",
      "Lime juice",
      "Maraschino liqueur"
    ],
    "measures": "2 oz, 1 1/2 tsp, 1 1/2 tsp, 1 1/2 tsp"
  },
  {
    "name": "Casino Royale",
    "cdb_id": "11224",
    "alternate_name": null,
    "tags": null,
    "category": "Ordinary Drink",
    "instructions": "In a shaker half-filled with ice cubes, combine all of the ingredients. Shake well. Strain into a sour glass.",
    "image": "https://www.thecocktaildb.com/images/media/drink/3qpv121504366699.jpg",
    "ingredients": [
      "Gin",
      "Lemon juice",
      "Maraschino liqueur",
      "Orange bitters",
      "Egg yolk"
    ],
    "measures": "2 oz, 1/2 oz, 1 tsp, 1 dash, 1"
  },
  {
    "name": "Champagne Cocktail",
    "cdb_id": "11227",
    "alternate_name": null,
    "tags": "IBA,ContemporaryClassic",
    "category": "Ordinary Drink",
    "instructions": "Add dash of Angostura bitter onto sugar cube and drop it into champagne flute. Add cognac followed by gently pouring chilled champagne. Garnish with orange slice and maraschino cherry.",
    "image": "https://www.thecocktaildb.com/images/media/drink/ehh5df1504366811.jpg",
    "ingredients": [
      "Champagne",
      "Sugar",
      "Bitters",
      "Lemon peel",
      "Cognac"
    ],
    "measures": "Chilled, 1 piece, 2 dashes, 1 twist of, 1 dash"
  },
  {
    "name": "Cherry Rum",
    "cdb_id": "11239",
    "alternate_name": null,
    "tags": null,
    "category": "Ordinary Drink",
    "instructions": "Shake all ingredients with ice, strain into a cocktail glass, and serve.",
    "image": "https://www.thecocktaildb.com/images/media/drink/twsuvr1441554424.jpg",
    "ingredients": [
      "Light rum",
      "Cherry brandy",
      "Light cream"
    ],
    "measures": "1 1/4 oz, 1 1/2 tsp, 1 tblsp"
  },
  {
    "name": "Chicago Fizz",
    "cdb_id": "11242",
    "alternate_name": null,
    "tags": null,
    "category": "Ordinary Drink",
    "instructions": "Shake all ingredients (except carbonated water) with ice and strain into a highball glass over two ice cubes. Fill with carbonated water, stir, and serve.",
    "image": "https://www.thecocktaildb.com/images/media/drink/qwvwqr1441207763.jpg",
    "ingredients": [
      "Light rum",
      "Port",
      "Lemon",
      "Powdered sugar",
      "Egg white",
      "Carbonated water"
    ],
    "measures": "1 oz, 1 oz, Juice of 1/2, 1 tsp, 1"
  },
  {
    "name": "Chocolate Black Russian",
    "cdb_id": "11243",
    "alternate_name": null,
    "tags": null,
    "category": "Ordinary Drink",
    "instructions": "Combine all ingredients in an electric blender and blend at a low speed for a short length of time. Pour into a chilled champagne flute and serve.",
    "image": "https://www.thecocktaildb.com/images/media/drink/yyvywx1472720879.jpg",
    "ingredients": [
      "Kahlua",
      "Vodka",
      "Chocolate ice-cream"
    ],
    "measures": "1 oz, 1/2 oz, 5 oz"
  },
  {
    "name": "City Slicker",
    "cdb_id": "11251",
    "alternate_name": null,
    "tags": null,
    "category": "Ordinary Drink",
    "instructions": "In a shaker half-filled with ice cubes, combine all of the ingredients. Shake well. Strain into a cocktail glass.",
    "image": "https://www.thecocktaildb.com/images/media/drink/dazdlg1504366949.jpg",
    "ingredients": [
      "Brandy",
      "Triple sec",
      "Lemon juice"
    ],
    "measures": "2 oz, 1/2 oz, 1 tblsp"
  },
  {
    "name": "Clove Cocktail",
    "cdb_id": "11255",
    "alternate_name": null,
    "tags": null,
    "category": "Ordinary Drink",
    "instructions": "Stir all ingredients with ice, strain into a cocktail glass, and serve.",
    "image": "https://www.thecocktaildb.com/images/media/drink/qxvtst1461867579.jpg",
    "ingredients": [
      "Sweet Vermouth",
      "Sloe gin",
      "Wine"
    ],
    "measures": "1 oz, 1/2 oz, 1/2 oz Muscatel"
  },
  {
    "name": "Cuba Libre",
    "cdb_id": "11288",
    "alternate_name": null,
    "tags": "IBA,ContemporaryClassic",
    "category": "Ordinary Drink",
    "instructions": "Build all ingredients in a Collins glass filled with ice. Garnish with lime wedge.",
    "image": "https://www.thecocktaildb.com/images/media/drink/uuxsrr1473201663.jpg",
    "ingredients": [
      "Light rum",
      "Lime",
      "Coca-Cola"
    ],
    "measures": "2 oz, Juice of 1/2"
  },
  {
    "name": "Dragonfly",
    "cdb_id": "11320",
    "alternate_name": null,
    "tags": null,
    "category": "Ordinary Drink",
    "instructions": "In a highball glass almost filled with ice cubes, combine the gin and ginger ale. Stir well. Garnish with the lime wedge.",
    "image": "https://www.thecocktaildb.com/images/media/drink/lnvbip1504389100.jpg",
    "ingredients": [
      "Gin",
      "Ginger ale",
      "Lime"
    ],
    "measures": "1 1/2 oz, 4 oz, 1"
  },
  {
    "name": "Dry Rob Roy",
    "cdb_id": "11324",
    "alternate_name": null,
    "tags": null,
    "category": "Ordinary Drink",
    "instructions": "In a mixing glass half-filled with ice cubes, combine the Scotch and vermouth. Stir well. Strain into a cocktail glass. Garnish with the lemon twist.",
    "image": "https://www.thecocktaildb.com/images/media/drink/typuyq1439456976.jpg",
    "ingredients": [
      "Scotch",
      "Dry Vermouth",
      "Lemon peel"
    ],
    "measures": "2 1/2 oz, 1 1/2 tsp, 1 twist of"
  },
  {
    "name": "Dubonnet Cocktail",
    "cdb_id": "11326",
    "alternate_name": null,
    "tags": null,
    "category": "Ordinary Drink",
    "instructions": "Stir all ingredients (except lemon peel) with ice and strain into a cocktail glass. Add the twist of lemon peel and serve.",
    "image": "https://www.thecocktaildb.com/images/media/drink/xxsuwr1439457147.jpg",
    "ingredients": [
      "Dubonnet Rouge",
      "Gin",
      "Bitters",
      "Lemon peel"
    ],
    "measures": "1 1/2 oz, 3/4 oz, 1 dash, 1 twist of"
  },
  {
    "name": "English Highball",
    "cdb_id": "11338",
    "alternate_name": null,
    "tags": null,
    "category": "Ordinary Drink",
    "instructions": "Pour brandy, gin, and sweet vermouth into a highball glass over ice cubes. Fill with carbonated water. Add the twist of lemon peel, stir, and serve. (Ginger ale may be substituted for carbonated water, if preferred.)",
    "image": "https://www.thecocktaildb.com/images/media/drink/dhvr7d1504519752.jpg",
    "ingredients": [
      "Brandy",
      "Gin",
      "Sweet Vermouth",
      "Carbonated water",
      "Lemon peel"
    ],
    "measures": "3/4 oz, 3/4 oz, 3/4 oz"
  },
  {
    "name": "English Rose Cocktail",
    "cdb_id": "11339",
    "alternate_name": null,
    "tags": null,
    "category": "Ordinary Drink",
    "instructions": "Rub rim of cocktail glass with lemon juice and dip rim of glass in powdered sugar. Shake all ingredients (except cherry) with ice and strain into sugar-rimmed glass. Top with the cherry and serve.",
    "image": "https://www.thecocktaildb.com/images/media/drink/yxwrpp1441208697.jpg",
    "ingredients": [
      "Apricot brandy",
      "Gin",
      "Dry Vermouth",
      "Grenadine",
      "Lemon juice",
      "Cherry"
    ],
    "measures": "3/4 oz, 1 1/2 oz, 3/4 oz, 1 tsp, 1/4 tsp, 1"
  },
  {
    "name": "Flying Dutchman",
    "cdb_id": "11368",
    "alternate_name": null,
    "tags": null,
    "category": "Ordinary Drink",
    "instructions": "In an old-fashioned glass almost filled with ice cubes, combine the gin and triple sec. Stir well.",
    "image": "https://www.thecocktaildb.com/images/media/drink/akik8t1504519958.jpg",
    "ingredients": [
      "Gin",
      "Triple sec"
    ],
    "measures": "2 oz, 1/2 oz"
  },
  {
    "name": "Flying Scotchman",
    "cdb_id": "11369",
    "alternate_name": null,
    "tags": null,
    "category": "Ordinary Drink",
    "instructions": "Shake all ingredients with ice, strain into a cocktail glass, and serve.",
    "image": "https://www.thecocktaildb.com/images/media/drink/glgrix1504520040.jpg",
    "ingredients": [
      "Scotch",
      "Sweet Vermouth",
      "Bitters",
      "Sugar syrup"
    ],
    "measures": "1 oz, 1 oz, 1 dash, 1/4 tsp"
  },
  {
    "name": "Foxy Lady",
    "cdb_id": "11375",
    "alternate_name": null,
    "tags": null,
    "category": "Ordinary Drink",
    "instructions": "Shake all ingredients with ice, strain into a chilled cocktail glass, and serve.",
    "image": "https://www.thecocktaildb.com/images/media/drink/r9cz3q1504519844.jpg",
    "ingredients": [
      "Amaretto",
      "Creme de Cacao",
      "Light cream"
    ],
    "measures": "1/2 oz, 1/2 oz, 2 oz"
  },
  {
    "name": "French \"75\"",
    "cdb_id": "11379",
    "alternate_name": null,
    "tags": null,
    "category": "Ordinary Drink",
    "instructions": "In a shaker half-filled with ice cubes, combine the gin, sugar, and lemon juice. Shake well. Pour into a collins glass. Top with the Champagne. Stir well and garnish with the orange slice and the cherry.",
    "image": "https://www.thecocktaildb.com/images/media/drink/qpvxsx1439906903.jpg",
    "ingredients": [
      "Gin",
      "Sugar",
      "Lemon juice",
      "Champagne",
      "Orange",
      "Maraschino cherry"
    ],
    "measures": "1 1/2 oz, 2 tsp superfine, 1 1/2 oz, 4 oz Chilled, 1, 1"
  },
  {
    "name": "Frisco Sour",
    "cdb_id": "11382",
    "alternate_name": null,
    "tags": null,
    "category": "Ordinary Drink",
    "instructions": "Shake all ingredients (except slices of lemon and lime) with ice and strain into a whiskey sour glass. Decorate with the slices of lemon and lime and serve.",
    "image": "https://www.thecocktaildb.com/images/media/drink/y39l941504884150.jpg",
    "ingredients": [
      "Blended whiskey",
      "Benedictine",
      "Lemon",
      "Lime",
      "Lemon",
      "Lime"
    ],
    "measures": "2 oz, 1/2 oz, Juice of 1/4, Juice of 1/2, 1 slice, 1 slice"
  },
  {
    "name": "Frozen Daiquiri",
    "cdb_id": "11387",
    "alternate_name": null,
    "tags": null,
    "category": "Ordinary Drink",
    "instructions": "Combine all ingredients (except for the cherry) in an electric blender and blend at a low speed for five seconds, then blend at a high speed until firm. Pour contents into a champagne flute, top with the cherry, and serve.",
    "image": "https://www.thecocktaildb.com/images/media/drink/7oyrj91504884412.jpg",
    "ingredients": [
      "Light rum",
      "Triple sec",
      "Lime juice",
      "Sugar",
      "Cherry",
      "Ice"
    ],
    "measures": "1 1/2 oz, 1 tblsp, 1 1/2 oz, 1 tsp, 1, 1 cup crushed"
  },
  {
    "name": "Frozen Mint Daiquiri",
    "cdb_id": "11390",
    "alternate_name": null,
    "tags": null,
    "category": "Ordinary Drink",
    "instructions": "Combine all ingredients with 1 cup of crushed ice in an electric blender. Blend at a low speed for a short length of time. Pour into an old-fashioned glass and serve.",
    "image": "https://www.thecocktaildb.com/images/media/drink/jrhn1q1504884469.jpg",
    "ingredients": [
      "Light rum",
      "Lime juice",
      "Mint",
      "Sugar"
    ],
    "measures": "2 oz, 1 tblsp, 6, 1 tsp"
  },
  {
    "name": "Frozen Pineapple Daiquiri",
    "cdb_id": "11391",
    "alternate_name": null,
    "tags": null,
    "category": "Ordinary Drink",
    "instructions": "Combine all ingredients with 1 cup of crushed ice in an electric blender. Blend at a low speed for a short length of time. Pour into a champagne flute and serve.",
    "image": "https://www.thecocktaildb.com/images/media/drink/j2mqsb1504736097.jpg",
    "ingredients": [
      "Light rum",
      "Pineapple",
      "Lime juice",
      "Sugar"
    ],
    "measures": "1 1/2 oz, 4 chunks, 1 tblsp, 1/2 tsp"
  },
  {
    "name": "Gentleman's Club",
    "cdb_id": "11396",
    "alternate_name": null,
    "tags": null,
    "category": "Ordinary Drink",
    "instructions": "In an old-fashioned glass almost filled with ice cubes, combine all of the ingredients. Stir well.",
    "image": "https://www.thecocktaildb.com/images/media/drink/ezvy1c1504883335.jpg",
    "ingredients": [
      "Gin",
      "Brandy",
      "Sweet Vermouth",
      "Club soda"
    ],
    "measures": "1 1/2 oz, 1 oz, 1 oz, 1 oz"
  },
  {
    "name": "Gin And Tonic",
    "cdb_id": "11403",
    "alternate_name": null,
    "tags": null,
    "category": "Ordinary Drink",
    "instructions": "Pour the gin and the tonic water into a highball glass almost filled with ice cubes. Stir well. Garnish with the lime wedge.",
    "image": "https://www.thecocktaildb.com/images/media/drink/wtyxvx1472405831.jpg",
    "ingredients": [
      "Gin",
      "Tonic water",
      "Lime"
    ],
    "measures": "2 oz, 5 oz, 1"
  },
  {
    "name": "Gin Cooler",
    "cdb_id": "11407",
    "alternate_name": null,
    "tags": null,
    "category": "Ordinary Drink",
    "instructions": "Stir powdered sugar and 2 oz. carbonated water in a collins glass. Fill glass with ice and add gin. Fill with carbonated water and stir. Add the lemon peel and the orange spiral so that the end of the orange spiral dangles over rim of glass.",
    "image": "https://www.thecocktaildb.com/images/media/drink/wsyrvv1478820109.jpg",
    "ingredients": [
      "Gin",
      "Carbonated water",
      "Powdered sugar",
      "Orange spiral",
      "Lemon peel"
    ],
    "measures": "2 oz"
  },
  {
    "name": "Gin Daisy",
    "cdb_id": "11408",
    "alternate_name": null,
    "tags": null,
    "category": "Ordinary Drink",
    "instructions": "In a shaker half-filled with ice cubes, combine the wine, lemon juice, sugar, and grenadine. Shake well. Pour into an old-fashioned glass and garnish with the cherry and the orange slice.",
    "image": "https://www.thecocktaildb.com/images/media/drink/qwxysv1478819943.jpg",
    "ingredients": [
      "Gin",
      "Lemon juice",
      "Sugar",
      "Grenadine",
      "Maraschino cherry",
      "Orange"
    ],
    "measures": "2 oz, 1 oz, 1/2 tsp superfine, 1/2 tsp, 1, 1"
  },
  {
    "name": "Gin Fizz",
    "cdb_id": "11410",
    "alternate_name": null,
    "tags": "IBA,Classic",
    "category": "Ordinary Drink",
    "instructions": "Shake all ingredients with ice cubes, except soda water. Pour into glass. Top with soda water.",
    "image": "https://www.thecocktaildb.com/images/media/drink/xhl8q31504351772.jpg",
    "ingredients": [
      "Gin",
      "Lemon",
      "Powdered sugar",
      "Carbonated water"
    ],
    "measures": "2 oz, Juice of 1/2, 1 tsp"
  },
  {
    "name": "Gin Sling",
    "cdb_id": "11415",
    "alternate_name": null,
    "tags": null,
    "category": "Ordinary Drink",
    "instructions": "Dissolve powdered sugar in mixture of water and juice of lemon. Add gin. Pour into an old-fashioned glass over ice cubes and stir. Add the twist of orange peel and serve.",
    "image": "https://www.thecocktaildb.com/images/media/drink/h8wmm41504883440.jpg",
    "ingredients": [
      "Gin",
      "Lemon",
      "Powdered sugar",
      "Water",
      "Orange peel"
    ],
    "measures": "2 oz, Juice of 1/2, 1 tsp, 1 tsp, Twist of"
  },
  {
    "name": "Gin Smash",
    "cdb_id": "11416",
    "alternate_name": null,
    "tags": null,
    "category": "Ordinary Drink",
    "instructions": "Muddle sugar with carbonated water and mint sprigs in an old-fashioned glass. Add gin and 1 ice cube. Stir, add the orange slice and the cherry, and serve.",
    "image": "https://www.thecocktaildb.com/images/media/drink/hp41fi1504883656.jpg",
    "ingredients": [
      "Gin",
      "Carbonated water",
      "Sugar",
      "Mint",
      "Orange",
      "Cherry"
    ],
    "measures": "2 oz, 1 oz, 1 cube, 4, 1 slice, 1"
  },
  {
    "name": "Gin Sour",
    "cdb_id": "11417",
    "alternate_name": null,
    "tags": null,
    "category": "Ordinary Drink",
    "instructions": "In a shaker half-filled with ice cubes, combine the gin, lemon juice, and sugar. Shake well. Strain into a sour glass and garnish with the orange slice and the cherry.",
    "image": "https://www.thecocktaildb.com/images/media/drink/mt7l7m1504883523.jpg",
    "ingredients": [
      "Gin",
      "Lemon juice",
      "Sugar",
      "Orange",
      "Maraschino cherry"
    ],
    "measures": "2 oz, 1 oz, 1/2 tsp superfine, 1, 1"
  },
  {
    "name": "Gin Squirt",
    "cdb_id": "11418",
    "alternate_name": null,
    "tags": null,
    "category": "Ordinary Drink",
    "instructions": "Stir gin, grenadine, and powdered sugar with ice and strain into a highball glass over ice cubes. Fill with carbonated water and stir. Decorate with the pineapple chunks and the strawberries and serve.",
    "image": "https://www.thecocktaildb.com/images/media/drink/xrbhz61504883702.jpg",
    "ingredients": [
      "Gin",
      "Grenadine",
      "Powdered sugar",
      "Pineapple",
      "Strawberries",
      "Carbonated water"
    ],
    "measures": "1 1/2 oz, 1 tsp, 1 tblsp, 3 chunks, 2"
  },
  {
    "name": "Gin Swizzle",
    "cdb_id": "11419",
    "alternate_name": null,
    "tags": null,
    "category": "Ordinary Drink",
    "instructions": "In a shaker half-filled with ice cubes, combine the lime juice, sugar, gin, and bitters. Shake well. Almost fill a colling glass with ice cubes. Stir until the glass is frosted. Strain the mixture in the shaker into the glass and add the club soda.",
    "image": "https://www.thecocktaildb.com/images/media/drink/sybce31504884026.jpg",
    "ingredients": [
      "Lime juice",
      "Sugar",
      "Gin",
      "Bitters",
      "Club soda"
    ],
    "measures": "1 1/2 oz, 1 tsp superfine, 2 oz, 1 dash, 3 oz"
  },
  {
    "name": "Gin Toddy",
    "cdb_id": "11420",
    "alternate_name": null,
    "tags": null,
    "category": "Ordinary Drink",
    "instructions": "Mix powdered sugar and water in an old-fashioned glass. Add gin and one ice cube. Stir, add the twist of lemon peel, and serve.",
    "image": "https://www.thecocktaildb.com/images/media/drink/l9gi5h1504820724.jpg",
    "ingredients": [
      "Gin",
      "Water",
      "Powdered sugar",
      "Lemon peel"
    ],
    "measures": "2 oz, 2 tsp, 1/2 tsp, 1 twist of"
  },
  {
    "name": "Godchild",
    "cdb_id": "11422",
    "alternate_name": null,
    "tags": null,
    "category": "Ordinary Drink",
    "instructions": "Shake all ingredients well with cracked ice, strain into a champagne flute, and serve.",
    "image": "https://www.thecocktaildb.com/images/media/drink/m5nhtr1504820829.jpg",
    "ingredients": [
      "Vodka",
      "Amaretto",
      "Heavy cream"
    ],
    "measures": "1 oz, 1 oz, 1 oz"
  },
  {
    "name": "Godfather",
    "cdb_id": "11423",
    "alternate_name": null,
    "tags": "IBA,ContemporaryClassic",
    "category": "Ordinary Drink",
    "instructions": "Pour all ingredients directly into old fashioned glass filled with ice cubes. Stir gently.",
    "image": "https://www.thecocktaildb.com/images/media/drink/r74uz51504368928.jpg",
    "ingredients": [
      "Scotch",
      "Amaretto"
    ],
    "measures": "1 1/2 oz, 3/4 oz"
  },
  {
    "name": "Godmother",
    "cdb_id": "11424",
    "alternate_name": null,
    "tags": "IBA,ContemporaryClassic",
    "category": "Ordinary Drink",
    "instructions": "Pour vodka and amaretto into an old-fashioned glass over ice and serve.",
    "image": "https://www.thecocktaildb.com/images/media/drink/4889up1504368984.jpg",
    "ingredients": [
      "Vodka",
      "Amaretto"
    ],
    "measures": "1 1/2 oz, 3/4 oz"
  },
  {
    "name": "Grass Skirt",
    "cdb_id": "11433",
    "alternate_name": null,
    "tags": null,
    "category": "Ordinary Drink",
    "instructions": "In a shaker half-filled with ice cubes, combine the gin, triple sec, pineapple juice, and grenadine. Shake well. Pour into an old-fashioned glass and garnish with the pineapple slice.",
    "image": "https://www.thecocktaildb.com/images/media/drink/qyvprp1473891585.jpg",
    "ingredients": [
      "Gin",
      "Triple sec",
      "Pineapple juice",
      "Grenadine",
      "Pineapple"
    ],
    "measures": "1 1/2 oz, 1 oz, 1 oz, 1/2 tsp, 1"
  },
  {
    "name": "Harvey Wallbanger",
    "cdb_id": "11462",
    "alternate_name": null,
    "tags": "IBA,ContemporaryClassic",
    "category": "Ordinary Drink",
    "instructions": "Stir the vodka and orange juice with ice in the glass, then float the Galliano on top. Garnish and serve.",
    "image": "https://www.thecocktaildb.com/images/media/drink/vg4bva1504369725.jpg",
    "ingredients": [
      "Vodka",
      "Galliano",
      "Orange juice"
    ],
    "measures": "1 oz, 1/2 oz, 4 oz"
  },
  {
    "name": "Havana Cocktail",
    "cdb_id": "11470",
    "alternate_name": null,
    "tags": null,
    "category": "Ordinary Drink",
    "instructions": "In a shaker half-filled with ice cubes, combine all of the ingredients. Shake well. Strain into a cocktail glass.",
    "image": "https://www.thecocktaildb.com/images/media/drink/59splc1504882899.jpg",
    "ingredients": [
      "Light rum",
      "Pineapple juice",
      "Lemon juice"
    ],
    "measures": "1 oz, 1 oz, 1 tsp"
  },
  {
    "name": "Hawaiian Cocktail",
    "cdb_id": "11472",
    "alternate_name": null,
    "tags": null,
    "category": "Ordinary Drink",
    "instructions": "Shake all ingredients with ice, strain into a cocktail glass, and serve.",
    "image": "https://www.thecocktaildb.com/images/media/drink/ujoh9x1504882987.jpg",
    "ingredients": [
      "Gin",
      "Triple sec",
      "Pineapple juice"
    ],
    "measures": "2 oz, 1/2 oz, 1 tblsp"
  },
  {
    "name": "Highland Fling Cocktail",
    "cdb_id": "11476",
    "alternate_name": null,
    "tags": null,
    "category": "Ordinary Drink",
    "instructions": "Stir all ingredients (except olive) with ice and strain into a cocktail glass. Add the olive and serve.",
    "image": "https://www.thecocktaildb.com/images/media/drink/0bkwca1492975553.jpg",
    "ingredients": [
      "Scotch",
      "Sweet Vermouth",
      "Orange bitters",
      "Olive"
    ],
    "measures": "1 1/2 oz, 3/4 oz, 2 dashes, 1"
  },
  {
    "name": "Imperial Fizz",
    "cdb_id": "11524",
    "alternate_name": null,
    "tags": null,
    "category": "Ordinary Drink",
    "instructions": "Shake all ingredients (except carbonated water) with ice and strain into a highball glass over two ice cubes. Fill with carbonated water, stir, and serve.",
    "image": "https://www.thecocktaildb.com/images/media/drink/zj1usl1504884548.jpg",
    "ingredients": [
      "Light rum",
      "Blended whiskey",
      "Lemon",
      "Powdered sugar",
      "Carbonated water"
    ],
    "measures": "1/2 oz, 1 1/2 oz, Juice of 1/2, 1 tsp"
  },
  {
    "name": "Irish Spring",
    "cdb_id": "11528",
    "alternate_name": null,
    "tags": null,
    "category": "Ordinary Drink",
    "instructions": "Pour all ingredients (except orange slice and cherry) into a collins glass over ice cubes. Garnish with the slice of orange, add the cherry on top, and serve.",
    "image": "https://www.thecocktaildb.com/images/media/drink/sot8v41504884783.jpg",
    "ingredients": [
      "Irish whiskey",
      "Peach brandy",
      "Orange juice",
      "Sweet and sour",
      "Orange",
      "Cherry"
    ],
    "measures": "1 oz, 1/2 oz, 1 oz, 1 oz, 1 slice, 1"
  },
  {
    "name": "Jack Rose Cocktail",
    "cdb_id": "11542",
    "alternate_name": null,
    "tags": "Beach",
    "category": "Ordinary Drink",
    "instructions": "Shake all ingredients with ice, strain into a cocktail glass, and serve.",
    "image": "https://www.thecocktaildb.com/images/media/drink/uuqqrv1439907068.jpg",
    "ingredients": [
      "Apple brandy",
      "Grenadine",
      "Lime"
    ],
    "measures": "1 1/2 oz, 1 tsp, Juice of 1/2"
  },
  {
    "name": "Japanese Fizz",
    "cdb_id": "11558",
    "alternate_name": null,
    "tags": null,
    "category": "Ordinary Drink",
    "instructions": "Shake all ingredients (except carbonated water) with ice and strain into a highball glass over two ice cubes. Fill with carbonated water, stir, and serve.",
    "image": "https://www.thecocktaildb.com/images/media/drink/37vzv11504884831.jpg",
    "ingredients": [
      "Blended whiskey",
      "Lemon",
      "Powdered sugar",
      "Port",
      "Egg white",
      "Carbonated water"
    ],
    "measures": "1 1/2 oz, Juice of 1/2, 1 tsp, 1 tblsp, 1"
  },
  {
    "name": "Jewel Of The Nile",
    "cdb_id": "11566",
    "alternate_name": null,
    "tags": null,
    "category": "Ordinary Drink",
    "instructions": "In a mixing glass half-filled with ice cubes, combine all of the ingredients. Stir well. Strain into a cocktail glass.",
    "image": "https://www.thecocktaildb.com/images/media/drink/hx4nrb1504884947.jpg",
    "ingredients": [
      "Gin",
      "Green Chartreuse",
      "Yellow Chartreuse"
    ],
    "measures": "1 1/2 oz, 1/2 oz, 1/2 oz"
  },
  {
    "name": "John Collins",
    "cdb_id": "11580",
    "alternate_name": null,
    "tags": "IBA",
    "category": "Ordinary Drink",
    "instructions": "Pour all ingredients directly into highball glass filled with ice. Stir gently. Garnish. Add a dash of Angostura bitters.",
    "image": "https://www.thecocktaildb.com/images/media/drink/u5yaxl1504350270.jpg",
    "ingredients": [
      "Bourbon",
      "Lemon juice",
      "Sugar",
      "Club soda",
      "Maraschino cherry",
      "Orange"
    ],
    "measures": "2 oz, 1 oz, 1 tsp superfine, 3 oz, 1, 1"
  },
  {
    "name": "Salted Toffee Martini",
    "cdb_id": "17233",
    "alternate_name": null,
    "tags": null,
    "category": "Cocktail",
    "instructions": "Add ice, toffee gin, chocolate liqueur and Amaretto to a cocktail shaker and shake vigorously. \r\nPour the chocolate syrup into a saucer and dip the top of a martini glass into the sauce. Grate some of the Willie\\'s sea salt chocolate into another saucer and dip the coated glass, so the flakes stick to the sauce, creating a chocolate rim!\r\nPour the contents of the shaker into your chocolatey glass and sprinkle with more grated chocolate - enjoy!  ",
    "image": "https://www.thecocktaildb.com/images/media/drink/3s6mlr1509551211.jpg",
    "ingredients": [
      "Gin",
      "Chocolate liqueur",
      "Amaretto",
      "Chocolate Sauce",
      "Salted Chocolate"
    ],
    "measures": "50 ml, 30 ml, 15 ml, Garnish, Grated"
  },
  {
    "name": "Hunter's Moon",
    "cdb_id": "17239",
    "alternate_name": null,
    "tags": null,
    "category": "Cocktail",
    "instructions": "Put the Bombay Sapphire, Martini Bianco, sugar syrup & blackberries in a cocktail shaker with lots of ice and shake vigorously before pouring into a balloon glass, topping up with lemonade and garnishing with a wedge of orange.",
    "image": "https://www.thecocktaildb.com/images/media/drink/t0iugg1509556712.jpg",
    "ingredients": [
      "Vermouth",
      "Maraschino Cherry",
      "Sugar Syrup",
      "Lemonade",
      "Blackberries"
    ],
    "measures": "25 ml, 15 ml, 10 ml, 100 ml, 2"
  },
  {
    "name": "Zombie",
    "cdb_id": "17241",
    "alternate_name": null,
    "tags": null,
    "category": "Cocktail",
    "instructions": "\r\nBlend at high speed for no more than 5 seconds.\r\n\r\nPour into a glass, add ice cubes to fill, then add the garnish.\r\n\r\n*Donn’s mix: Bring 3 crushed cinnamon sticks, 1 cup of sugar and 1 cup of water to a boil, stirring until the sugar is dissolved.\r\n\r\nSimmer for 2 minutes, then remove from the heat and let sit for at least 2 hours before straining into a clean glass bottle.\r\n\r\nThen add 1 part of the syrup and 2 parts of fresh grapefruit juice together.",
    "image": "https://www.thecocktaildb.com/images/media/drink/2en3jk1509557725.jpg",
    "ingredients": [
      "Rum",
      "Gold rum",
      "151 proof rum",
      "Pernod",
      "Grenadine",
      "Lime Juice",
      "Angostura Bitters"
    ],
    "measures": "1 1/2 oz, 1 1/2 oz, 1 oz, 1 tsp, 1 tsp, 1 tsp, 1 drop"
  },
  {
    "name": "Bombay Cassis",
    "cdb_id": "17242",
    "alternate_name": null,
    "tags": null,
    "category": "Cocktail",
    "instructions": "Add the Bombay Sapphire, Crème de Cassis and lime juice to a balloon glass and swirl well to mix.\r\nFill the glass with good quality cubed ice.\r\nTop up with chilled and freshly opened Fever-Tree Ginger Beer.\r\nGently stir to combine, top with a gently squeezed lime wedge and finish with a fresh ginger slice.",
    "image": "https://www.thecocktaildb.com/images/media/drink/h1e0e51510136907.jpg",
    "ingredients": [
      "Gin",
      "Creme de Cassis",
      "Fresh Lime Juice",
      "Ginger beer",
      "Lime",
      "Ginger"
    ],
    "measures": "50 ml, 20 ml, 15 ml, 75 ml, 1, 1 long strip"
  },
  {
    "name": "Rosemary Blue",
    "cdb_id": "17245",
    "alternate_name": null,
    "tags": null,
    "category": "Cocktail",
    "instructions": "1) Add the Bombay Sapphire, Blue Curacao, rosemary sprig and gently squeezed lemon wedge to a balloon glass. Swirl well to combine.\r\n2) Fill with cubed ice and top with the Fever-Tree Light Tonic Water.\r\n3) Gently fold with a bar spoon to mix.",
    "image": "https://www.thecocktaildb.com/images/media/drink/qwc5f91512406543.jpg",
    "ingredients": [
      "Gin",
      "Blue Curacao",
      "Tonic Water",
      "Rosemary"
    ],
    "measures": "50 ml, 15 ml, 100 ml, Garnish with"
  },
  {
    "name": "Empellón Cocina's Fat-Washed Mezcal",
    "cdb_id": "17246",
    "alternate_name": null,
    "tags": null,
    "category": "Cocktail",
    "instructions": "To ensure that your pork fat is just as delicious as theirs, here’s their adobo marinade and what to do with it (you’ll also need a rack of ribs):\r\n\r\n4 ancho chiles, 8 guajillo chiles and 4 chipotle chiles, plus 4 cloves roasted garlic, half a cup of cider vinegar, a quarter teaspoon of Mexican oregano, 1 teaspoon of ground black pepper, a whole clove, a quarter teaspoon of ground cinnamon and a half teaspoon of ground cumin.\r\n\r\nToast the dried chiles and soak in water for at least an hour until they are rehydrated. Drain and discard the soaking liquid. Combine the soaked chiles with the remaining ingredients and purée until smooth.\r\n\r\nCold smoke a rack of baby back pork ribs by taking a large hotel pan with woodchips on one side and charcoal on the other. Place another, smaller, pan with pork ribs, above the charcoal/woodchip pan. Ignite the charcoal, being careful to not ignite the woodchips. Cover both pans with foil and allow to smoke for 10-15 minutes, until desired level of smoke is achieved, then coat with adobo marinade and wrap in tin foil prior to placing ribs in a 300 degree oven for 7 hours. When the ribs have cooled, strain off the fat and use for the infusion.\r\n\r\nIf you’re having a hard time coming up to the same kind of volume of fat, make up the balance with pork lard from a butcher. To get the same depth of flavor without the ribs, heat up the fat in a pot with a few spoons of the marinade.\r\n\r\nOnce you’ve got your tub of seasoned pork fat in cooled liquid form, pour equal amounts of Ilegal Joven mezcal and fat into a sealable container. Seal the container and give it a really good shake, then put it in the freezer overnight. When the whole thing is separated and congealed, pour it through a fine mesh chinoise. If you don’t have a chinoise, try a fine mesh strainer, or if you don’t have one of those, try spooning off most of the fat. There will be some beads of orange fat left in the strained mezcal: run that through a few layers of cheesecloth (or coffee filters in a pinch) to get rid of the last of it.\r\n\r\nThe mezcal is now ready for drinking, straight-up or in a cocktail. \r\n\r\nHabanero tincture\r\n\r\nSlice habaneros and add 2 ounces Ilegal Joven mezcal.\r\nAllow to sit overnight or until desired level of heat is achieved.\r\nCocktail\r\n\r\nCombine mezcal and chocolate liqueur in a mixing glass with ice and stir for 45 seconds.\r\nStrain into chilled coupe.\r\nCarefully \"sink\" the coffee liqueur down the inside of the coupe over a spoon.\r\nGarnish with 5 drops habanero tincture.",
    "image": "https://www.thecocktaildb.com/images/media/drink/osgvxt1513595509.jpg",
    "ingredients": [
      "Mezcal",
      "Chocolate liqueur",
      "Coffee liqueur"
    ],
    "measures": "2 oz, 3/4 oz, 1/2 oz"
  },
  {
    "name": "The Last Word",
    "cdb_id": "17247",
    "alternate_name": null,
    "tags": null,
    "category": "Cocktail",
    "instructions": "Shake with ice and strain into a cocktail glass.",
    "image": "https://www.thecocktaildb.com/images/media/drink/91oule1513702624.jpg",
    "ingredients": [
      "Green Chartreuse",
      "Maraschino Liqueur",
      "Lime Juice"
    ],
    "measures": "1 oz, 1 oz, 1 oz"
  },
  {
    "name": "French Negroni",
    "cdb_id": "17248",
    "alternate_name": null,
    "tags": null,
    "category": "Cocktail",
    "instructions": "Add ice to a shaker and pour in all ingredients.\nUsing a bar spoon, stir 40 to 45 revolutions or until thoroughly chilled.\nStrain into a martini glass or over ice into a rocks glass. Garnish with orange twist.",
    "image": "https://www.thecocktaildb.com/images/media/drink/x8lhp41513703167.jpg",
    "ingredients": [
      "Gin",
      "Lillet",
      "Sweet Vermouth",
      "Orange Peel"
    ],
    "measures": "1 oz, 1 oz, 1 oz, 1"
  },
  {
    "name": "Pegu Club",
    "cdb_id": "17249",
    "alternate_name": null,
    "tags": null,
    "category": "Cocktail",
    "instructions": "Shake, strain, up, cocktail glass",
    "image": "https://www.thecocktaildb.com/images/media/drink/jfkemm1513703902.jpg",
    "ingredients": [
      "Gin",
      "Orange Curacao",
      "Lime Juice",
      "Angostura Bitters",
      "Orange Bitters"
    ],
    "measures": "1 1/2 oz, 3/4 oz, 3/4 oz, 1 dash, 1 dash"
  },
  {
    "name": "Corpse Reviver #2",
    "cdb_id": "17250",
    "alternate_name": null,
    "tags": null,
    "category": "Cocktail",
    "instructions": "Shake, strain, straight up, cocktail glass rinsed with absinthe\r\n",
    "image": "https://www.thecocktaildb.com/images/media/drink/gifgao1513704334.jpg",
    "ingredients": [
      "Gin",
      "Triple Sec",
      "Lillet Blanc",
      "Lemon Juice",
      "Absinthe"
    ],
    "measures": "3/4 oz, 3/4 oz, 3/4 oz, 3/4 oz, 1 dash"
  },
  {
    "name": "Boulevardier",
    "cdb_id": "17251",
    "alternate_name": null,
    "tags": null,
    "category": "Cocktail",
    "instructions": "Stir with ice, strain, garnish and serve.",
    "image": "https://www.thecocktaildb.com/images/media/drink/km84qi1513705868.jpg",
    "ingredients": [
      "Campari",
      "Sweet Vermouth",
      "Rye whiskey",
      "Orange Peel"
    ],
    "measures": "1 oz, 1 oz, 1 1/4 oz, 1"
  },
  {
    "name": "Greyhound",
    "cdb_id": "17252",
    "alternate_name": null,
    "tags": null,
    "category": "Cocktail",
    "instructions": "Add the vodka to a Collins glass filled with ice.\nTop with grapefruit juice and stir.\n\n",
    "image": "https://www.thecocktaildb.com/images/media/drink/g5upn41513706732.jpg",
    "ingredients": [
      "Vodka",
      "Grapefruit Juice"
    ],
    "measures": "1 1/2 oz, 3 oz"
  },
  {
    "name": "Paloma",
    "cdb_id": "17253",
    "alternate_name": null,
    "tags": null,
    "category": "Cocktail",
    "instructions": "Stir together and serve over ice.",
    "image": "https://www.thecocktaildb.com/images/media/drink/samm5j1513706393.jpg",
    "ingredients": [
      "Grape Soda",
      "Tequila"
    ],
    "measures": "3 oz, 1 1/2 oz"
  },
  {
    "name": "Bijou",
    "cdb_id": "17254",
    "alternate_name": null,
    "tags": null,
    "category": "Cocktail",
    "instructions": "Stir in mixing glass with ice and strain\r\n",
    "image": "https://www.thecocktaildb.com/images/media/drink/rysb3r1513706985.jpg",
    "ingredients": [
      "Orange Bitters",
      "Green Chartreuse",
      "Gin",
      "Sweet Vermouth"
    ],
    "measures": "1 dash, 1 oz, 1 oz, 1 oz"
  },
  {
    "name": "Gimlet",
    "cdb_id": "17255",
    "alternate_name": null,
    "tags": null,
    "category": "Cocktail",
    "instructions": "Add all the ingredients to a shaker and fill with ice.\r\n\r\nShake, and strain into a chilled cocktail glass or an Old Fashioned glass filled with fresh ice.\r\n\r\nGarnish with a lime wheel.",
    "image": "https://www.thecocktaildb.com/images/media/drink/3xgldt1513707271.jpg",
    "ingredients": [
      "Gin",
      "Lime Juice",
      "Sugar Syrup",
      "Lime"
    ],
    "measures": "2 1/2 oz, 1/2 oz, 1/2 oz, 1"
  },
  {
    "name": "Martinez 2",
    "cdb_id": "17256",
    "alternate_name": null,
    "tags": null,
    "category": "Cocktail",
    "instructions": "Add all ingredients to a mixing glass and fill with ice.\r\n\r\nStir until chilled, and strain into a chilled coupe glass.",
    "image": "https://www.thecocktaildb.com/images/media/drink/fs6kiq1513708455.jpg",
    "ingredients": [
      "Gin",
      "Sweet Vermouth",
      "Maraschino Liqueur",
      "Angostura Bitters"
    ],
    "measures": "1 1/2 oz, 1 1/2 oz, 1 tsp, 2 dashes"
  },
  {
    "name": "Oatmeal Cookie",
    "cdb_id": "17266",
    "alternate_name": null,
    "tags": null,
    "category": "Cocktail",
    "instructions": "Just mix it all together.\r\nIt's meant to be a shot, but it works just fine as a proper adult-sized drink over lots of ice.\r\n\r\nTastes like an oatmeal cookie.",
    "image": "https://www.thecocktaildb.com/images/media/drink/bsvmlg1515792693.jpg",
    "ingredients": [
      "Kahlua",
      "Bailey",
      "Butterscotch schnapps",
      "Jagermeister",
      "Goldschlager"
    ],
    "measures": "2 parts, 2 parts, 4 parts, 1 part, 1/2 part"
  },
  {
    "name": "Bahama Mama",
    "cdb_id": "17267",
    "alternate_name": null,
    "tags": null,
    "category": "Cocktail",
    "instructions": "Add 2 parts club soda or more or less to taste.\r\n\r\nMix it all together and pour over a bunch of ice. Drink with a straw.",
    "image": "https://www.thecocktaildb.com/images/media/drink/tyb4a41515793339.jpg",
    "ingredients": [
      "Rum",
      "Dark Rum",
      "Banana liqueur",
      "Grenadine",
      "Pineapple Juice",
      "Orange Juice",
      "Sweet and Sour"
    ],
    "measures": "3 parts, 1 part, 1 part, 1 part, 2 parts, 2 parts, 1 part"
  },
  {
    "name": "Blue Hurricane",
    "cdb_id": "17268",
    "alternate_name": null,
    "tags": null,
    "category": "Cocktail",
    "instructions": "If each part is 1/2 oz then use about 2.5 cups of ice.\r\n\r\nBlend it all together. \r\nDrink it with a big straw if you have one.\r\n\r\n",
    "image": "https://www.thecocktaildb.com/images/media/drink/nwx02s1515795822.jpg",
    "ingredients": [
      "Rum",
      "Dark Rum",
      "Passoa",
      "Blue Curacao",
      "Sweet and Sour",
      "Ice"
    ],
    "measures": "4 parts, 2 parts, 1 part, 1 part, 6 parts, cubes"
  },
  {
    "name": "The Laverstoke",
    "cdb_id": "17824",
    "alternate_name": null,
    "tags": null,
    "category": "Cocktail",
    "instructions": "1) Squeeze two lime wedges into a balloon glass then add the cordial, Bombay Sapphire and MARTINI Rosso Vermouth, swirl to mix.\r\n\r\n2) Fully fill the glass with cubed ice and stir to chill.\r\n\r\n3) Top with Fever-Tree Ginger Ale and gently stir again to combine.\r\n\r\n4) Garnish with a snapped ginger slice and an awoken mint sprig.",
    "image": "https://www.thecocktaildb.com/images/media/drink/6xfj5t1517748412.jpg",
    "ingredients": [
      "Gin",
      "Elderflower cordial",
      "Rosso Vermouth",
      "Tonic Water",
      "Lime",
      "Ginger",
      "Mint"
    ],
    "measures": "50 ml, 15 ml, 15 ml, 75 ml, 2 Wedges, 1 Slice, 1 Large Sprig"
  },
  {
    "name": "Brigadier",
    "cdb_id": "17825",
    "alternate_name": null,
    "tags": null,
    "category": "Cocktail",
    "instructions": "Mix ingredients in a warmed mug and stir.",
    "image": "https://www.thecocktaildb.com/images/media/drink/nl89tf1518947401.jpg",
    "ingredients": [
      "Hot Chocolate",
      "Green Chartreuse",
      "Cherry Heering"
    ],
    "measures": "4 oz, 1 oz, 1 oz"
  },
  {
    "name": "The Jimmy Conway",
    "cdb_id": "17826",
    "alternate_name": null,
    "tags": null,
    "category": "Cocktail",
    "instructions": "Fill glass with ice\r\nPour in The Irishman and Disaronno\r\nFill to the top with Cranberry Juice\r\nGarnish with a slice of lemon…Enjoy!",
    "image": "https://www.thecocktaildb.com/images/media/drink/wbcvyo1535794478.jpg",
    "ingredients": [
      "Irish Whiskey",
      "Amaretto",
      "Cranberry Juice"
    ],
    "measures": "50 ml, 50 ml, 4 oz"
  },
  {
    "name": "Old Pal",
    "cdb_id": "17827",
    "alternate_name": null,
    "tags": null,
    "category": "Cocktail",
    "instructions": "Chill cocktail glass. Add ingredients to a mixing glass, and fill 2/3 full with ice. Stir about 20 seconds. Empty cocktail glass and strain into the glass. Garnish with a twist of lemon peel.",
    "image": "https://www.thecocktaildb.com/images/media/drink/x03td31521761009.jpg",
    "ingredients": [
      "Rye whiskey",
      "Campari",
      "Dry Vermouth"
    ],
    "measures": "2 oz, 1 oz, 1 oz"
  },
  {
    "name": "Tipperary",
    "cdb_id": "17828",
    "alternate_name": null,
    "tags": null,
    "category": "Cocktail",
    "instructions": "Stir over ice. Strain into chilled glass. Cut a wide swath of orange peel, and express the orange oils over the drink. Discard orange twist.",
    "image": "https://www.thecocktaildb.com/images/media/drink/b522ek1521761610.jpg",
    "ingredients": [
      "Irish Whiskey",
      "Sweet Vermouth",
      "Green Chartreuse"
    ],
    "measures": "2 oz, 1 oz, 1/2 oz"
  },
  {
    "name": "Penicillin",
    "cdb_id": "17829",
    "alternate_name": null,
    "tags": null,
    "category": "Cocktail",
    "instructions": "Shake blended Scotch, lemon juice, honey syrup and ginger syrup with ice. Strain over large ice in chilled rocks glass. Float smoky Scotch on top (be sure to use a smoky Scotch such as an Islay single malt). Garnish with candied ginger.",
    "image": "https://www.thecocktaildb.com/images/media/drink/hc9b1a1521853096.jpg",
    "ingredients": [
      "Blended Scotch",
      "Lemon Juice",
      "Honey syrup",
      "Ginger Syrup",
      "Islay single malt Scotch"
    ],
    "measures": "2 oz, 3/4 oz, 2 tsp, 2 tsp, 1/4 oz"
  },
  {
    "name": "Corn n Oil",
    "cdb_id": "17830",
    "alternate_name": null,
    "tags": null,
    "category": "Cocktail",
    "instructions": "Cut the half lime in half again. Add the lime, falernum, and bitters to a rocks glass. Muddle. Add the rum. (Aged Barbados rum such as Plantation 5 Year is recommended). Add ice and stir. Float the blackstrap rum on top. Serve with a straw.",
    "image": "https://www.thecocktaildb.com/images/media/drink/jfvyog1530108909.jpg",
    "ingredients": [
      "Lime",
      "Falernum",
      "Angostura Bitters",
      "Añejo rum",
      "blackstrap rum"
    ],
    "measures": "1/2, 1/3 oz, 2 dashes, 1 oz, 1 oz"
  },
  {
    "name": "A Furlong Too Late",
    "cdb_id": "17831",
    "alternate_name": null,
    "tags": null,
    "category": "Ordinary Drink",
    "instructions": "Pour the rum and ginger beer into a highball glass almost filled with ice cubes. Stir well. Garnish with the lemon twist.",
    "image": "https://www.thecocktaildb.com/images/media/drink/ssxvww1472669166.jpg",
    "ingredients": [
      "Light rum",
      "Ginger beer",
      "Lemon peel"
    ],
    "measures": "2 oz, 4 oz, 1 twist of"
  },
  {
    "name": "A Night In Old Mandalay",
    "cdb_id": "17832",
    "alternate_name": null,
    "tags": null,
    "category": "Ordinary Drink",
    "instructions": "In a shaker half-filled with ice cubes, combine the light rum, añejo rum, orange juice, and lemon juice. Shake well. Strain into a highball glass almost filled with ice cubes. Top with the ginger ale. Garnish with the lemon twist.",
    "image": "https://www.thecocktaildb.com/images/media/drink/vyrvxt1461919380.jpg",
    "ingredients": [
      "Light rum",
      "Añejo rum",
      "Orange juice",
      "Lemon juice",
      "Ginger ale",
      "Lemon peel"
    ],
    "measures": "1 oz, 1 oz, 1 oz, 1/2 oz, 3 oz, 1 twist of"
  },
  {
    "name": "A. J.",
    "cdb_id": "17833",
    "alternate_name": null,
    "tags": null,
    "category": "Ordinary Drink",
    "instructions": "Shake ingredients with ice, strain into a cocktail glass, and serve.",
    "image": "https://www.thecocktaildb.com/images/media/drink/uryyrr1472811418.jpg",
    "ingredients": [
      "Applejack",
      "Grapefruit juice"
    ],
    "measures": "1 1/2 oz, 1 oz"
  },
  {
    "name": "Abbey Cocktail",
    "cdb_id": "17834",
    "alternate_name": null,
    "tags": null,
    "category": "Ordinary Drink",
    "instructions": "Shake all ingredients (except for the cherry) with ice and strain into a cocktail glass. Top with the cherry and serve.",
    "image": "https://www.thecocktaildb.com/images/media/drink/quyyuw1472811568.jpg",
    "ingredients": [
      "Gin",
      "Orange bitters",
      "Orange",
      "Cherry"
    ],
    "measures": "1 1/2 oz, 1 dash, Juice of 1/4, 1"
  },
  {
    "name": "Abilene",
    "cdb_id": "17835",
    "alternate_name": null,
    "tags": null,
    "category": "Ordinary Drink",
    "instructions": "Pour all of the ingredients into a highball glass almost filled with ice cubes. Stir well.",
    "image": "https://www.thecocktaildb.com/images/media/drink/ysqwwt1461919465.jpg",
    "ingredients": [
      "Dark rum",
      "Peach nectar",
      "Orange juice"
    ],
    "measures": "1 1/2 oz, 2 oz, 3 oz"
  },
  {
    "name": "Acapulco",
    "cdb_id": "17836",
    "alternate_name": null,
    "tags": null,
    "category": "Ordinary Drink",
    "instructions": "Combine and shake all ingredients (except mint) with ice and strain into an old-fashioned glass over ice cubes. Add the sprig of mint and serve.",
    "image": "https://www.thecocktaildb.com/images/media/drink/vtpsvr1472811976.jpg",
    "ingredients": [
      "Light rum",
      "Triple sec",
      "Lime juice",
      "Sugar",
      "Egg white",
      "Mint"
    ],
    "measures": "1 1/2 oz, 1 1/2 tsp, 1 tblsp, 1 tsp, 1, 1"
  },
  {
    "name": "Adam",
    "cdb_id": "17837",
    "alternate_name": null,
    "tags": "Alcoholic,Holiday",
    "category": "Ordinary Drink",
    "instructions": "In a shaker half-filled with ice cubes, combine all of the ingredients. Shake well. Strain into a cocktail glass.",
    "image": "https://www.thecocktaildb.com/images/media/drink/rwuxsv1472812169.jpg",
    "ingredients": [
      "Dark rum",
      "Lemon juice",
      "Grenadine"
    ],
    "measures": "2 oz, 1 oz, 1 tsp"
  },
  {
    "name": "Adonis Cocktail",
    "cdb_id": "17838",
    "alternate_name": null,
    "tags": null,
    "category": "Ordinary Drink",
    "instructions": "Stir all ingredients with ice, strain contents into a cocktail glass, and serve.",
    "image": "https://www.thecocktaildb.com/images/media/drink/xrvruq1472812030.jpg",
    "ingredients": [
      "Sweet Vermouth",
      "Sherry",
      "Orange bitters"
    ],
    "measures": "3/4 oz, 1 1/2 oz dry, 1 dash"
  },
  {
    "name": "Affair",
    "cdb_id": "17839",
    "alternate_name": null,
    "tags": null,
    "category": "Ordinary Drink",
    "instructions": "Pour schnapps, orange juice, and cranberry juice over ice in a highball glass. Top with club soda and serve.",
    "image": "https://www.thecocktaildb.com/images/media/drink/wxrsxx1472720734.jpg",
    "ingredients": [
      "Strawberry schnapps",
      "Orange juice",
      "Cranberry juice",
      "Club soda"
    ],
    "measures": "2 oz, 2 oz, 2 oz"
  },
  {
    "name": "Affinity",
    "cdb_id": "17840",
    "alternate_name": null,
    "tags": null,
    "category": "Ordinary Drink",
    "instructions": "In a mixing glass half-filled with ice cubes, combine all of the ingredients. Stir well. Strain into a cocktail glass.",
    "image": "https://www.thecocktaildb.com/images/media/drink/nwatpb1504817045.jpg",
    "ingredients": [
      "Scotch",
      "Sweet Vermouth",
      "Dry Vermouth",
      "Orange bitters"
    ],
    "measures": "1 1/2 oz, 1 oz, 1 oz, 2 dashes"
  }
]
