{
  "oauth": {
    "stsServer": "https://keycloak.grim-is-a-geek.fr/auth/realms/bookshelf",
    "clientId": "bookshelf-local",
    "silentRenew": true,
    "renewTimeBeforeTokenExpiresInSeconds": 60
  },
  "globalVersion": "Local",
  "versionInformation": {
    "projectVersion": "Local",
    "pipelineId": "0",
    "jobId": "0",
    "commitSha": "0"
  }
}
