{
  "equipment-modal": {
    "description": "Моля, посочете пълното име на продукта, което искате да добавите:",
    "equipment-description": "Описание на вашето оборудване:",
    "equipment-found": "Ние намерихме подобно оборудване по-долу в нашата база данни.",
    "equipment-selection": "Моля, изберете съответните, ако има съвпадение, в\nпротивен случай кликнете върху потвърждаване, за да добавите описанието на вашето оборудване.",
    "info": "Всяка неточна информация може да забави валидирането на вашето заявление.",
    "title": "Продуктът не е в списъка",
    "validate": "Потвърдете"
  },
  "phone-modal": {
    "change": "промяна",
    "confirm": "Потвърдете",
    "ok": "Добре",
    "phone": "телефонен номер",
    "phone-text1": "Моля, потвърдете телефонния си номер с текстовото съобщение за кода за потвърждение.",
    "phone-text2": "Добавете вашия телефонен номер и въведете кода за потвърждение, получен чрез текстово съобщение, за да потвърдите.",
    "phone-text3": "Вашият телефонен номер е потвърден.",
    "phone-validation-failed": "Невалиден телефонен номер",
    "phone-validation-failed-description": "Кодът, който сте предоставили, е неправилен, моля, опитайте отново.",
    "phone-verification-success": "Успешно потвърждаване на телефона",
    "phone-verification-success-description": "Вашият телефонен номер е потвърден.",
    "send": "изпрати",
    "validation-code": "код за потвърждение"
  }
}