{
  "edit": {
    "customized": "CUSTOMIZED",
    "description": "Description",
    "html-template": "Email (HTML template)",
    "label-code": "code",
    "label-recipient": "recipient",
    "label-type": "type",
    "language-filter": "Languages",
    "language-help-text": "To add a custom notification select a language and create the content.",
    "language-option-all": "All",
    "short-template": "Short message (SMS & WHATSAPP)",
    "subject": "Subject",
    "submit": "save",
    "text-template": "Email (Text template)"
  },
  "variable-form": {
    "custom": "custom value",
    "default": "default value",
    "submit": "insert",
    "variable": "variable",
    "variable-placeholder": "Select a variable in the list"
  },
  "warning-global-notification": {
    "alert-text": "This is a standard notification and the change will be applied to all organizations.",
    "btn-cancel": "Cancel",
    "btn-confirm": "Confirm",
    "subtitle": "You are about to modify notification",
    "text": "Please press confirm to proceed.",
    "title": "TEMPLATE MANAGEMENT"
  }
}