{
  "currency-modal": {
    "continue-on-payoneer": "Pokračujte v internetovej banke Payoneer",
    "error": "Problém pri aktualizácii meny",
    "payoneer-error": "Problém pri získavaní informácií internetovej banky Payoneer",
    "save": "uložiť",
    "text": "Mena sa uplatní v každej aktívnej faktúre.",
    "title": "Zmeniť menu",
    "title-first": "Najskôr musíme poznať vašu menu"
  }
}