{
  "a-mail-has-benn-send": "An email has been sent to {{email}} with a link to verify your acount",
  "already-account": "already have an account?",
  "back": "Back",
  "contact-support": "Contact support",
  "customer": "I am a brand",
  "customer-title": "Become our partner and order a shooting",
  "if-youhave-not-received": "If you have not recieved the email after a few minutes, please check your spam folder.",
  "invitation-welcome": "join the {{organization}} organization by completing the fields below",
  "operator": "I am an image creator",
  "operator-title": "Join our community and find a mission",
  "resend-verification-email": "Resend email",
  "sign-in": "sign in",
  "title": "register",
  "verify-your-email": "Verify your email",
  "verify-your-email-to-activate-your-account": "You will need to verify your email to activate your account.",
  "welcome": "Welcome to OCUS"
}