{
  "confirm": "Confirm",
  "created-at": "created at",
  "created-by": "created by",
  "export": "Export",
  "file": "templates file",
  "language": "Language",
  "records-none": "no matching records",
  "select-loading-text": "Loading",
  "select-no-data-text": "No data",
  "select-no-match-text": "No matching data",
  "state-failed": "failed",
  "state-pending": "pending",
  "state-success": "success",
  "status": "status",
  "success": "Import succeed",
  "title": "Import/Export translations",
  "untranslated": "Only untranslated",
  "upload-file": "Upload your completed file"
}