{
  "delete": "Usuń",
  "missioncard": {
    "add-mission": "Dodaj zlecenie",
    "base-remuneration": "Podstawowe odszkodowanie",
    "remaining-time": "Pozostały czas",
    "see-mission-details": "Patrz szczegóły zlecenia"
  },
  "or": "Lub",
  "remove-from-cart": "Usuń z koszyka",
  "timezone-delta-tooltip": {
    "your-time-zone": "Twoja strefa czasowa:"
  },
  "upload": {
    "move-files-here": "Przenieś pliki tutaj.",
    "select-files": "wybierz pliki",
    "upload-file": "Prześlij plik"
  }
}