{
  "address": "Indirizzo",
  "awaiting-upload": "In attesa di caricamento",
  "billing-info": "BILLING INFORMATION",
  "change-currency": "Cambia valuta",
  "change-invoicing-method": "Modifica metodo",
  "continue-registration": "Continua la registrazione su Payoneer",
  "exempt": "Ritenuta fiscale",
  "exempt-no": "No",
  "exempt-update": "Aggiorna",
  "exempt-yes": "Sì",
  "invoicing-method": "INVOICING METHOD",
  "invoicing-method-automatic": "OCUS può generare automaticamente la mia fattura per gli incarichi completati",
  "invoicing-method-manual": "Voglio sempre caricare manualmente le mie fatture. (L'elaborazione richiederà più tempo a causa della verifica della fattura da parte del team di contabilità di OCUS)",
  "legal": "Aggiorna le tue informazioni legali",
  "missing-payments-info": "Informazioni di pagamento mancanti",
  "payment-info": "PAYMENT INFORMATION",
  "payoneer-account": "conto Payoneer",
  "payoneer-edit": "Modifica informazioni Payoneer",
  "payoneer-manage": "I tuoi dati di pagamento sono gestiti tramite il tuo",
  "payoneer-need-changes": "Modifica i tuoi dati di pagamento",
  "payoneer-register": "Registrati a Payoneer",
  "payoneer-registered": "In attesa della convalida di Payoneer",
  "status": "STATUS",
  "title": "status",
  "update": "Aggiorna lo status",
  "update-payments-info": "Aggiorna le informazioni di pagamento"
}