{
  "support-modal-trigger": {
    "ask-for-help": "Zapytaj o pomoc",
    "changes-ok": "Zmiany zostały zapisane",
    "claim-cancellation-fees": "Chcę zażądać opłat za anulowanie",
    "claim-reshedule-fee": "Chcę zażądać opłaty za zmianę terminu",
    "confirm": "Potwierdzać",
    "date": "Data zlecenia",
    "date-required": "Wymagana jest prawidłowa data",
    "go-help-center": "Przejdź do Centrum pomocy",
    "help-center": "Centrum pomocy",
    "leave-comment": "Zostaw dodatkowy komentarz",
    "mission-time": "Godzina",
    "please-use-help-center": "Jeśli chcesz się z nami skontaktować, użyj widżetu Centrum pomocy.",
    "return": "powrót",
    "use-help-center": "Jeśli chcesz się z nami skontaktować, użyj widżetu Centrum pomocy."
  }
}