{
  "content": "Nous avons besoin que vous soyez prêt pour le reportage.\n            Lisez le brief pour savoir ce que vous devrez faire.",
  "section-label": "Lire le brief",
  "section-link-label": "Voir"
}