{
  "breadcrumb": {
    "home": "ទំព័រដើម"
  },
  "filters": {
    "date-input": "រើសកាលបរិច្ឆេទ",
    "dates": "កាលបរិច្ឆេទ",
    "distance": "ចម្ងាយ",
    "mission-type": "ប្រភេទការងារ"
  },
  "header-logged": {
    "cart": "រទេះ",
    "find-mission": "ស្វែងរកការងារ",
    "home": "ទំព័រដើម",
    "invoicing": "ការចេញវិក្កយបត្រ",
    "legal": "ស្របច្បាប់",
    "logout": "ឡកចេញ",
    "medias-upload": "ការដាក់បញ្ចូលមេឌៀ",
    "missions": "ការងាររបស់ខ្ញុំ",
    "profile": "ប្រូហ្វាល់",
    "select-language": "ជ្រើសរើសភាសា"
  },
  "map-mission": {
    "hide-filters": "លាក់តម្រង",
    "hide-mission": "លាក់ការងារ",
    "mission-selected": "ការងារដែលបានជ្រើសរើស",
    "search-mission": "ស្វែងរកការងារ",
    "show-filters": "បង្ហាញតម្រង",
    "show-missions": "បង្ហាញការងារ",
    "total-estimated": "ប៉ាន់ស្មានសរុប",
    "validate-selection": "ផ្ទៀងផ្ទាត់ការជ្រើសរើសរបស់អ្នក"
  },
  "payoneer-modal": {
    "cta": "រំលឹកខ្ញុំពេលក្រោយ",
    "cta-2": "ចុះឈ្មោះឥឡូវនេះ",
    "description": "យើង​កំពុងតែប្តូរ​​អ្នកផ្តល់សេវា\n        បង់ប្រាក់ ដូច្នេះហើយ​ការ​បង់​ប្រាក់ជូនអ្នកមានលឿនជាង និង​ងាយស្រួលជាង​សម្រាប់​អ្នកគ្រប់គ្នា​ដែលពាក់ព័ន្ធ!​",
    "description-2": "គ្រប់យ៉ាងដែលអ្នកត្រូវ​ធ្វើ​គឺចុះឈ្មោះជាមួយ​នឹង\n      Payoneer ។ យើងចាត់ចែងការងារដែលនៅសល់។",
    "title": "ព័ត៌មាន​ដ៏រំភើបចិត្ត!"
  },
  "user-menu": {
    "billing": "ការចេញវិក្កយបត្រនិងការទូទាត់",
    "help": "មណ្ឌលជំនួយ",
    "logout": "ឡកចេញ",
    "profile": "ប្រូហ្វាល់",
    "select-language": "ជ្រើសរើសភាសា"
  }
}