{
  "back-to-login": "กลับไปที่ล็อกอิน",
  "confirmation": "การยืนยัน",
  "password-reset-confirmation": "รีเซ็ตรหัสผ่านของคุณแล้ว",
  "password-reset-subtitle": "ตรวจสอบอีเมลของคุณและสร้างรหัสผ่านใหม่",
  "password-reset-title": "รีเซ็ตรหัสผ่านแล้ว"
}