{
  "add-contact": "เพิ่มผู้ติดต่อใหม่",
  "Additional-contact": "ผู้ติดต่อเพิ่มเติม",
  "button-label-back": "ย้อนกลับ",
  "button-label-next": "ถัดไป",
  "form-email": "อีเมล",
  "form-firstname": "ชื่อ",
  "form-lastname": "นามสกุล",
  "form-locale": "ภาษา",
  "form-phone": "โทรศัพท์",
  "form.email.add": "เพิ่มอีเมล",
  "form.email.error": "อีเมลต้องถูกต้อง",
  "form.firstname.add": "เพิ่มชื่อผู้ติดต่อ",
  "form.lastname.add": "เพิ่มนามสกุลผู้ติดต่อ",
  "primary-contact": "ผู้ติดต่อหลัก",
  "remove-contact": "ลบผู้ติดต่อ",
  "secondary-contact": "ผู้ติดต่อรอง",
  "sub-title": "ตรวจสอบรายละเอียดผู้ติดต่อของคุณ",
  "tertiary-contact": "ผู้ติดต่อลำดับที่สาม",
  "title": "รายละเอียดผู้ติดต่อของคุณ"
}