{
  "error-occured": "出错了",
  "limit-reached": "已达到上限！",
  "limit-reached (previousy important)": "已达到上限！",
  "missions-limit (previously missions-limit-reached)": "每天最多可分配 {{count}} 个新任务。",
  "missions-limit-wait": "请明天再来添加更多任务。",
  "welcome": "欢迎"
}