{
  "review": "Überprüfen Sie Ihre Angaben",
  "started": "Los geht's",
  "step-1.click": "Klicken Sie auf",
  "step-1.then": "Bestätigen oder aktualisieren Sie anschließend Ihre Angaben und lesen Sie die Richtlinie",
  "step-2": "Bereiten Sie Ihre ausgewählten Gerichte am Tag des Fotoshootings zu und begrüßen Sie den Fotografen",
  "step-3": "Loggen Sie sich in Ihr {{organization}}-Konto ein, um sich die veröffentlichten Fotos anzusehen und beobachten Sie, wie Ihre Bestellungen ansteigen"
}