{
  "email": "email",
  "firstname": "firstname",
  "id": "ID",
  "lastname": "lastname",
  "records-none": "no matching records",
  "select-loading-text": "Loading",
  "select-no-data-text": "No data",
  "select-no-match-text": "No matching data",
  "state-country": "Country",
  "state-disabled": "disable",
  "state-enabled": "enable",
  "state-label": "state",
  "title": "Image creator"
}