{
  "review": "Reveja as suas informações",
  "started": "Vamos começar",
  "step-1.click": "Clique em",
  "step-1.then": "e, em seguida, confirme ou atualize as suas informações e leia as diretrizes",
  "step-2": "No dia da sessão fotográfica, prepare os pratos selecionados e dê as boas-vindas ao fotógrafo",
  "step-3": "Verifique a sua conta da {{organization}} para ver as fotografias publicadas e o aumento das encomendas"
}