{
  "breadcrumb": {
    "home": "หน้าหลัก"
  },
  "filters": {
    "date-input": "เลือกวันที่",
    "dates": "วันที่",
    "distance": "ระยะทาง",
    "mission-type": "ประเภทงาน"
  },
  "header-logged": {
    "api-credentials": "ข้อมูลประจำตัว API",
    "cart": "ตะกร้า",
    "create-mission": "งานตามคำสั่งซื้อ",
    "find-mission": "ค้นหางาน",
    "home": "หน้าหลัก",
    "invoicing": "การออกใบแจ้งหนี้",
    "legal": "กฎหมาย",
    "logout": "ล็อกเอาต์",
    "medias-upload": "การอัปโหลดมีเดีย",
    "menu-help": "ศูนย์ช่วยเหลือ",
    "missions": "งานของฉัน",
    "organizations": "องค์กร",
    "profile": "โปรไฟล์",
    "select-language": "เลือกภาษาของคุณ"
  },
  "map-mission": {
    "hide-filters": "ซ่อนตัวกรอง",
    "hide-mission": "ซ่อนงาน",
    "mission-selected": "งานที่เลือก",
    "search-mission": "ค้นหางาน",
    "show-filters": "แสดงตัวกรอง",
    "show-missions": "แสดงงาน",
    "total-estimated": "ทั้งหมดโดยประมาณ",
    "validate-selection": "ตรวจสอบการเลือกของคุณ"
  },
  "payoneer-modal": {
    "cta": "เตือนฉันภายหลัง",
    "cta-2": "ลงทะเบียนทันที",
    "description": "เรากำลังเปลี่ยนผู้ให้บริการ\n        การชำระเงิน เพื่อให้การจ่ายเงินให้คุณเร็วขึ้นและง่ายขึ้น สำหรับทุกคนที่เกี่ยวข้อง!",
    "description-2": "สิ่งที่คุณต้องทำคือลงทะเบียนกับ\n      Payoneer เราจะจัดการกับส่วนที่เหลือเอง",
    "title": "ข่าวน่าตื่นเต้น!"
  },
  "user-menu": {
    "billing": "การเรียกเก็บเงินและการชำระเงิน",
    "help": "ศูนย์ช่วยเหลือ",
    "logout": "ล็อกเอาต์",
    "profile": "โปรไฟล์",
    "select-language": "เลือกภาษาของคุณ"
  }
}