{
  "back": "Kembali",
  "precise-reason": "Sila perincikan sebab",
  "reasons": "Untuk membantu kami meningkatkan perkhidmatan kami, sila pilih sebab.",
  "reasons_ESTABLISHMENT_CLOSED": "Tempat saya ditutup buat selama-lamanya",
  "reasons_GUIDELINES": "Saya tidak bersetuju dengan garis panduan",
  "reasons_HAS_PICTURES": "Saya sudah mempunyai foto",
  "reasons_MISC": "Lain-lain",
  "reasons_NOT_INTERESTED": "Saya tidak berminat",
  "reasons_PARTNER_ISSUE": "Saya ada masalah dengan gandingan",
  "reasons_PARTNERSHIP_ENDED": "Gandingan saya berakhir",
  "reasons-select": "Pilih sebab",
  "submit": "Serah",
  "title": "Anda akan menolak sesi foto anda"
}