{
  "content": "Precisamos que tenha tudo pronto para a sessão fotográfica.\n            Leia as diretrizes para ver o que terá de fazer.",
  "section-label": "Verificar as diretrizes",
  "section-link-label": "Ver"
}