{
  "create-step1": {
    "self-employed": "Jsem osoba samostatně výdělečně činná",
    "status-update": "Aktualizace vašeho stavu odstraní všechny předchozí právní informace"
  },
  "create-step2": {
    "default-status": "Fotograf",
    "other": "jiný"
  },
  "create-step3": {
    "address-label": "Jaká je vaše fakturační adresa?",
    "address-tooltip": "Vaše adresa",
    "Attestation de vigilance-tooltip": "Vaše osvědčení o ostražitosti",
    "Attestation Urssaf-tooltip": "Vaše osvědčení Urssaf",
    "Attestation-tooltip": "Vaše potvrzení",
    "Carta d'identità-tooltip": "Váš občanský průkaz",
    "Carte d'identité-tooltip": "Váš občanský průkaz",
    "Certificate-tooltip": "Váš certifikát",
    "ID legale-tooltip": "Vaše identifikační číslo",
    "Identifiant légal-tooltip": "Váš identifikační légal",
    "Justificatif légal-tooltip": "Vaše právní odůvodnění",
    "Kbis-tooltip": "Vaše Kbis",
    "Legal document-tooltip": "Občanský průkaz",
    "siret-tooltip": "Vaše firemní ID",
    "upload": "Nahrajte svůj {{documentName}}",
    "vat-label": "KÁĎ %",
    "vat-placeholder": "Vybrat"
  },
  "create-stepper": {
    "error-saving-status": "při ukládání stavu došlo k chybě",
    "headline": "Váš pracovní status"
  },
  "legal-edit-modal": {
    "change-status": "Změnil jsem svůj stav",
    "not-specified": "nespecifikováno",
    "save-and-close": "Uložit a zavřít",
    "status": "Aktualizace stavu",
    "upload": "Nahrajte svůj {{documentName}}"
  }
}