{
  "or": "Или",
  "timezone-delta-tooltip": {
    "your-time-zone": "Вашата часова зона:"
  },
  "upload": {
    "move-files-here": "Преместване на файлове тук.",
    "select-files": "изберете файлове",
    "upload-file": "Качи файл"
  }
}