{
  "checkout": "Pasar por caja",
  "create-mission": "Asignación de pedidos",
  "filter-blockers": "Bloqueadores",
  "filter-organization": "Organización",
  "filter-search": "Buscar",
  "missions": "Asignaciones",
  "table-header-mission-adresse": "Dirección",
  "table-header-mission-date": "Fecha de la tarea",
  "table-header-mission-id": "ID de la tarea",
  "table-header-mission-name": "Nombre de la tarea",
  "table-header-mission-ordered": "Fecha del pedido",
  "table-header-mission-status": "Estado",
  "title": "Mis tareas"
}