{
  "address-input": {
    "input-address-invalid-meta": "Geçersiz adres, lütfen önerilerden bir değer seçin",
    "input-map-address-invalid-meta": "Öneriler listesinden bir adres seçin veya haritayı tıklayın",
    "label": "Adresi yazın veya haritadaki bir konumu tıklayın"
  },
  "form": {
    "cancel": "İptal etmek",
    "submit": "Sunmak"
  },
  "help-center": {
    "cta": "Yardım merkezini ziyaret edin",
    "help": "Yardım Merkezi",
    "help-desc": "Yardım merkezinde yanıt bulun veya doğrudan OCUS ekibiyle iletişime geçin",
    "need-help": "Yardıma mı ihtiyacınız var?"
  },
  "input-mixins": {
    "validation-phone": "Geçersiz telefon numarası",
    "validation-required": "input-mixins.validation-gerekli"
  },
  "stepper": {
    "submit": "Sunmak"
  },
  "welcome-modal": {
    "confirm": "Maceraya başlayın",
    "welcome": "Hoşgeldiniz"
  }
}