{
  "address-input": {
    "input-address-invalid-meta": "လိပ်စာမမှန်ကန်ပါ၊ အကြံပြုထားသည်များမှ တန်ဖိုးတစ်ခုကို ရွေးပါ",
    "input-map-address-invalid-meta": "အကြံပြုစာရင်းမှ လိပ်စာတစ်ခုကို ရွေးပါ သို့မဟုတ် မြေပုံပေါ် နှိပ်ပါ",
    "label": "လိပ်စာ ရိုက်ပါ (သို့) မြေပုံပေါ်ရှိ တည်နေရာကို နှိပ်ပါ"
  },
  "coachmark": {
    "text": "သင့်ကီးဘုတ်ရှိ enter ကိုနှိပ်၍ စိတ်ကြိုက်တစ်ခုကို ဖန်တီးနိုင်သည်။",
    "title": "လမ်းညွှန်ထားသော မီဒီယာအမည်ပြောင်းခြင်း"
  },
  "drop-zone": {
    "drop": "ဤနေရာတွင် မီဒီယာ ထည့်ပါ သို့မဟုတ်",
    "formats": "(အောက်ပါဖော်မက်တစ်ခုခုကို အပ်လုဒ်လုပ်ပါ- jpeg၊ mov၊ mp4)",
    "nodrop": "မီဒီယာအသစ်မတင်မီလက်ရှိအပ်လုဒ်ပြီးဆုံးရန်စောင့်ပါ။",
    "upload": "ဖိုင် အပ်လုဒ်လုပ်ရန်"
  },
  "file-input": {
    "file-too-big": "ဖိုင် အရွယ်အစား ကျော်လွန်သည်",
    "file-upload": "ဖိုင်အပ်လုဒ် မအောင်မြင်ပါ",
    "required-value": "ဖြည့်ရန်လိုအပ်သည်"
  },
  "form": {
    "cancel": "ပယ်ဖျက်ရန်",
    "submit": "ပေးပို့ရန်"
  },
  "header-drop-zone": {
    "expected-media": "မျှော်လင့်ထားသော မီဒီယာ",
    "media-refused": "မီဒီယာ ငြင်းပယ်ထားသည်",
    "optional": "ချန်ထားနိုင်သည်",
    "plus": "အပေါင်း"
  },
  "help-center": {
    "cta": "ကူညီရေးဌာနသို့ ဝင်ကြည့်ရန်",
    "help": "ကူညီရေးဌာန",
    "help-desc": "ကူညီရေးဌာနတွင် အဖြေများ ရှာဖွေပါ သို့မဟုတ် OCUS အဖွဲ့နှင့် တိုက်ရိုက်ဆက်သွယ်ပါ",
    "need-help": "အကူအညီ လိုသလား။"
  },
  "input-mixins": {
    "validation-phone": "ဖုန်းနံပါတ် မမှန်ကန်ပါ",
    "validation-required": "input-mixins.validation-required"
  },
  "invoice-status-mapping": {
    "pending-status": "စိစစ်နေဆဲ",
    "pending-to-pay": "ငွေပေးချေမှု လုပ်ဆောင်ဆဲ"
  },
  "leave": {
    "dialog-content": "အပ်လုဒ်လုပ်ထားသောပုံများကို သိမ်းမည်ဖြစ်ပြီး သင်က OCUS သို့ နောင်တွင် ပို့နိုင်ပါမည်။",
    "dialog-leave": "ဤစာမျက်နှာမှ ထွက်ရန်",
    "dialog-stay": "ဤစာမျက်နှာတွင် ဆက်နေရန်",
    "dialog-title": "သင်သည် လက်ရှိအပ်လုဒ်မှ ထွက်ပါတော့မည်။ မီဒီယာကို OCUS သို့ မပေးပို့ရသေးပါ။"
  },
  "media-card": {
    "delete": "ဖျက်ရန်",
    "filename": "မူရင်း ဖိုင်အမည်",
    "menu-error": "မီဒီယာမီနူးအမျိုးအမည်ကို သတ်မှတ်စဉ် အမှား",
    "name-is-empty": "ဖိုင်အမည်က အလွတ်ဖြစ်နေသည်",
    "no-preview": "ဤဖိုင်အမျိုးအစားကို အစမ်းကြည့်၍ မရပါ",
    "refused": "ငြင်းပယ်ထားသည်",
    "reload": "ပြန်လည်ဖွင့်ရန်",
    "renaming-error": "မီဒီယာကို အမည်ပြောင်းစဉ် အမှား",
    "select-button": "စိတ်ကြိုက်အဖြစ် ထည့်ရန်",
    "select-placeholder": "အမည်ကို ရွေးပါ သို့မဟုတ် ရိုက်ထည့်ပါ"
  },
  "media-upload-service": {
    "fatal-error": "မီဒီယာကို အပ်လုဒ်မလုပ်နိုင်ပါ",
    "no-access": "ဤဖိုင်အပ်လုဒ်လုပ်ခွင့် မရှိပါ",
    "no-media-available": "အများဆုံးအပ်လုဒ် ပြည့်သွားပါပြီ",
    "to-much-file-error": "ဤမျှများပြားသောမီဒီယာကို မပို့နိုင်ပါ"
  },
  "medias-counter": {
    "optional": "ချန်ထားနိုင်သည်",
    "total-media-uploaded": "အပ်လုဒ်လုပ်ထားသော မီဒီယာ စုစုပေါင်း"
  },
  "mission-address": {
    "tooltip": "ဤလိပ်စာကို အတိအကျ သတ်မှတ်၍မရပါ။\n              ဆိုက်တွင်း အဆက်အသွယ်ဖြင့် တည်နေရာကို အတည်ပြုပါ။"
  },
  "mission-card": {
    "action-required": "လုပ်ဆောင်ချက်လိုအပ်သည်- ပေးပို့မှုပြဿနာ",
    "call-issue": "မရောက်ရှိနိုင်ပါ",
    "guidelines": "လမ်းညွှန်ချက်များနှင့် ပတ်သက်၍ ပြဿနာ",
    "missing-info": "ဆက်သွယ်ရန်အချက်အလက်က မမှန်ကန်ပါ",
    "refusal": "အလုပ်တာဝန်",
    "set-date-later": "သတိပေးချက်",
    "tooltip": "သင်၏ ဒေသစံတော်ချိန်"
  },
  "mission-informations": {
    "tooltip-text": "တာဝန်စာမျက်နှာသို့ သွားရန်"
  },
  "mission-table": {
    "table-head-address": "လိပ်စာ",
    "table-head-date": "ရက်စွဲ",
    "table-head-id": "အလုပ်တာဝန် ID",
    "table-head-name": "အလုပ်တာဝန်အမည်",
    "table-head-pack": "ပက်ကေ့ဂျ်",
    "table-head-state": "ပြည်နယ်",
    "table-head-status": "အခြေအနေ",
    "table-head-time-left": "ကျန်ရှိအချိန်"
  },
  "naming-alert": {
    "media-naming-content": "ပလက်ဖောင်းတွင် တိုက်ရိုက်အမည်ပြောင်းနိုင်သည်။",
    "media-naming-title": "မီဒီယာအမည်ပေးခြင်း"
  },
  "notification-upload": {
    "alert-error": "လွှဲပြောင်းမှုပြဿနာကြောင့် မီဒီယာကို အပ်လုဒ်မလုပ်ရသေးပါ",
    "alert-warning": "ပုံဖော်မက်က မှားနေသည်",
    "sucess-media-1": "မီဒီယာကို အောင်မြင်စွာ အပ်လုဒ်လုပ်ပြီးပြီ",
    "sucess-media-x": "အောင်မြင်စွာ အပ်လုဒ်လုပ်ထားသော မီဒီယာများ"
  },
  "renaming-alert": {
    "blocker-notified-by": "အသုံးပြုသူက အသိပေးထားသည်",
    "comment": "မှတ်ချက်",
    "desc": "အပ်လုဒ်အကွက်တွင် မီဒီယာအမည်ကို တည်းဖြတ်ခြင်းဖြင့် မီဒီယာအမည်ပြောင်းခြင်း ဆက်လက်လုပ်ဆောင်၍ ပြီးဆုံးပါက အတည်ပြုရန်ကို နှိပ်ပါ။",
    "subtitle": "မီဒီယာအမည်ပြောင်းခြင်းကို တောင်းဆိုထားသည်",
    "title": "ပေးပို့မှုပြဿနာ"
  },
  "reshoot-alert": {
    "description": "ချိန်းဆိုမှု ရက်စွဲအသစ်တစ်ခု စီစဉ်ပြီး ထပ်ဖြည့်ထားသော မီဒီယာကို ပံ့ပိုးပေးမှသာ ကျွန်ုပ်တို့က သင့်တာဝန်ကို စိစစ်အတည်ပြုနိုင်သည်",
    "subtitle": "ပေးပို့ထားသည့် မီဒီယာကို အရည်အသွေး ကြပ်မတ်ရေးဌာနက လေ့လာသုံးသပ်သည့်အခါ ပြဿနာအချို့ကို တွေ့ရှိထားသည်။",
    "title": "ပြန်လည်ရိုက်ကူးမှု တောင်းခံထားသည်"
  },
  "send": {
    "cancel": "ပယ်ဖျက်ရန်",
    "dialog-content": "မှန်ကန်ကြောင်း အတည်မပြုမီ မှတ်ချက်ရေးသားပါ",
    "minimum": "အနည်းဆုံးမျှော်လင့်ထားသော မီဒီယာ။",
    "missing-media-name": "မီဒီယာတွင် အမည်မပါလာပါ။",
    "missing-media-naming": "မီဒီယာအမည်ပေးခြင်း ပျောက်နေသည်",
    "missing-media-text": "မီဒီယာတစ်ခုစီတိုင်းအတွက် မီနူးစာရင်းရှိ အမည်ကိုရွေးပါ။\n          သက်ဆိုင်ရာအမျိုးအမည်ကို မတွေ့ပါက အမည်ကိုရိုက်ထည့်ပြီး\n            သင့်ကီးဘုတ်ရှိ enter ကိုနှိပ်၍ စိတ်ကြိုက်တစ်ခုကို ဖန်တီးနိုင်သည်။",
    "no-send-title": "အပ်လုဒ်လုပ်ရန်",
    "no-send-title-incomplete": "မပြည့်စုံသော အပ်လုဒ်",
    "ok": "အိုကေ",
    "out-of": "အနက်",
    "send": "ပို့ရန်",
    "send-anyway": "မည်သို့ပင်ဆိုစေ ပို့ရန်",
    "title": "သင်က မီဒီယာအားလုံးကို ပို့ပါတော့မည်",
    "title-incomplete": "သင်က မပြည့်စုံသောအပ်လုဒ်ကို ပို့ပါတော့မည်"
  },
  "status-bar": {
    "confirm-renaming": "အမည်ပြောင်းခြင်းကို အတည်ပြုပါ",
    "send-media": "မီဒီယာပို့ရန်"
  },
  "stepper": {
    "submit": "ပေးပို့ရန်"
  },
  "welcome-modal": {
    "confirm": "စွန့်စားခန်း စတင်ပါ",
    "desc-1": "ဒီဇိုင်းသစ်၊ ဝန်ဆောင်မှုသစ်များ­",
    "desc-2": "OCUS သည် သင့်ပလက်ဖောင်းကို အဆင့်မြှင့်နေသည်။",
    "drag-drop": "သင့်မီဒီယာကို အမြန် အပ်လုဒ်လုပ်ရန် ဆွဲပြီးထည့်ပါ",
    "enjoy": "OCUS ကို အဆင်ပြေလွယ်ကူစွာ သုံးစွဲပါ",
    "general": "အထွေထွေ သတ်မှတ်ချက်များ",
    "more": "နောက်ထပ် လာပါဦးမည်။",
    "new-map": "သင့်တာဝန်ကို ပိုမြန်ဆန်စွာ ရှာနိုင်မည့် မြေပုံသစ်",
    "stats": "သင့်တိုးတက်မှုကို ပိုများပြားသော ကိန်းဂဏန်းများဖြင့် ခြေရာခံခြင်း",
    "subtitle": "ရောက်လာတော့မည်။",
    "terms": "ကျွန်ုပ် ဖတ်ရှုပြီး လက်ခံပါသည်",
    "title": "တစ်စုံတစ်ခု",
    "welcome": "OCUS ပလက်ဖောင်းအသစ်က",
    "welcome-2": "ကြိုဆိုပါသည်"
  }
}