{
  "address-input": {
    "input-address-invalid-meta": "អាសយដ្ឋានមិនត្រឺមត្រូវ សូមជ្រើសរើសតម្លៃពីការណែនាំ",
    "input-map-address-invalid-meta": "សូមជ្រើសរើសអាសយដ្ឋានពីបញ្ជីនៃការណែនាំ ឬចុចនៅលើផែនទី",
    "label": "វាយបញ្ចូលអាសយដ្ឋាន​ឬក៏ចុចលើទីតាំង​ក្នុងផែនទី"
  },
  "all-search-filter": {
    "date-label": "ជួរនៃកាលបរិច្ឆេទ",
    "loading": "កំពុងផ្ទុក",
    "no-result": "គ្មានលទ្ធផល",
    "organization-label": "ការរៀបចំ",
    "others": "ផ្សេងទៀត",
    "state-label": "សភាព"
  },
  "blocker-alert": {
    "and-send": "ហើយចុចផ្ញើមេឌាទាំងអស់ ។ ប្រសិនបើ​អ្នក​មិន​​មាន​មេឌា​បន្ថែមទេនោះ ចូរ​ប្រាប់ឱ្យ​យើង​ដឹង៖",
    "comment": "មតិយោបល់",
    "notify": "ផ្តល់ដំណឹង​ជូន​យើង​"
  },
  "coachmark": {
    "text": "ប្ដូរ​ធាតុ​​តាមតម្រូវការ​​ដោយវាយឈ្មោះ ហើយចុច enter នៅលើក្តារចុចរបស់អ្នក ។",
    "title": "ការណែនាំក្នុងការប្តូរឈ្មោះមេឌា"
  },
  "drop-zone": {
    "drop": "ទម្លាក់មេឌានៅទីនេះ ឬ",
    "formats": "(សូមអាប់ឡូតទម្រង់ណាមួយខាងក្រោម៖ jpeg, mov, mp4)",
    "nodrop": "សូមរង់ចាំការទាញយកបច្ចុប្បន្នត្រូវបានបញ្ចប់មុនពេលផ្ទុកប្រព័ន្ធផ្សព្វផ្សាយថ្មី។",
    "upload": "អាប់ឡូតឯកសារ"
  },
  "file-input": {
    "file-too-big": "ទំហំឯកសារលើសកំណត់",
    "file-upload": "ការអាប់ឡូតឯកសារមិនបានជោគជ័យ",
    "required-value": "ទាមទារ"
  },
  "form": {
    "cancel": "បោះបង់",
    "submit": "ផ្ញើរចេញ"
  },
  "header-drop-zone": {
    "expected-media": "មេឌាដែលរំពឹងថាមាន",
    "media-refused": "មេឌាដែលត្រូវបានបដិសេធ",
    "optional": "ជម្រើស",
    "plus": "បូកបន្ថែម"
  },
  "help-center": {
    "cta": "ចូលទៅកាន់មជ្ឈមណ្ឌលជំនួយ",
    "help": "មជ្ឈមណ្ឌលជំនួយ",
    "help-desc": "ស្វែងរកចម្លើយនៅក្នុងមជ្ឈមណ្ឌលជំនួយ ឬទាក់ទងដោយផ្ទាល់ជាមួយក្រុមការងារ OCUS",
    "need-help": "ត្រូវការជំនួយ?"
  },
  "input-mixins": {
    "validation-phone": "លេខទូរសព្ទមិនត្រឹមត្រូវ",
    "validation-required": "input-mixins.validation-required"
  },
  "invoice-status-mapping": {
    "pending-status": "ស្ថិតក្រោមការពិនិត្យឡើងវិញ",
    "pending-to-pay": "ការទូទាត់កំពុងដំណើរការ"
  },
  "leave": {
    "dialog-content": "រូបភាពដែលបានអាប់ឡូតនឹងត្រូវបានរក្សាទុក ហើយអ្នកនឹងអាចផ្ញើរូបភាពទាំងនោះទៅ OCUS នៅពេលក្រោយ ។",
    "dialog-leave": "ចាកចេញពីទំព័រនេះ",
    "dialog-stay": "បន្តនៅលើទំព័រនេះ",
    "dialog-title": "អ្នកហៀបនឹងចាកចេញពីការអាប់ឡូតបច្ចុប្បន្ននេះ ។ មិនទាន់បានផ្ញើមេឌាទៅ OCUS នៅឡើយទេ ។"
  },
  "media-card": {
    "delete": "លុបចោល",
    "filename": "ឈ្មោះឯកសារដើម",
    "menu-error": "មានបញ្ហាពេល​កំណត់ធាតុ​ក្នុង​មឺនុយមេឌា",
    "name-is-empty": "ឈ្មោះឯកសារគឺទទេ",
    "no-preview": "មិនមានការមើលជាមុនសម្រាប់ប្រភេទឯកសារនេះទេ",
    "refused": "បានបដិសេធ",
    "reload": "ផ្ទុកឡើងវិញ",
    "renaming-error": "មានបញ្ហា​ពេល​ប្តូរឈ្មោះមេឌា",
    "select-button": "បន្ថែមការប្ដូរតាមតម្រូវការ",
    "select-placeholder": "ជ្រើសរើស ឬវាយឈ្មោះ"
  },
  "media-upload-service": {
    "fatal-error": "មិនអាចអាប់ឡូតមេឌាបាន",
    "no-access": "មិនមានសិទ្ធិដើម្បីចូល​អាប់ឡូតឯកសារនេះទេ",
    "no-media-available": "ការអាប់ឡូតឈានដល់កម្រិតអតិបរមា",
    "to-much-file-error": "មិនអាចផ្ញើមេឌាច្រើនដូចនេះទេ"
  },
  "medias-counter": {
    "optional": "ជម្រើស",
    "total-media-uploaded": "មេឌាសរុបដែលបានអាប់ឡូត"
  },
  "mission-address": {
    "tooltip": "មិនអាចបង្កើតអាសយដ្ឋានត្រឹមត្រូវបានទេ។\n              សូមបញ្ជាក់ទីតាំងជាមួយទំនាក់ទំនងនៅនឹងកន្លែង។"
  },
  "mission-card": {
    "action-required": "សកម្មភាពត្រូវបានទាមទារ៖ បញ្ហានៃការផ្ញើចេញ",
    "call-issue": "មិនអាចទៅដល់",
    "guidelines": "បញ្ហាជាមួយគោលការណ៍ណែនាំ",
    "missing-info": "ព័ត៌មានទំនាក់ទំនងលម្អិតមិនត្រឹមត្រូវ",
    "refusal": "ទំនាក់ទំនងនៅនឹងកន្លែងបដិសេធមិនទទួលការងារ",
    "set-date-later": "ការរំលឹក",
    "tooltip": "ម៉ោងក្នុងស្រុករបស់អ្នក"
  },
  "mission-informations": {
    "tooltip-text": "សូមទៅកាន់ទំព័រកិច្ចការ"
  },
  "mission-table": {
    "table-head-address": "អាសយដ្ឋាន",
    "table-head-date": "កាលបរិច្ឆេទ",
    "table-head-id": "លេខសម្គាល់ការងារ",
    "table-head-name": "ឈ្មោះការងារ",
    "table-head-pack": "កញ្ចប់",
    "table-head-state": "សភាព",
    "table-head-status": "ស្ថានភាព",
    "table-head-time-left": "ពេលដែលនៅសល់"
  },
  "naming-alert": {
    "media-naming-content": "ដោយផ្ទាល់នៅក្នុងវេទិកាមុនពេលផ្ញើពួកវា ។",
    "media-naming-title": "ការដាក់ឈ្មោះមេឌា"
  },
  "notification-upload": {
    "alert-error": "មិនទាន់បានអាប់ឡូតមេឌាទេ ដោយសារបញ្ហានៃការផ្ទេរ",
    "alert-warning": "ខុសទម្រង់រូបភាព",
    "sucess-media-1": "មេឌាត្រូវបានអាប់ឡូតដោយជោគជ័យ",
    "sucess-media-x": "មេឌាបានអាប់ឡូតដោយជោគជ័យ"
  },
  "notify": {
    "cancel": "បោះបង់",
    "content": "យើង​បាន​ស្នើសុំមេឌាបន្ថែម ព្រោះថា​ការអាប់ឡូតបច្ចុប្បន្ននេះមិនគួរ​ជាទីពេញចិត្តនោះទេ។",
    "explain": "សូម​ពន្យល់​ថាហេតុអ្វី​បាន​ជាអ្នក​មិន​បន្ត និង​ធ្វើការបញ្ជាក់។",
    "send": "ផ្ញើមតិយោបល់",
    "sent": "មតិយោបល់ត្រូវបានផ្ញើចេញដោយ​ជោគជ័យ",
    "sent-error": "បញ្ហា​ពេលកំពុងផ្ញើចេញមតិយោបល់",
    "title": "ផ្តល់ដំណឹង​ជូន​យើង​"
  },
  "rename-issue": {
    "blocker-notified-by": "(ជូនដំណឹងដោយអ្នកប្រើប្រាស់",
    "subtitle": "ការប្ដូរឈ្មោះមេឌាត្រូវ​​បានស្នើសុំ"
  },
  "renaming-alert": {
    "blocker-notified-by": "ជូនដំណឹងដោយអ្នកប្រើប្រាស់",
    "comment": "មតិយោបល់",
    "desc": "សូមបន្តទៅការប្តូរឈ្មោះមេឌាដោយកែតម្រូវឈ្មោះមេឌានៅក្នុងប្រអប់អាប់ឡូត ហើយចុចបញ្ជាក់នៅពេលអ្នករួចរាល់ ។",
    "subtitle": "ការប្ដូរឈ្មោះមេឌាបានស្នើសុំ",
    "title": "បញ្ហានៃការផ្ញើចេញ"
  },
  "reshoot-alert": {
    "description": "សូមរៀបចំកាលបរិច្ឆេទណាត់ជួបថ្មី និងផ្តល់មេឌាបន្ថែម ដើម្បីឱ្យយើងអាចធ្វើឱ្យកិច្ចការរបស់អ្នកមានសុពលភាព",
    "subtitle": "ការត្រួតពិនិត្យគុណភាពបានសម្គាល់ឃើញ​បញ្ហាមួយចំនួន នៅពេលពិនិត្យមេឌាដែលបានផ្ញើមក។",
    "title": "ការថតឡើងវិញត្រូវបានស្នើសុំ"
  },
  "send": {
    "cancel": "បោះបង់",
    "dialog-content": "សូមផ្ដល់មតិយោបល់ មុនពេលបញ្ជាក់ភាពត្រឹមត្រូវ​របស់វា",
    "minimum": "មេឌាថ្មីដែលរំពឹងថាមានអប្បបរមា",
    "missing-media-name": "មេឌាបាត់ឈ្មោះ។",
    "missing-media-naming": "បាត់ឈ្មោះមេឌា",
    "missing-media-text": "សូមជ្រើសរើសឈ្មោះនៅក្នុងបញ្ជីមឺនុយសម្រាប់មេឌានីមួយៗ។\n          ប្រសិនបើអ្នកមិនអាចរកឃើញធាតុដែលត្រូវគ្នា អ្នកអាចបង្កើតធាតុតាមតម្រូវការ​​ដោយវាយឈ្មោះ ហើយចុច enter នៅលើក្តារចុចរបស់អ្នក។",
    "no-send-title": "អាប់ឡូត",
    "no-send-title-incomplete": "អាប់ឡូតមិនពេញលេញ",
    "ok": "OK",
    "out-of": "ចេញពី",
    "send": "ផ្ញើ",
    "send-anyway": "ផ្ញើ ទោះយ៉ាងណាក៏ដោយ",
    "title": "អ្នកហៀបនឹងផ្ញើមេឌារបស់អ្នកទាំងអស់",
    "title-incomplete": "អ្នកហៀបនឹងផ្ញើការអាប់ឡូតដែលមិនពេញលេញ"
  },
  "status-bar": {
    "confirm-renaming": "បញ្ជាក់ការប្ដូរឈ្មោះ",
    "send-media": "ផ្ញើមេឌា"
  },
  "stepper": {
    "submit": "បញ្ជូន"
  },
  "welcome-modal": {
    "confirm": "ចាប់ផ្តើមដំណើរផ្សងព្រេង",
    "desc-1": "ការរចនាថ្មី លក្ខណៈពិសេសថ្មី៖",
    "desc-2": "OCUS កំពុង​​តែធ្វើ​ឱ្យ​វេទិការបស់អ្នក​កានតែប្រសើរឡើង!",
    "drag-drop": "ទាញ និងទម្លាក់ដើម្បីអាប់ឡូតមេឌារបស់អ្នកយ៉ាងឆាប់រហ័ស",
    "enjoy": "រីករាយ​នឹង​បទពិសោធរបស់ OCUS",
    "general": "លក្ខខណ្ឌទូទៅ",
    "more": "និង​​ច្រើនទៀត​ដែលនឹង​មក​ដល់!",
    "new-map": "ផែនទីថ្មីដើម្បីស្វែងរកកិច្ចការរបស់អ្នកលឿនជាងមុន",
    "stats": "តាមដានដំណើរការរបស់អ្នកជាមួយនឹងស្ថិតិច្រើនទៀត",
    "subtitle": "មកដល់ឆាប់ៗនេះ!",
    "terms": "ខ្ញុំបានអាន និងទទួលយក",
    "title": "អ្វីមួយ",
    "welcome": "ស្វាគមន៍មកកាន់",
    "welcome-2": "វេទិកា OCUS ថ្មី"
  }
}