{
  "or": "Nebo",
  "timezone-delta-tooltip": {
    "your-time-zone": "Vaše časové pásmo:"
  },
  "upload": {
    "move-files-here": "Přesuňte soubory sem.",
    "select-files": "vyberte soubory",
    "upload-file": "Nahrát soubor"
  }
}