{
  "btn.prepared": "Hazırlanın",
  "easy": "İşte bu kadar kolay:",
  "home.message": "Hoş fotoğraflar müşteri siparişlerini artırır, bu yüzden ÜCRETSİZ fotoğraf çekimine hazır olun!",
  "home.message-architecture": "Profesyonel görsellerle görünürlüğünüzü artırın, yapmanız gereken tek şey mekanı hazırlamak!",
  "home.message-default": "Bunu harika fotoğraflarla başarabilirsiniz! Fotoğraf çekiminizi hemen rezerve edin.",
  "home.message-food": "Lezzetli fotoğraflar müşteri siparişlerini artırır, bu yüzden ÜCRETSİZ fotoğraf çekiminize hazır olun!",
  "information": "Bilgileriniz",
  "not.need.photoshoot": "Fotoğraf çekimine ihtiyacım yok",
  "photoshoot.date": "Fotoğraf çekimi tarihi",
  "ready": "Görünürlüğünüzü artırmaya hazır mısınız?",
  "started": "Haydi Başlayalım",
  "title": "Ana Sayfa",
  "welcome": "Hoş Geldiniz!"
}