{
  "create": {
    "billing-manager": "賬單管理員",
    "email": "電郵",
    "firstname": "名字",
    "lastname": "姓氏",
    "member": "成員",
    "owner": "擁有人",
    "phone": "電話",
    "read-only": "僅限讀取",
    "role-label": "職責",
    "title": "新邀請"
  }
}