{
  "metered-password-input": {
    "password": "Votre mot de passe est trop simple à deviner.",
    "suggestion": "Ajoutez 1 ou 2 mots supplémentaires. Les mots non communs sont préférables.",
    "warning": "Ce mot de passe fait parti des 100 plus communs."
  }
}