{
  "address-input": {
    "input-address-invalid-meta": "Ungültige Adresse, bitte wählen Sie einen Wert aus den Vorschlägen aus.",
    "input-map-address-invalid-meta": "Wählen Sie eine Adresse aus der Liste mit Vorschlägen aus oder klicken Sie auf die Karte.",
    "label": "Geben Sie die Adresse ein oder klicken Sie auf einen Ort auf der Karte"
  },
  "all-search-filter": {
    "date-label": "Datumsbereich",
    "loading": "Wird geladen",
    "no-result": "Kein Ergebnis",
    "organization-label": "Organisation",
    "others": "Sonstiges",
    "state-label": "Bundesland"
  },
  "blocker-alert": {
    "and-send": "und drücken Sie „Alle Medien senden“. Wenn Sie über keine zusätzlichen Medien verfügen, teilen Sie uns dies bitte mit:",
    "comment": "Kommentar",
    "notify": "Benachrichtigen Sie uns"
  },
  "coachmark": {
    "text": "benutzerdefinierten Eintrag erstellen, in dem Sie den Namen eingeben und die Eingabetaste auf der Tastatur drücken.",
    "title": "Anleitung zum Umbenennen eines Mediums"
  },
  "drop-zone": {
    "drop": "Medien hier ablegen oder",
    "formats": "(Laden Sie eines der folgenden Formate hoch: jpeg, mov, mp4)",
    "nodrop": "Bitte warten Sie, bis der aktuelle Upload abgeschlossen ist, bevor Sie neue Medien hochladen.",
    "upload": "Datei hochladen"
  },
  "file-input": {
    "file-too-big": "Dateigröße überschritten",
    "file-upload": "Datei konnte nicht hochgeladen werden",
    "required-value": "erforderlich"
  },
  "form": {
    "cancel": "Abbrechen",
    "submit": "einreichen"
  },
  "header-drop-zone": {
    "expected-media": "Erwartetes Medium",
    "media-refused": "Medium abgelehnt",
    "optional": "Optional",
    "plus": "Plus"
  },
  "help-center": {
    "cta": "Hilfecenter besuchen",
    "help": "Hilfecenter",
    "help-desc": "Suchen Sie im Hilfecenter nach der Antwort oder wenden Sie sich direkt an das OCUS-Team.",
    "need-help": "Benötigen Sie Hilfe?"
  },
  "input-mixins": {
    "validation-phone": "Ungültige Telefonnummer",
    "validation-required": "Mixins eingeben. Validierung erforderlich"
  },
  "invoice-status-mapping": {
    "pending-status": "WIRD GEPRÜFT",
    "pending-to-pay": "ZAHLUNG WIRD BEARBEITET"
  },
  "leave": {
    "dialog-content": "Die hochgeladenen Bilder werden gespeichert und Sie können Sie später an OCUS senden.",
    "dialog-leave": "Diese Seite verlassen",
    "dialog-stay": "Auf dieser Seite bleiben",
    "dialog-title": "Sie sind im Begriff, den aktuellen Upload zu verlassen. Das Medium wurde noch nicht an OCUS gesendet."
  },
  "media-card": {
    "delete": "Löschen",
    "filename": "Ursprünglicher Dateiname",
    "menu-error": "Fehler beim Einstellen der Medienmenüoption",
    "name-is-empty": "Der Dateiname ist leer",
    "no-preview": "Für diesen Dateityp ist keine Vorschau verfügbar",
    "refused": "ABGELEHNT",
    "reload": "Neu laden",
    "renaming-error": "Fehler beim Umbenennen des Mediums",
    "select-button": "Als benutzerdefiniert hinzufügen",
    "select-placeholder": "Wählen Sie den Namen aus oder geben Sie ihn ein"
  },
  "media-upload-service": {
    "fatal-error": "Medien konnten nicht hochgeladen werden",
    "no-access": "Keine Berechtigung zum Hochladen dieser Datei",
    "no-media-available": "Maximale Uploadanzahl erreicht",
    "to-much-file-error": "So viele Medien können nicht gesendet werden"
  },
  "medias-counter": {
    "optional": "Optional",
    "total-media-uploaded": "Insgesamt hochgeladene Medien"
  },
  "mission-address": {
    "tooltip": "Die Adresse konnte nicht korrekt ermittelt werden.\n              Bitte bestätigen Sie den Ort mit dem Ansprechpartner vor Ort."
  },
  "mission-card": {
    "action-required": "Aktion erforderlich: Lieferproblem",
    "call-issue": "Nicht Erreichbar",
    "guidelines": "Problem mit Richtlinien",
    "missing-info": "Kontaktdaten sind nicht korrekt",
    "refusal": "Ansprechpartner vor Ort lehnt den Auftrag ab",
    "set-date-later": "Erinnerung",
    "tooltip": "Ihre Ortszeit"
  },
  "mission-informations": {
    "tooltip-text": "Zur Auftragsseite"
  },
  "mission-table": {
    "table-head-address": "Adresse",
    "table-head-date": "Datum",
    "table-head-id": "Auftrags-ID",
    "table-head-name": "Auftrags-Name",
    "table-head-pack": "Paket",
    "table-head-state": "Bundesland",
    "table-head-status": "Status",
    "table-head-time-left": "Verbleibende Zeit"
  },
  "naming-alert": {
    "media-naming-content": "vor dem Versenden direkt in der Plattform umbenennen.",
    "media-naming-title": "Benennung der Medien"
  },
  "notification-upload": {
    "alert-error": "Medien wurden aufgrund eines Übertragungsproblems nicht hochgeladen",
    "alert-warning": "Falsches Bildformat",
    "sucess-media-1": "Medium wurde erfolgreich hochgeladen",
    "sucess-media-x": "Medien wurden erfolgreich hochgeladen"
  },
  "notify": {
    "cancel": "Abbrechen",
    "content": "Wir haben zusätzliche Medien angefordert, da der aktuelle Upload nicht zufriedenstellend ist.",
    "explain": "Bitte erläutern Sie, warum Sie nicht fortfahren können und bestätigen Sie.",
    "send": "Kommentar senden",
    "sent": "Kommentar erfolgreich gesendet",
    "sent-error": "Problem beim Senden des Kommentars",
    "title": "Benachrichtigen Sie uns"
  },
  "rename-issue": {
    "blocker-notified-by": "( vom Benutzer benachrichtigt",
    "subtitle": "Umbenennung eines Mediums angefordert"
  },
  "renaming-alert": {
    "blocker-notified-by": "Vom Benutzer benachrichtigt",
    "comment": "Kommentar",
    "desc": "Fahren Sie bitte mit dem Umbenennen des Mediums fort, indem Sie den Namen des Mediums im Hochladekästchen ändern, und klicken Sie „Bestätigen“, wenn Sie damit fertig sind.",
    "subtitle": "Umbenennung eines Mediums angefordert",
    "title": "Lieferproblem"
  },
  "reshoot-alert": {
    "description": "Bitte vereinbaren Sie einen neuen Termin und stellen Sie zusätzliche Medien zur Verfügung, damit wir Ihren Auftrag bestätigen können.",
    "subtitle": "Die Qualitätskontrolle hat bei der Überprüfung der gelieferten Medien einige Probleme festgestellt.",
    "title": "Erneute Aufnahme angefordert"
  },
  "send": {
    "cancel": "Abbrechen",
    "dialog-content": "Hinterlassen Sie einen Kommentar, bevor Sie es validieren",
    "minimum": "Minimum an erwarteten Medien.",
    "missing-media-name": "Medien benötigen einen Namen.",
    "missing-media-naming": "Fehlende Benennung der Medien",
    "missing-media-text": "Bitte wählen Sie einen Namen aus der Menüliste für jedes Medium aus.\n          Wenn Sie kein entsprechendes Element finden, können Sie ein\n            benutzerdefiniertes erstellen, indem Sie den Namen eingeben und die\n            Eingabetaste auf Ihrer Tastatur drücken.",
    "no-send-title": "Hochladen",
    "no-send-title-incomplete": "Unvollständiger Upload",
    "ok": "OK",
    "out-of": "von",
    "send": "Senden",
    "send-anyway": "Trotzdem senden",
    "title": "Sie sind im Begriff, alle Medien zu senden",
    "title-incomplete": "Sie sind im Begriff, einen unvollständigen Upload zu senden"
  },
  "status-bar": {
    "confirm-renaming": "Umbenennen bestätigen",
    "send-media": "Medien senden"
  },
  "stepper": {
    "submit": "Senden"
  },
  "welcome-modal": {
    "confirm": "Starte das Abenteuer",
    "desc-1": "Neues Dashboard, neues Design, neue Funktionen:",
    "desc-2": "OCUS aktualisiert Ihre Plattform!",
    "drag-drop": "Drag-and-Drop nutzen, um Medien schnell hochzuladen",
    "enjoy": "Genießen Sie das OCUS-Erlebnis",
    "general": "die allgemeinen Bedingungen",
    "more": "Und noch mehr!",
    "new-map": "Eine neue Karte, um Ihren Auftrag schneller zu finden",
    "stats": "Verfolgen Sie Ihren Fortschritt mit mehr Statistiken",
    "subtitle": "kommt hoch!",
    "terms": "Ich habe gelesen und akzeptiert",
    "title": "Manche Dinge",
    "welcome": "Willkommen zu",
    "welcome-2": "die neue OCUS-Plattform"
  }
}