{
  "back": "Wstecz",
  "precise-reason": "Proszę podać powód",
  "reasons": "Aby pomóc nam w doskonaleniu naszych usług, wybierz powód.",
  "reasons_ESTABLISHMENT_CLOSED": "Mój obiekt jest zamknięty na stałe",
  "reasons_GUIDELINES": "Nie zgadzam się z wytycznymi",
  "reasons_HAS_PICTURES": "Mam już zdjęcia",
  "reasons_MISC": "Inny",
  "reasons_NOT_INTERESTED": "Nie jestem zainteresowany(-a)",
  "reasons_PARTNER_ISSUE": "Mam problem ze współpracą",
  "reasons_PARTNERSHIP_ENDED": "Moja współpraca zakończyła się",
  "reasons-select": "Wybierz powód",
  "submit": "Prześlij",
  "title": "Zamierzasz odrzucić sesję zdjęciową"
}