{
  "email-not-verified": "抱歉，验证您的电子邮件地址时出错。",
  "email-verified": "您的电子邮件地址已通过验证",
  "go-to-homepage": "转到主页",
  "resend-error": "发送验证电子邮件时发生错误",
  "resend-verification-email": "重新发送验证电子邮件",
  "try-another-account": "尝试使用另一个帐户",
  "you-are-connected-with": "您的联系方式是：{{email}}"
}