{
  "email": "Correo electrónico",
  "firstname": "Nombre",
  "lastname": "Apellidos",
  "records-none": "No hay registros coincidentes",
  "status-label": "Estado",
  "statuses-accepted": "Aceptada",
  "statuses-declined": "Rechazada",
  "statuses-pending": "Pendiente"
}