{
  "404-cta-back": "Zpět",
  "404-cta-home": "Přejít na domovskou stránku",
  "404-description": "Stránka se také mohla přesunout na jiné místo nebo je momentálně nedostupná.",
  "404-title": "Jejda! Stránka, kterou hledáte, zatím neexistuje.",
  "error": "Došlo k chybě."
}