{
  "cart-summary": {
    "checkout": "Pokladna",
    "confirm-delete-mission": "Vaše zakázka bude zrušena.",
    "confirm-delete-title": "Zrušení zakázky",
    "delete-mission-cancel-button": "Zrušit",
    "delete-mission-confirm-button": "Potvrdit",
    "no-mission": "Zatím nemáte žádnou nevyřízenou zakázku.",
    "no-mission-link": "Vytvořit objednávku",
    "order-error": "Při vytváření objednávky došlo k chybě.",
    "order-in-progress": "Probíhá platba",
    "other-mission": "Přidat další zakázku",
    "select-all": "Vybrat vše"
  }
}