{
  "back-to-login": "Powrót do logowania",
  "confirmation": "Potwierdzenie",
  "password-request-confirmation": "Dziękujemy! Jeśli ten adres e-mail znajduje się w naszych archiwach, otrzymasz wiadomość e-mail umożliwiającą zresetowanie hasła",
  "password-reset-request-subtitle": "Potwierdź swój adres e-mail, aby otrzymać wiadomość e-mail umożliwiającą zresetowanie hasła",
  "password-reset-title": "Resetowanie hasła"
}