{
  "address": "住所",
  "address-missing": "住所がありません",
  "general": "個人情報",
  "languages": "対応言語",
  "languages-update": "言語を変更",
  "password": "パスワード",
  "phone": "電話番号",
  "phone-update": "電話番号の編集",
  "profile-title": "プロフィール変更",
  "resume": "経歴",
  "skills": "スキル",
  "unverified": "未承認",
  "verified": "承認済"
}