{
  "403-assignment": "Nous sommes navrés, un autre Créateur d'images a été plus rapide pour choisir ce reportage.",
  "404-cta-back": "Retour",
  "404-cta-home": "Aller à la page d'accueil",
  "404-description": "Cette page est indisponible ou a été déplacée ailleurs.",
  "404-title": "Oups ! La page que vous cherchez semble introuvable.",
  "error": "Oups ! Une erreur est survenue"
}