{
  "all": "tümü",
  "breadcrumb-home": "Ana Sayfa",
  "breadcrumb-myassignments": "Görevlerim",
  "button-cancel-label": "Yeniden başlat",
  "button-label": "Arama",
  "coming-up": "yakında sizlerle",
  "filter": "filtre",
  "filters": "filtreler",
  "finished": "bitti",
  "no-more-results": "Daha fazla sonuç yok",
  "no-results": "Sonuç yok",
  "on-hold": "beklemede",
  "post-prod": "post prodüksiyon",
  "search-label": "Kimliğe, referansa göre arayın...",
  "set-appointment": "randevu ayarla",
  "sort-chronological": "Kronolojik sıra",
  "sort-label": "Sıralama Ölçütü",
  "sort-reverse-chronological": "Kronolojik sırayı ters çevir",
  "sort-time-left-longer": "Kalan süre (Önce Daha Uzun)",
  "sort-time-left-shorter": "Kalan süre (Önce Daha Kısa)",
  "title": "Görevlerim",
  "upload-media": "medya yükle"
}