{
  "back-to-login": "Retour à la page de connexion",
  "confirmation": "Confirmation",
  "password-reset-confirmation": "Votre mot de passe a été réinitialisé",
  "password-reset-subtitle": "Validez votre email et créez un nouveau mot de passe",
  "password-reset-title": "Réinitialisation du mot de passe"
}