{
  "section-content": "Nous sélectionnons le meilleur photographe pour votre reportage.\n            Leurs coordonnées seront bientôt disponibles !",
  "section-label": "Date du reportage",
  "section-link-label": "Exporter",
  "section-text": "Le photographe vous appellera avant le jour du reportage\n         pour vérifier les derniers détails techniques."
}