{
  "acl": {
    "permissions": "permissions"
  },
  "address-input": {
    "label": "Type the address or click a location on the map"
  },
  "clip-board": {
    "tooltip": "Copy to clipboard"
  },
  "criticality": {
    "edit-level": "Level Update",
    "edit-subtitle": "cascade legacy",
    "edit-title": "Defcon update",
    "inherited": "inherited",
    "level-1": "Level 1 - test account, no room for error",
    "level-2-1": "Level 2 - account at risk of being lost, high alert",
    "level-2-2": "maximum attention to be given",
    "level-3": "Level 3 - premium account, high volume",
    "level-4": "Level 4 - important but not critical",
    "level-5": "Level 5 - standard account, default value",
    "map-display": "Map Display",
    "map-display-switch": "Show assignments on the map",
    "mission": "Assignment",
    "organization": "Organization",
    "user": "User"
  },
  "date-display": {
    "mission-time-zone": "Assignment time zone :",
    "your-time-zone": "Your time zone :"
  },
  "date-input": {
    "end": "End",
    "last-week": "Last week",
    "next-week": "Next week",
    "start": "Start",
    "today": "Today",
    "tomorrow": "Tomorrow",
    "yesterday": "Yesterday"
  },
  "evaluation": {
    "ic-title": "IC declarative",
    "ocus-title": "ocus validation",
    "selected": "selected",
    "skill-selection": "skills selection"
  },
  "form": {
    "button-submit": "submit"
  },
  "guidelines": {
    "advertiser": "Advertiser",
    "customer": "Customer",
    "editor": "editor",
    "operator": "Image Creator",
    "staff": "staff"
  },
  "hierarchy-select-input": {
    "loading-text": "Loading",
    "no-data-text": "No data",
    "no-match-text": "No matching data",
    "see-pictures-attached": "See pictures attached"
  },
  "invoice-status-mapping": {
    "invoice-generated": "Invoice generated",
    "paid": "Paid",
    "payment-dropped": "Payment cancelled",
    "payment-failed": "Payment Failed",
    "pending": "Pending",
    "processing": "Processing Payment",
    "refused": "Refused",
    "to-check": "To check",
    "to-pay": "To pay"
  },
  "member": {
    "organization": "legal status",
    "organizations": "organizations",
    "profile": "profile",
    "rating": "IC Rating",
    "skills": "IC skills qualification"
  },
  "mission-status-description": {
    "added-to-cart": "The assignment has been created and added to the cart.",
    "appointment-confirmed": "The appointment has been confirmed with the business owner.",
    "archived": "The media has been archived after 6 months time period.\n          You may contact OCUS team should you need to retrieve it.",
    "assigned": "An Image Creator has selected and confirmed the mission.",
    "canceled": "The assignment has been unassigned",
    "completed": "The assignment has been validated and rated.",
    "delivered": "The media has been delivered. The assignment can now be accepted and rated,\n          or alternatively a feedback can be sent.",
    "in-post-production": "The media is being processed by the editor.",
    "ordered": "The assignment has been ordered. It is now waiting for an attribution\n          to an Image Creator.",
    "unassigned": "The Image Creator was removed from the assignment",
    "waiting-media-upload": "The media may be uploaded as the appointment already took place."
  },
  "operators": {
    "all-image-makers": "all image makers",
    "applicants": "applicants",
    "documents-validation": "documents validation",
    "refused-applicants": "refused applicants"
  },
  "organization": {
    "delivery": "Delivery",
    "invitations": "invitations",
    "invoicing": "Invoicing",
    "members": "members",
    "missions": "Assignments",
    "offers": "offers",
    "profile": "profile",
    "referents": "OCUS contacts"
  },
  "select-input": {
    "loading-text": "Loading",
    "no-data-text": "No data",
    "no-match-text": "No matching data"
  },
  "sub-domain": {
    "button-delete": "delete",
    "hubspot-link": "Go to Hubspot",
    "reshoot": "Reshoot"
  },
  "tag-select-input": {
    "loading-text": "Loading",
    "no-data-text": "No data",
    "no-match-text": "No matching data"
  }
}