{
  "cart-summary": {
    "checkout": "เช็คเอาต์",
    "confirm-delete-mission": "งานของคุณจะถูกยกเลิก",
    "confirm-delete-title": "การยกเลิกการมอบหมายงาน",
    "no-mission": "ไม่มีงานที่รอดำเนินการในขณะนี้",
    "no-mission-link": "สร้างคำสั่งซื้อ",
    "other-mission": "เพิ่มงานอื่น",
    "select-all": "เลือกทั้งหมด"
  }
}