{
  "breadcrumb-home": "Accueil",
  "breadcrumb-upload": "Chargement des médias",
  "delete-error": "Impossible de supprimer l'image",
  "mission-media-renamed": "Votre média a été renommé",
  "mission-upload-ko": "Un problème est survenu lors du renommage des médias",
  "preview-error": "Impossible d'afficher l'aperçu",
  "send-remember": "N'oubliez pas de cliquer sur envoyer une fois le chargement des médias terminé.",
  "sending-date": "Date d'envoi",
  "sent": "Commentaire envoyé avec succès",
  "title": "Chargement du média",
  "upload-incomplete-ok": "Merci. Vos médias ont été envoyés. Nous les examinerons et vous informerons dès que notre client les aura validés",
  "upload-ko": "Un problème est survenu lors du chargement",
  "upload-ok": "Vos médias ont été transmis avec succès"
}