{
  "payment-summary": {
    "price-ht": "Kwota (bez podatku)",
    "price-ttc": "Suma (łącznie z podatkiem)",
    "tax": "podatku",
    "title": "Podsumowanie",
    "value": "Wartość zamówienia"
  }
}