{
  "403-assignment": "Sorry, deze opdracht is al aan een andere Image Creator gekoppeld.",
  "404-cta-back": "Terug",
  "404-cta-home": "Ga naar de startpagina",
  "404-description": "De pagina kan ook verplaatst zijn of momenteel niet beschikbaar zijn.",
  "404-title": "Oeps! De pagina die u zocht, is nog niet gemaakt.",
  "error": "Er is een fout opgetreden"
}