{
  "additional-information-form": {
    "continue": "Lanjutkan",
    "documents": "Dokumen",
    "mission-details": "Detail tugas"
  },
  "additional-information-summary": {
    "mission-details": "Detail tugas"
  },
  "appointment-date-form": {
    "apointment-date-info": "Periode pemesanan tugas minimal 48 jam sebelum sesi pemotretan. Jika Anda perlu memesan sesi pemotretan dadakan, silakan hubungi tim OCUS.",
    "continue": "Lanjutkan",
    "date-fix-now": "Segera pastikan",
    "date-to-fixed": "Untuk diperbaiki dengan kontak di lokasi yang ditugaskan",
    "mission-date": "Tanggal tugas"
  },
  "appointment-date-summary": {
    "date-to-fixed": "Untuk diperbaiki dengan kontak di lokasi yang ditugaskan"
  },
  "appointment-location-form": {
    "cancel": "Batal",
    "continue": "Lanjutkan",
    "mission-address": "Alamat tugas",
    "submit": "Kirim"
  },
  "appointment-location-summary": {
    "title": "Lokasi janji temu"
  },
  "change-date": {
    "appointment": "Ubah tanggal janji temu",
    "changes-ok": "Perubahan telah disimpan",
    "date-comment": "Tinggalkan komentar sebelum mengubah tanggal",
    "date-confirm": "Konfirmasi",
    "mission-date": "Tanggal tugas",
    "new-appointment": "Konfirmasikan tanggal janji temu baru dan jelaskan alasan perubahan di bawah ini.",
    "return": "Kembali"
  },
  "contact-form": {
    "continue": "Lanjutkan",
    "email": "Email",
    "firstname": "Nama depan",
    "is-contact": "Apakah Anda kontak di lokasi?",
    "language": "Bahasa",
    "lastname": "Nama belakang",
    "no": "tidak",
    "onsite-contact": "Kontak di lokasi",
    "yes": "ya"
  },
  "contact-list": {
    "company": "Perusahaan/Toko/Bisnis",
    "contact-fail-landing": "Terjadi kesalahan saat mengirim platform kontak di lokasi",
    "contact-onsite-create-title": "Tambah detail kontak",
    "contact-onsite-infos1": "Anda perlu mengubah detail kontak?",
    "contact-onsite-infos2": "Kami mengingatkan Anda bahwa kontak ini akan menjadi orang yang berhubungan dengan kreator gambar",
    "contact-onsite-update-title": "Edit detail kontak",
    "contact-primary": "Kontak utama",
    "contact-secondary": "Kontak sekunder",
    "contact-succes-landing": "Pemberitahuan untuk platform kontak di lokasi berhasil dikirim",
    "contact-tertiary": "Kontak tersier",
    "contacts": "Kontak",
    "created-by": "Dibuat oleh",
    "delete-cancel": "Batal",
    "delete-confirm": "Konfirmasi",
    "drag-info": "Anda dapat mengubah prioritas kontak dengan memindahkan kartu ke urutan yang benar",
    "email": "Email",
    "first-name": "Nama Depan",
    "language": "Bahasa",
    "last-name": "Nama Belakang",
    "mission-user-title": "Kreator Gambar",
    "phone-1": "Telepon 1",
    "phone-2": "Telepon 2",
    "phone-3": "Telepon 3",
    "send-onsite": "Kirim platform kontak di lokasi",
    "you-are-about-to-cancel-contact": "Anda akan membatalkan kontak di bawah ini:"
  },
  "contact-summary": {
    "is-contact": "Apakah Anda kontak di lokasi?",
    "onsite-contact": "Kontak di lokasi"
  },
  "create-stepper": {
    "add-to-cart": "Tambahkan ke keranjang",
    "appointment-date": "Tanggal janji temu",
    "appointment-location": "Lokasi janji temu",
    "contact": "Kontak",
    "edit": "Edit",
    "incomplete-profile": "Profil Anda tidak lengkap",
    "organization": "Organisasi",
    "save": "Simpan",
    "select-organization": "Pilih organisasi",
    "step-additional-information": "Informasi tambahan",
    "step-name": "Nama tugas",
    "step-offer-choice": "Pilihan paket"
  },
  "history": {
    "archived": "Tugas Sebelumnya",
    "event-ma-address-update": "MA:ADDRESS_UPDATE",
    "event-ma-client-feedback": "MA:CLIENT_FEEDBACK",
    "event-ma-client-rating": "Klien telah menerima dan menilai tugas tersebut",
    "event-ma-contact-infos-update": "Informasi kontak di lokasi telah diperbarui",
    "event-ma-deliver": "Media telah dikirimkan ke Klien",
    "event-ma-media-validate": "Klien telah menerima media",
    "event-ma-refuse-fee-request": "MA:REFUSE_FEE_REQUEST",
    "event-ma-toggle-internal-edition": "MA:TOGGLE_INTERNAL_EDITION",
    "event-ma-upload-open": "Media tambahan atau Penamaan yang diminta",
    "event-ma-validate-fee-request": "MA:VALIDATE_FEE_REQUEST",
    "event-sp-call-issue": "Kreator Gambar tidak dapat menghubungi kontak di lokasi",
    "event-sp-comment-client-ic": "Klien meninggalkan pesan untuk Kreator Gambar",
    "event-sp-comment-client-ocus": "Klien meninggalkan pesan untuk Kreator Gambar",
    "event-sp-comment-ocus-client": "OCUS meninggalkan pesan untuk Klien",
    "event-sp-comment-ocus-client-ic": "OCUS meninggalkan pesan untuk Kreator Gambar dan Klien",
    "event-sp-date-change": "Tanggal tugas telah diubah",
    "event-sp-date-issue": "SP:DATE_ISISSUE",
    "event-sp-failed": "Tugas tidak dapat dilakukan",
    "event-sp-missing-info": "Informasi yang diminta oleh Kreator Gambar",
    "event-sp-refusal": "Kreator Gambar tidak dapat mengatur tanggal janji temu dengan kontak di lokasi",
    "event-sp-reschedule": "SP:RESCHEDULE",
    "event-sp-set-date-later": "Kontak di lokasi perlu dihubungi ulang di lain waktu untuk menetapkan tanggal baru",
    "event-sp-unblock": "Masalah telah teratasi",
    "event-sp-unqualified": "Masalah tugas diberitahukan oleh Kreator Gambar",
    "event-sp-upload-issue": "SP:UPLOAD_ISSUE",
    "event-wa-activation": "Tugas dalam proses pembayaran",
    "event-wa-attribution": "Tugas telah diatribusikan",
    "event-wa-cancel": "Tugas dibatalkan oleh Klien atau kontak di lokasi",
    "event-wa-contact-call-confirmation": "Kreator Gambar telah mengonfirmasi tanggal tugas dengan kontak di lokasi melalui telepon",
    "event-wa-deselection": "Tugas dihapus dari keranjang oleh Kreator Gambar",
    "event-wa-incomplete-upload": "WA:INCOMPLETE_UPLOAD",
    "event-wa-media-edited": "WA:MEDIA_EDITED",
    "event-wa-media-treated": "Tugas telah divalidasi dan dinilai oleh Klien",
    "event-wa-reset-appointment": "WA:RESET_APPOINTMENT",
    "event-wa-reshoot": "WA:RESHOOT",
    "event-wa-unassign": "Kreator Gambar telah batal ditetapkan dari tugas ini.",
    "event-wa-validate-upload": "Kreator Gambar telah mengunggah semua item yang ditentukan dalam paket",
    "event-wa-waiting-attribution": "Tugas yang dipesan oleh Klien",
    "event-wa-waiting-media-treatment": "Tugas selesai, media akan diproses",
    "new-date": "Tanggal baru",
    "prev-date": "Tanggal sebelumnya",
    "title": "Log Riwayat",
    "unblock": "BLOKIR TUGAS DIBUKA"
  },
  "mission-blockers": {
    "blocker-sp-call-issue": "SP:CALL_ISSUE",
    "blocker-sp-guidelines": "SP:GUIDELINES",
    "blocker-sp-missing-info": "SP:MISSING_INFO",
    "blocker-sp-refusal": "SP:REFUSAL",
    "blocker-sp-upload-issue": "SP:UPLOAD_ISSUE"
  },
  "mission-media": {
    "download": "Unduh",
    "mission-medias": "Media tugas"
  },
  "mission-name-form": {
    "continue": "Lanjutkan",
    "name": "Nama tugas",
    "reference": "Referensi",
    "reference-placeholder": "(kode, id, referensi internal, dll.)"
  },
  "mission-status": {
    "accept": "Harap tinjau dan terima gambar untuk mengunduh",
    "customer-archive-link": "Arsip pelanggan",
    "download": "Unduh",
    "feedback-description": "Anda telah menolak gambar untuk tugas ini.",
    "feedback-description2": "Kami akan berusaha semaksimal mungkin untuk menyesuaikan dengan kebutuhan Anda dan memberi tahu Anda segera saat\n  gambar tersedia untuk validasi.",
    "feedback-subtitle": "Media menunggu tinjauan OCUS",
    "feedback-title": "Kami sedang meninjau umpan balik Anda",
    "final-validation-description": "Tugas telah selesai dan pasca-produksi telah selesai.",
    "final-validation-title": "Konten Anda tersedia untuk validasi",
    "help": "Ada kesalahan?",
    "on-site-contact-archive-link": "Arsip kontak di lokasi",
    "partial-validation-description_0": "###abaikan###",
    "partial-validation-description_1": "###abaikan###",
    "partial-validation-description_2": "###abaikan###",
    "partial-validation-description": "{{count}} dari {{total}} visual tersedia.",
    "partial-validation-description_plural": "{{count}} dari {{total}} visual tersedia.",
    "partial-validation-description3": "Konten yang tersisa akan segera siap.",
    "partial-validation-title": "Sebagian konten Anda tersedia",
    "rate": "Nilai media",
    "status-final-validation-description": "Terima kasih atas kepercayaan Anda terhadap OCUS.",
    "status-final-validation-description2": "Anda telah menilai konten, yang sekarang dapat Anda unduh.",
    "status-final-validation-title": "Konten Anda tersedia!",
    "status-partial-validation-description_0": "###abaikan###",
    "status-partial-validation-description_1": "###abaikan###",
    "status-partial-validation-description_2": "###abaikan###",
    "status-partial-validation-description": "{{count}} dari {{total}} media tersedia untuk diunduh.",
    "status-partial-validation-description_plural": "{{count}} dari {{total}} media tersedia untuk diunduh.",
    "status-partial-validation-description2": "Anda akan segera menerima seluruh media yang dipesan.",
    "submit": "Terima konten"
  },
  "mission-tooltip": {
    "cancel": "Batalkan Tugas",
    "cancel-comment": "Harap berikan detail tentang pembatalan:"
  },
  "mission-validation-modal": {
    "alert": "Dengan mengirimkan umpan balik, visual akan dianggap ditolak dan Anda tidak akan\n  dapat memvalidasi atau mengunduhnya hingga dilakukan tindakan lebih lanjut dari\n  tim pasca-produksi kami.",
    "cancel": "Batal",
    "feedback-label": "Tambahkan komentar Anda di bawah ini",
    "feedback-optional": "Opsional",
    "feedback-placeholder": "Tulis komentar",
    "feedback-required": "Diperlukan",
    "refused-description": "Anda akan menolak media",
    "refused-label": "Harap sebutkan masalah yang dialami.",
    "refused-text": "Kami memerlukan umpan balik Anda untuk melanjutkan pertanyaan Anda",
    "refused-title": "Beri tahu kami apa yang salah",
    "submit": "Kirim",
    "validated-description": "Bagaimana penilaian Anda terhadap layanan gambar OCUS?",
    "validated-label": "Beri tahu kami apa yang dapat diperbaiki.",
    "validated-text": "Bantu kami meningkatkan produk kami.",
    "validated-title": "Waktunya untuk menilai"
  },
  "offer-choice-form": {
    "select": "Pilih"
  }
}