{
  "all": "mind",
  "breadcrumb-home": "Kezdőlap",
  "breadcrumb-myassignments": "Megbízásaim",
  "button-cancel-label": "Visszavonás",
  "button-label": "Keresés",
  "coming-up": "elkövetkező",
  "filter": "szűrő",
  "filters": "szűrők",
  "finished": "befejezett",
  "no-more-results": "Nincs több találat",
  "no-results": "Nincs találat",
  "on-hold": "felfüggesztve",
  "post-prod": "utómunka",
  "search-label": "Keresés azonosító, hivatkozás alapján...",
  "set-appointment": "találkozó beállítása",
  "sort-chronological": "Időrendi sorrend",
  "sort-label": "Rendezés szempontja",
  "sort-reverse-chronological": "Időrendi sorrend megfordítása",
  "sort-time-left-longer": "Hátralévő idő (hosszabb előre)",
  "sort-time-left-shorter": "Hátralévő idő (rövidebb előre)",
  "title": "Megbízásaim",
  "upload-media": "médiaanyag feltöltése"
}