{
  "address": "អាសយដ្ឋាន",
  "address-missing": "បាត់អាសយដ្ឋានរបស់អ្នក",
  "general": "ព័ត៌មានទូទៅ",
  "languages": "ភាសានិយាយ",
  "languages-update": "អាប់ដេតភាសារបស់អ្នក",
  "password": "ពាក្យសម្ងាត់",
  "phone": "លេខទូរសព្ទ",
  "phone-update": "កែលេខទូរសព្ទ",
  "profile-title": "អាប់ដេតប្រូហ្វាល់​របស់ខ្ញុំ",
  "resume": "ប្រវត្តិរូបការងារ",
  "skills": "ជំនាញ",
  "unverified": "មិនទាន់ផ្ទៀងផ្ទាត់",
  "verified": "បានបញ្ជាក់"
}