{
  "content": "Potrebujeme, aby ste boli pripravení na fotografovanie.\n            Prečítajte si pokyny, aby ste videli, čo bude potrebné urobiť.",
  "section-label": "Skontrolujte pokyny",
  "section-link-label": "Zobraziť"
}