{
  "review": "Bilgilerinizi gözden geçirin",
  "started": "Haydi Başlayalım",
  "step-1.click": "Şuna tıklayın:",
  "step-1.then": "Ardından bilgilerinizi onaylayın veya güncelleyin ve yönergeyi okuyun",
  "step-2": "Fotoğraf çekiminizin yapılacağı gün, seçtiğiniz yemekleri hazırlayın ve fotoğrafçıyı karşılayın",
  "step-3": "Yayınlanan fotoğrafları görmek için {{organization}} hesabınıza bakın ve siparişlerinizin artışını izleyin"
}