{
  "cart-summary": {
    "checkout": "Do kasy",
    "confirm-delete-mission": "Twoje zadanie zostanie anulowane",
    "confirm-delete-title": "Anulowanie cesji",
    "no-mission": "Brak oczekujących zleceń na teraz.",
    "no-mission-link": "Utwórz zamówienie",
    "other-mission": "Dodaj kolejne zlecenie",
    "select-all": "Wybierz wszystkie"
  }
}