{
  "back-to-login": "ត្រលប់ទៅកន្លែងឡកចូលវិញ",
  "confirmation": "បញ្ជាក់",
  "password-reset-confirmation": "ពាក្យសម្ងាត់របស់អ្នកត្រូវបានកំណត់ឡើងវិញ",
  "password-reset-subtitle": "បញ្ជាក់ភាពត្រឹមត្រូវ​នៃអ៊ីមែលរបស់អ្នក​និងបង្កើតពាក្យសម្ងាត់ថ្មី",
  "password-reset-title": "ពាក្យសម្ងាត់ត្រូវបានកំណត់ឡើងវិញ"
}