{
  "breadcrumb": {
    "home": "Início"
  },
  "header-logged": {
    "api-credentials": "Credenciais API",
    "cart": "Carrinho",
    "create-mission": "Encomendar reportagem",
    "data": "Dados",
    "home": "Início",
    "invoicing": "Dados",
    "logout": "Terminar sessão",
    "medias-upload": "Reportagens",
    "menu-help": "Centro de Ajuda",
    "missions": "Reportagens",
    "organizations": "Organizações",
    "select-language": "Selecione o seu idioma"
  }
}