{
  "ACTIVATED": "สั่งซื้อแล้ว",
  "APPOINTED": "ยืนยันนัดหมายแล้ว",
  "ARCHIVED": "จัดเก็บแล้ว",
  "ATTRIBUTED": "มอบหมายแล้ว",
  "CANCELED": "ยกเลิกแล้ว",
  "CREATED": "สร้างแล้ว",
  "MEDIA_TREATED-can_download": "เสร็จสมบูรณ์",
  "MEDIA_TREATED-can_download,can_rate": "เสร็จสมบูรณ์",
  "REFUSED": "มีเดียถูกปฏิเสธ",
  "UNASSIGNED": "ไม่ได้มอบหมาย",
  "WAITING_APPOINTMENT": "กำลังรอนัดหมาย",
  "WAITING_ATTRIBUTION": "สั่งซื้อแล้ว",
  "WAITING_MEDIA_TREATMENT": "ขั้นตอนหลังการผลิตที่กำลังทำอยู่",
  "WAITING_MEDIA_TREATMENT-can_deliver": "ขั้นตอนหลังการผลิตที่กำลังทำอยู่",
  "WAITING_MEDIA_TREATMENT-can_download": "ขั้นตอนหลังการผลิตที่กำลังทำอยู่",
  "WAITING_MEDIA_TREATMENT-can_upload": "กำลังรอการอัปโหลดมีเดีย",
  "WAITING_MEDIA_TREATMENT-can_validate": "ขั้นตอนหลังการผลิตที่กำลังทำอยู่",
  "WAITING_MEDIA_TREATMENT-can_validate,can_deliver": "ขั้นตอนหลังการผลิตที่กำลังทำอยู่"
}