{
  "no-billing-no-organization-warning-description": "has no Billing Information: assignment orders are  not possible on this organization. Add the relevant  Billing Info in the section below or specify another  Organization to bill for assignments ordered on",
  "no-billing-no-organization-warning-title": "Add Billing Info or specify another Billing Organization"
}