{
  "cart": "Keranjang",
  "checkout-payment-successful": "Pembayaran berhasil",
  "checkout-success-message": "Pembayaran Anda telah diterima, dan tugas Anda telah diaktifkan.",
  "price-ht": "Jumlah (Tidak termasuk pajak)",
  "price-ttc": "Total (Termasuk pajak)",
  "summary": "Ringkasan",
  "tax": "Pajak (20%)",
  "value": "Nilai pesanan",
  "view-missions": "Lihat tugas"
}