{
  "create": {
    "billing-manager": "Billing manager",
    "email": "Email",
    "firstname": "First name",
    "lastname": "Last name",
    "member": "Member",
    "owner": "Owner",
    "phone": "Phone",
    "read-only": "Read only",
    "role-label": "Role",
    "title": "New invitation"
  },
  "resend-invitation-button": {
    "resend-invitation": "Resend invite",
    "success": "invitation resended"
  }
}