{
  "address-error": "There was an error while saving the address",
  "address-saved": "The address has been saved successfully",
  "approximative-address": "The address could not be established accurately. Please confirm the location with the onsite contact.",
  "are-you-sur-you-want-to-delete-document": "Are you sure you want to delete this document?",
  "assignation-success-description": "Congratulations, assignments have been confirmed. Review your assignments on your dashboard and carefully read the OCUS brief to ensure success.",
  "assignation-success-title": "The assignment has been assigned to you",
  "assignment-base": "Base",
  "assignment-compensation": "Compensation",
  "assignment-id": "Assignment ID",
  "assignment-page": "Assignment Page",
  "assignment-reference": "Assignment reference:",
  "assignment-total": "Total",
  "blocker-": "blocker-",
  "blocker-assignment-alert": "ASSIGNMENT ALERT",
  "blocker-assignment-failure": "ASSIGNMENT FAILURE",
  "blocker-call-issue": "CALL ISSUE",
  "blocker-call-reminder": "CALL REMINDER",
  "blocker-contact-refusal": "CONTACT REFUSAL",
  "blocker-information-request": "INFORMATION REQUEST",
  "blocker-ma-client-feedback": "MA:CLIENT_FEEDBACK",
  "blocker-ma-internal-escalate": "MA:INTERNAL_ESCALATE",
  "blocker-ma-rename-file": "MA:RENAME_FILE",
  "blocker-ma-upload-open": "MA:UPLOAD_OPEN",
  "blocker-notified-by": "notified by user {{firstname}} {{lastname}}",
  "blocker-sp-call-issue": "The Image Creator was unable to reach the on-site contact",
  "blocker-sp-date-issue": "SP:DATE_ISSUE",
  "blocker-sp-failed": "The assignment could not take place",
  "blocker-sp-guidelines": "OCUS brief clarification requested by Image Creator",
  "blocker-sp-missing-info": "Information requested by Image Creator",
  "blocker-sp-refusal": "Image Creator was unable to set an appointment date with the on-site contact",
  "blocker-sp-set-date-later": "On-site contact need to be recontacted later to set a new date",
  "blocker-sp-unqualified": "Assignment issue raised by Image Creator",
  "blocker-sp-upload-issue": "SP:UPLOAD_ISSUE",
  "blocker-wa-incomplete-upload": "WA:INCOMPLETE_UPLOAD",
  "blocker-wa-unassign": "WA:UNASSIGN",
  "btn-cancel": "Cancel",
  "btn-confirm": "Confirm",
  "choose-date-modal": "Choose a date",
  "client-does-not-add-any-document": "The Client has not added any documents yet",
  "comment": "Comment",
  "contact-no-display": "On-site contact will be accessible once you have read and validated the OCUS guidelines.",
  "contact-onsite-title": "Onsite contact",
  "delete-a-document": "Delete a document",
  "delete-no": "No",
  "delete-yes": "Yes",
  "drop-any-document-here": "Drop your document here",
  "drop-your-special-conditions": "Add special conditions",
  "drop-your-special-conditions-here": "Add special conditions here",
  "export-google": "Google",
  "export-ical": "Ical",
  "export-outlook": "Outlook",
  "export-to-calendar": "Export to calendar",
  "export-to-calendar-tooltip": "Export the invite to your calendar.",
  "guidelines": "Guidelines",
  "ic-does-not-add-any-document": "The Image Creator has not added any documents yet",
  "link": "Link",
  "mission-add-to-the-cart-cta": "Add assignment to your cart",
  "mission-appointment-address": "Address",
  "mission-appointment-change-date": "Change appointment date",
  "mission-appointment-date": "Appointment date",
  "mission-appointment-get-in-touch": "Please get in touch with your on-site contact to confirm everything is ready for the assignment.",
  "mission-appointment-please-contact": "Please get in touch with your on-site contact to schedule the assignment date and confirm everything is ready.",
  "mission-assign": "Accept assignment",
  "mission-assignation-title": "Assignment accepted",
  "mission-awaiting-upload": "Once the assignment is finished, please upload the media per the OCUS brief .",
  "mission-billing": "Billing and Payment",
  "mission-billing-subtitle": "Sit back and relax",
  "mission-called-contact": "I have called the contact",
  "mission-complete": "Assignment complete",
  "mission-contacts-title": "Contacts",
  "mission-date": "Assignment date",
  "mission-details": "Assignment details",
  "mission-enter-date": "Please enter the date that has been agreed with your contact below",
  "mission-guidelines": "Read the OCUS brief",
  "mission-id": "Assignment ID",
  "mission-legacy-warning-1": "This assignment was imported from the old platform while still in progress.\n              For further details about this assignment",
  "mission-legacy-warning-2": "visit the old platform",
  "mission-legacy-warning-3": "Please note: if you were not already assigned to that assignment on\n              the old platform, redirection will fail.",
  "mission-media-upload": "media upload",
  "mission-media-upload-date": "Upload will be available from the",
  "mission-media-upload-renaming": "Access upload page and rename media",
  "mission-pack": "Package",
  "mission-pending-appointment-confirmation-title": "Appointment confirmation",
  "mission-progress-title": "Assignment status",
  "mission-type": "Type",
  "mission-upload-step": "MEDIA UPLOAD",
  "mission-upload-step-subtitle": "Don't forget it to upload media within 6 hours of your assignment.",
  "ocus-does-not-add-any-document": "The OCUS Team has not added any documents yet",
  "or": "Or",
  "this-will-unblock": "This action will unblock this issue:",
  "unblock-confirm-desc": "Confirm that the issue is resolved",
  "update-address": "Update address",
  "upload-by-client": "Uploaded by Client",
  "upload-by-ic": "Uploaded by Image Creator",
  "upload-by-ocus": "Uploaded by OCUS",
  "view-ocus-contact": "View OCUS contacts",
  "wrong-date-alert": "Cannot set same-day appointment",
  "wrong-upload-format-alert": "The file must be .pdf or .png"
}