{
  "error-occured": "کوئی نقص واقع ہوگیا",
  "limit-reached": "حد پوری ہوگئی!",
  "limit-reached (previousy important)": "حد پوری ہوگئی!",
  "missions-limit (previously missions-limit-reached)": "فی دن {{count}} نئے اسائنمنٹس کی حد مقرر ہے۔",
  "missions-limit-wait": "مزید معلومات شامل کرنے کے لیے کل واپس آئیں۔",
  "welcome": "خوش آمدید"
}