{
  "assignation-success-description": "ขอแสดงความยินดี งานได้รับการยืนยันแล้ว ตรวจสอบงานบนแดชบอร์ดของคุณและอ่านแนวทางอย่างละเอียดเพื่อให้แน่ใจว่าจะประสบความสำเร็จ",
  "assignation-success-title": "มอบหมายงานให้คุณแล้ว",
  "fail-cart-add": "การตรวจสอบงานในตะกร้าของคุณล้มเหลว",
  "fail-cart-remove": "การลบงานออกจากตะกร้าของคุณล้มเหลว",
  "fail-to-much-mission": "มีงานมากเกินไปในรถเข็นของคุณ โปรดตรวจสอบการเลือกของคุณหรือลบการมอบหมายออก",
  "mission": "งาน:",
  "mission-in-cart-added-success-title": "เพิ่มลงในตะกร้าแล้ว",
  "remove-from-cart-notif": "ถูกลบออกจากตะกร้าของคุณแล้ว"
}