{
  "delete": "Supprimer",
  "missioncard": {
    "add-mission": "Ajouter le reportage",
    "Additional": [],
    "base-remuneration": "Rémunération minimum",
    "remaining-time": "Temps restant",
    "see-mission-details": "Voir les détails du reportage"
  },
  "or": "Ou",
  "remove-from-cart": "Retirer du panier",
  "timezone-delta-tooltip": {
    "your-time-zone": "Votre fuseau horaire :"
  },
  "upload": {
    "move-files-here": "Déplacer les fichiers ici",
    "select-files": "Sélectionner les fichiers",
    "upload-file": "Charger un fichier"
  }
}