{
  "breadcrumb-home": "首頁",
  "breadcrumb-upload": "媒體上載",
  "delete-error": "無法刪除影像",
  "mission-media-renamed": "您的媒體已重新命名",
  "mission-upload-ko": "媒體重新命名時發生問題",
  "preview-error": "無法顯示預覽",
  "send-remember": "上載完成後，請記得將媒體發送給 OCUS。",
  "sending-date": "正在發送日期",
  "title": "媒體上載",
  "upload-incomplete-ok": "多謝。您的媒體已發送。我們會檢視媒體，並於最終客戶驗證後通知您",
  "upload-ko": "上載時發生問題",
  "upload-ok": "您的媒體已成功傳送"
}