{
  "already-attributed": "Le shooting photo a déjà été attribué à un photographe.",
  "button-label-back": "Retour",
  "button-label-submit": "Valider",
  "cancel": "Annuler",
  "confirm": "Confirmez la date de rendez-vous pour le reportage",
  "date": "Date",
  "date-requested": "C'est la date du reportage.\n           N'oubliez pas de l'enregistrer dans votre agenda !",
  "error-date-before-next-available": "La date doit être postérieure à la prochaine date disponible.",
  "help.center.link": "Centre d'aide",
  "in-touch": "Il vous contactera pour confirmer la date de rendez-vous.",
  "in-touch-ic": "Si vous avez besoin de reporter, contactez le photographe :",
  "in-touch-ocus": "Si vous n'êtes pas disponible à cette date, vous pouvez reporter en contactant notre",
  "not-available": "Si vous n'êtes pas disponible à cette date, vous pouvez proposer un nouvel horaire.\n            Le photographe reviendra vers vous pour confirmer la date.",
  "photographer-confirm": "Le photographe reviendra vers vous pour confirmer la date.",
  "pick": "Veuillez choisir une date et une heure pour votre reportage",
  "sub-title": "Confirmation de la date",
  "time": "Heure",
  "title": "Date du reportage",
  "validate": "Valider"
}