{
  "cart": {
    "cannot-add": "Dnes už nemůžete ověřit další úkol, vraťte se zítra",
    "missions-limit": "Limit je tento počet nových zakázek za den: {{ count }}.",
    "missions-to-add": "Můžete ověřit pouze tento počet dalších zakázek: {{ count }}.",
    "selected-missions-number": "Počet vybraných zakázek: {{ count }}"
  }
}