{
  "application-accepted-card": {
    "body": "Os seus documentos foram validados. Está agora pronto para escolher uma reportagem. Bem-vindo à OCUS!",
    "headline": "Obrigado {{firstname}}!"
  },
  "application-document-uploaded-card": {
    "body": "Os seus documentos foram validados. Está agora pronto para escolher uma reportagem. Bem-vindo à OCUS!",
    "headline": "Obrigado {{firstname}}!"
  },
  "application-error-card": {
    "body": "Ocorreu um erro desconhecido no seu perfil. Contacte a OCUS para resolver o problema.",
    "headline": "Ocorreu um erro"
  },
  "application-kpi-card": {
    "appointment-missions": "agendar visita",
    "coming-up": "brevemente",
    "finished-assignments": "concluído",
    "see-details": "Ver detalhes",
    "waiting-upload-missions": "A aguardar carregamento"
  },
  "application-refused-card": {
    "headline": "Lamentamos {{firstname}}!",
    "ocus": "A equipa OCUS",
    "sincerly": "Com os melhores cumprimentos,",
    "thank": "Agradecemos a sua candidatura para ser um Criador de imagens OCUS.",
    "unfortunately": "Infelizmente, a sua candidatura não foi aceite. Há vários motivos pelos quais uma candidatura pode não ser aceite, sendo o mais comum um desalinhamento entre os requisitos da OCUS e o portefólio ou equipamento partilhado connosco durante a candidatura.",
    "wish": "Desejamos-lhe o maior sucesso no seu percurso criativo!"
  },
  "application-submited-card": {
    "body": "A sua candidatura foi enviada. Iremos revê-la atentamente e contactá-lo o mais rapidamente possível.",
    "headline": "Obrigado {{firstname}}!"
  },
  "application-validated-card": {
    "body": "Parabéns! A sua candidatura foi aceite. Bem-vindo a uma comunidade global de criadores de imagens.       Para começar a trabalhar em reportagens para os nossos clientes, preencha os seus dados.",
    "edit-docs": "Complete seu perfil",
    "headline": "PARABÉNS {{firstname}}!"
  },
  "create-step1": {
    "subtitle": "Onde vive",
    "title": "Endereço"
  },
  "create-step2": {
    "address-update": "Editar número de telefone",
    "phone-button": "Adicionar número de telefone",
    "phone-subtitle": "Adicione o seu número de telefone e introduza o código de validação recebido através de mensagem de texto para confirmar.",
    "phone-title": "Número de telefone",
    "phone-unverified": "não validado",
    "phone-verified": "validado"
  },
  "create-step3": {
    "skills-main-title": "Quais são suas competências?",
    "skills-subtitle": "Quais são as suas áreas de eleição",
    "skills-title": "Competências",
    "spoken-languages-subtitle": "Os seus idiomas"
  },
  "create-step4": {
    "equipment-accessories-label": "Iluminação, microfones, dispositivos",
    "equipment-accessories-title": "Os seus acessórios",
    "equipment-camera-title": "O seu equipamento de câmara",
    "equipment-cameras-placeholder": "por exemplo: Nikon D800",
    "equipment-drone-title": "O seu equipamento de drone",
    "equipment-drones-placeholder": "por exemplo: Mavic 2 pro DJI",
    "equipment-headline": "Que equipamento possui?",
    "equipment-lens-title": "As suas objetivas",
    "equipment-lenses-placeholder": "por exemplo: Sony E 30 mm",
    "equipment-not-listed": "Produto não listado"
  },
  "create-step5": {
    "bio-placeholder": "Sou fotógrafo e cineasta apaixonado por paisagens.",
    "bio-title": "Biografia",
    "error": "URL inválido",
    "portfolio-placeholder": "Website, Instagram, Vimeo",
    "portfolio-subtitle": "Mostre-nos o seu portefólio.           A nossa equipa de fotógrafos e videógrafos irá analisá-lo atentamente.",
    "portfolio-title": "Portefólio"
  },
  "create-stepper": {
    "headline": "Conclua a sua candidatura e aceda a milhares de reportagens perto de si"
  }
}