{
  "back": "Späť",
  "precise-reason": "Žiadame vás upresniť dôvod",
  "reasons": "Ak nám chcete pomôcť zlepšiť našu službu, vyberte dôvod.",
  "reasons_ESTABLISHMENT_CLOSED": "Moje zariadenie je natrvalo zatvorené",
  "reasons_GUIDELINES": "Nesúhlasím s usmerneniami",
  "reasons_HAS_PICTURES": "Už mám snímky",
  "reasons_MISC": "Iné",
  "reasons_NOT_INTERESTED": "Nemám záujem",
  "reasons_PARTNER_ISSUE": "Mám problém s partnerstvom",
  "reasons_PARTNERSHIP_ENDED": "Moje partnerstvo sa skončilo",
  "reasons-select": "Vyberte dôvod",
  "submit": "Odoslať",
  "title": "Chystáte sa odmietnuť fotografovanie"
}