{
  "change-date": {
    "change-date": "更改預約日期",
    "change-date-warning-contact-fault": "通过确认此操作，您将能够安排新的约会。过于频繁地更改日期可能会限制您获得将来的机会。",
    "changes-ok": "已儲存變更",
    "claim-reshedule-fee": "我想索取改期费",
    "contact-rescheduled": "由於現場聯絡人的關係，委託需要重新安排",
    "contact-rescheduled-no-appointment-confirmed": "我们还没有确认的约会",
    "contact-rescheduled-onsite-contact-agreed": "我和现场联系人已经同意重新任命",
    "date": "委託日期",
    "date-comment": "在更改日期前，請先留言",
    "date-confirm": "確認",
    "date-warn-reschedule": "这项作业的日期已经设定。",
    "date-why-reschedule": "告诉我们为什么需要重新安排",
    "help-center": "帮助中心",
    "new-appointment": "請確認新的預約日期，並在下方說明更改原因。",
    "please-use-help-center": "如果您需要与我们联系，请使用帮助中心小部件。",
    "rescheduled": "我需要重新安排委託",
    "return": "退款"
  },
  "filter-missions": {
    "360": "360°",
    "available-missions": "可承接的委託",
    "cart-title": "篩選條件",
    "drone": "航拍機",
    "mission-status": "委託狀態",
    "mission-type": "委託類型",
    "my-mission": "我的委託",
    "photo": "照片",
    "video": "影片"
  },
  "go-to-mission-search-btn": {
    "name": "尋找委託"
  },
  "history": {
    "blocker": "任務已封鎖",
    "event-ma-deliver": "媒體已交付客戶",
    "event-ma-media-validate": "客戶已接受媒體",
    "event-ma-qc-rating": "委託已由 OCUS 團隊驗證和評級",
    "event-ma-upload-open": "額外媒體或命名要求",
    "event-sp-call-issue": "影像創作人無法聯絡現場聯絡人",
    "event-sp-comment-client-ic": "客戶向影像創作人留下了訊息",
    "event-sp-comment-ocus-client-ic": "OCUS 向影像創作人和客戶留下了訊息",
    "event-sp-comment-ocus-ic": "OCUS 向影像創作人留下了訊息",
    "event-sp-date-change": "委託日期已更改",
    "event-sp-failed": "該項委託無法履行",
    "event-sp-guidelines": "影像創作人已要求說明準則",
    "event-sp-missing-info": "影像創作人已要求取得部分資訊",
    "event-sp-refusal": "影像創作人無法與現場聯絡人落實預約日期",
    "event-sp-set-date-later": "須再次聯絡現場聯絡人，以落實新的預約日期",
    "event-sp-unblock": "已解決所有問題",
    "event-sp-unqualified": "影像創作人已就委託提出問題",
    "event-sp-upload-issue": "嘗試上載媒體時出現問題",
    "event-wa-attribution": "委託已獲指派",
    "event-wa-contact-call-confirmation": "影像創作人已透過電話與現場聯絡人確認委託日期",
    "event-wa-deselection": "由影像創作人從籃內移除的委託",
    "event-wa-media-treated": "客戶已驗證委託並評級",
    "event-wa-reshoot": "此委託需重新拍攝",
    "event-wa-unassign": "已取消此委託指派的影像創作人",
    "event-wa-validate-upload": "影像創作人已上載所有產品指定的項目",
    "event-wa-waiting-media-treatment": "委託已結束，將處理媒體",
    "new-date": "新的日期",
    "prev-date": "上一個日期",
    "title": "以往紀錄",
    "unblock": "任務已解封"
  },
  "mission-blockers": {
    "btn-cancel": "取消",
    "btn-confirm": "确认",
    "btn-unblock": "解锁问题",
    "unblock-confirm-desc": "确认问题已解决",
    "unblock-success": "阻止程序已被删除",
    "unblock-success-desc": "如果没有障碍物，您的任务就可以继续",
    "unblock-title": "您将要解除阻止此问题："
  },
  "mission-reminder": {
    "btn-confirm": "确认"
  },
  "mission-renaming": {
    "cta-unblock": "我無法重新命名媒體"
  },
  "mission-upload-card": {
    "no-optional": "沒有非必須媒體",
    "sending-date": "發送日期",
    "total-media-uploaded": "已上載媒體的總數",
    "upload-ko": "您的上載發生問題"
  },
  "schedule-reminder": {
    "button": "安排提醒",
    "leave-comment": "发表其他评论",
    "tittle": "安排提醒"
  }
}