{
  "address-input": {
    "input-address-invalid-meta": "Dirección no válida, seleccione un valor de las sugerencias",
    "input-map-address-invalid-meta": "Seleccione una dirección de la lista de sugerencias o haga clic en el mapa",
    "label": "Escriba la dirección o haga clic en una ubicación en el mapa"
  },
  "all-search-filter": {
    "date-label": "Periodo",
    "loading": "Cargando",
    "no-result": "Ningún resultado",
    "organization-label": "Organización",
    "others": "Otros",
    "state-label": "Estado"
  },
  "blocker-alert": {
    "and-send": "y pulse Enviar todos los archivos multimedia. Si no dispone de archivos multimedia adicionales, háganoslo saber:",
    "comment": "Comentario",
    "notify": "Notificar"
  },
  "coachmark": {
    "text": "personalizado escribiendo el nombre y pulsando Intro en su teclado.",
    "title": "Cambio de nombre guiado de los archivos multimedia"
  },
  "drop-zone": {
    "drop": "Soltar los archivos multimedia aquí o",
    "formats": "(Cargue uno de los siguientes formatos: jpeg, mov, mp4)",
    "nodrop": "Espere a que finalice la carga actual antes de cargar nuevos medios.",
    "upload": "Cargar archivo"
  },
  "file-input": {
    "file-too-big": "Se ha superado el tamaño de archivo",
    "file-upload": "No se ha podido cargar el archivo",
    "required-value": "se requiere"
  },
  "form": {
    "cancel": "Cancelar",
    "submit": "enviar"
  },
  "header-drop-zone": {
    "expected-media": "archivos multimedia esperados",
    "media-refused": "archivos multimedia rechazados",
    "optional": "opcionalmente",
    "plus": "y"
  },
  "help-center": {
    "cta": "Visitar el centro de ayuda",
    "help": "Centro de ayuda",
    "help-desc": "Busque la respuesta en el centro de ayuda o póngase en contacto directamente con el equipo de OCUS",
    "need-help": "¿Necesita ayuda?"
  },
  "input-mixins": {
    "validation-phone": "Número de teléfono no válido",
    "validation-required": "input-mixins.validation-required"
  },
  "invoice-status-mapping": {
    "pending-status": "EN REVISIÓN",
    "pending-to-pay": "PAGO EN CURSO"
  },
  "leave": {
    "dialog-content": "Las imágenes cargadas se guardarán y podrá enviarlas a OCUS más adelante.",
    "dialog-leave": "Salir de esta página",
    "dialog-stay": "Permanecer en esta página",
    "dialog-title": "Está a punto de abandonar la carga actual. Los archivos multimedia aún no se han enviado a OCUS."
  },
  "media-card": {
    "delete": "eliminar",
    "filename": "Nombre de archivo original",
    "menu-error": "Error al configurar el elemento del menú multimedia",
    "name-is-empty": "El nombre de archivo está vacío",
    "no-preview": "No hay una vista previa disponible para este tipo de archivo",
    "refused": "RECHAZADO",
    "reload": "volver a cargar",
    "renaming-error": "Error al cambiar el nombre de los archivos multimedia",
    "select-button": "Añadir como personalizado",
    "select-placeholder": "Seleccione o escriba el nombre"
  },
  "media-upload-service": {
    "fatal-error": "No se han podido cargar los archivos multimedia",
    "no-access": "No tiene acceso para cargar este archivo",
    "no-media-available": "Se ha alcanzado el número máximo de cargas",
    "to-much-file-error": "No se pueden enviar tantos archivos multimedia"
  },
  "medias-counter": {
    "optional": "opcionalmente",
    "total-media-uploaded": "total de archivos multimedia cargados"
  },
  "mission-address": {
    "tooltip": "La dirección no se ha podido establecer con precisión.\n              Confirme la ubicación con el contacto del sitio."
  },
  "mission-card": {
    "action-required": "Acción requerida: Problema de entrega",
    "call-issue": "Inaccesible",
    "guidelines": "Problema con las directrices",
    "missing-info": "Los datos de contacto son incorrectos",
    "refusal": "El contacto del sitio ha rehusado la tarea",
    "set-date-later": "Recordatorio",
    "tooltip": "Su hora local"
  },
  "mission-informations": {
    "tooltip-text": "Ir a la página de la tarea"
  },
  "mission-table": {
    "table-head-address": "Dirección",
    "table-head-date": "Fecha",
    "table-head-id": "ID de la tarea",
    "table-head-name": "Nombre de la tarea",
    "table-head-pack": "Paquete",
    "table-head-state": "Estado",
    "table-head-status": "Estado",
    "table-head-time-left": "Tiempo restante"
  },
  "naming-alert": {
    "media-naming-content": "directamente en la plataforma antes de enviarlos.",
    "media-naming-title": "Nombramiento de los archivos multimedia"
  },
  "notification-upload": {
    "alert-error": "no se han cargado los archivos multimedia debido a un problema de transferencia",
    "alert-warning": "Formato de imagen incorrecto",
    "sucess-media-1": "los archivos multimedia se han cargado correctamente",
    "sucess-media-x": "archivos multimedia cargados correctamente"
  },
  "notify": {
    "cancel": "Cancelar",
    "content": "Hemos solicitado archivos multimedia adicionales porque la carga actual no es satisfactoria.",
    "explain": "Explique por qué no puede continuar y confirme.",
    "send": "Enviar comentario",
    "sent": "Comentario enviado correctamente",
    "sent-error": "Problema al enviar el comentario",
    "title": "Notificar"
  },
  "rename-issue": {
    "blocker-notified-by": "( notificado por el usuario",
    "subtitle": "Cambio de nombre de archivos multimedia solicitado"
  },
  "renaming-alert": {
    "blocker-notified-by": "notificado por el usuario",
    "comment": "Comentario",
    "desc": "Cambie el nombre de los archivos multimedia editando el nombre en el cuadro de carga y confirme cuando haya terminado.",
    "subtitle": "Se solicita el cambio de nombre de los archivos multimedia",
    "title": "Problema de entrega"
  },
  "reshoot-alert": {
    "description": "Por favor, concierte una nueva fecha para la cita y proporcione archivos multimedia adicionales para que podamos validar su tarea",
    "subtitle": "El equipo de control de calidad ha identificado algunos problemas al revisar los archivos multimedia entregados.",
    "title": "Es necesario repetir la sesión"
  },
  "send": {
    "cancel": "Cancelar",
    "dialog-content": "Deje un comentario antes de la validación",
    "minimum": "archivos multimedia mínimos esperados.",
    "missing-media-name": "archivos multimedia sin nombre.",
    "missing-media-naming": "Falta el nombre de los archivos multimedia",
    "missing-media-text": "Seleccione el nombre en la lista del menú para cada archivo multimedia.\n          Si no encuentra el elemento correspondiente, puede crear uno personalizado escribiendo el nombre y pulsando Intro en su teclado.",
    "no-send-title": "Cargar",
    "no-send-title-incomplete": "Carga incompleta",
    "ok": "Aceptar",
    "out-of": "fuera de",
    "send": "Enviar",
    "send-anyway": "Enviar de todos modos",
    "title": "Está a punto de enviar todos sus archivos multimedia",
    "title-incomplete": "Está a punto de enviar una carga incompleta"
  },
  "status-bar": {
    "confirm-renaming": "Confirmar el cambio de nombre",
    "send-media": "Enviar archivos multimedia"
  },
  "stepper": {
    "submit": "enviar"
  },
  "welcome-modal": {
    "confirm": "Comienza la aventura",
    "desc-1": "Nuevo diseño, nuevas funciones:",
    "desc-2": "OCUS está actualizando la plataforma.",
    "drag-drop": "Arrastre y suelte para cargar los archivos multimedia rápidamente",
    "enjoy": "Disfrute de la experiencia OCUS",
    "general": "las condiciones generales",
    "more": "¡Próximamente, mucho más!",
    "new-map": "Un nuevo mapa para encontrar su tarea más rápidamente",
    "stats": "Haga un seguimiento de su progreso con más estadísticas",
    "subtitle": "se acerca",
    "terms": "He leído y aceptado",
    "title": "Algo",
    "welcome": "Le damos la bienvenida a",
    "welcome-2": "la nueva plataforma de OCUS"
  }
}