{
  "error-occured": "Vyskytla sa chyba",
  "hello": "Dobrý deň, {{firstname}},",
  "mission-section-emotional-empty": "Keďže sa zadania pridávajú denne, pravidelne kontrolujte našu platformu!",
  "mission-section-see-more": "Pozrite si viac",
  "mission-section-sub-title-empty": "V súčasnosti nie sú na základe vášho profilu žiadne návrhy",
  "mission-section-sub-title-few-suggestion": "Niekoľko návrhov pre vás",
  "mission-section-title": "Dostupné zadania",
  "subtitle": "Vitajte v službe OCUS!",
  "welcome": "vitajte"
}