{
  "email-not-verified": "معاف کیجئے، آپ کے ای میل کی توثیق کے دوران ایک غلطی ہوگئی۔",
  "email-verified": "آپ کے ای میل تصدیق ہوگئی ہے",
  "go-to-homepage": "ہوم صفحہ پر جائیں",
  "resend-error": "توثیقی ای میل بھیجنے کے دوران ایک غلطی ہوگئی",
  "resend-verification-email": "توثیقی ای میل دوبارہ بھیجیں",
  "try-another-account": "دوسرے اکاؤنٹ سے آزمائیں",
  "you-are-connected-with": "آپ مندرجہ ذیل سے مربوط ہیں: {{email}}"
}