{
  "address-input": {
    "input-address-invalid-meta": "Érvénytelen cím, válassz egy elemet a javaslatok közül",
    "input-map-address-invalid-meta": "Válassz egy címet a javaslatok listájából, vagy kattints a térképre",
    "label": "Írja be a címet, vagy kattintson egy helyre a térképen"
  },
  "all-search-filter": {
    "date-label": "Dátumtartomány",
    "loading": "Betöltés",
    "no-result": "Nincs eredmény",
    "organization-label": "Vállalkozás",
    "others": "Egyebek",
    "state-label": "Ország"
  },
  "blocker-alert": {
    "and-send": "és nyomd meg az összes médiaanyag küldése gombot. Ha nem rendelkezel több médiaanyaggal, tudasd velünk:",
    "comment": "Megjegyzés",
    "notify": "Értesíts minket"
  },
  "coachmark": {
    "text": "a név megadásával és a billentyűzet enter gombjának megnyomásával.",
    "title": "Médiaanyagok irányított átnevezése"
  },
  "drop-zone": {
    "drop": "Húzd át ide a médiaanyagot vagy",
    "formats": "(Töltsd fel a következő formátumok egyikében: jpeg, mov, mp4)",
    "nodrop": "Az új média feltöltése előtt várja meg, amíg az aktuális feltöltés befejeződik.",
    "upload": "Fájl feltöltése"
  },
  "file-input": {
    "file-too-big": "Fájlméret túllépve",
    "file-upload": "A fájl feltöltése sikertelen",
    "required-value": "kötelező"
  },
  "form": {
    "cancel": "Mégse",
    "submit": "Beküldés"
  },
  "header-drop-zone": {
    "expected-media": "elvárt médiaanyag",
    "media-refused": "médiaanyag elutasítva",
    "optional": "opcionális",
    "plus": "plusz"
  },
  "help-center": {
    "cta": "Súgóközpont megnyitása",
    "help": "Súgóközpont",
    "help-desc": "Keresd meg a választ a súgóközpontban, vagy lépj kapcsolatba közvetlenül az OCUS csapatával",
    "need-help": "Segítségre van szükséged?"
  },
  "input-mixins": {
    "validation-phone": "Érvénytelen telefonszám",
    "validation-required": "input-mixins.validation-required"
  },
  "invoice-status-mapping": {
    "pending-status": "ÁTTEKINTÉS ALATT",
    "pending-to-pay": "FIZETÉS FOLYAMATBAN"
  },
  "leave": {
    "dialog-content": "A feltöltött képeket elmentjük, és később elküldheted őket az OCUS-nak.",
    "dialog-leave": "Az oldal elhagyása",
    "dialog-stay": "Ezen az oldalon maradok",
    "dialog-title": "Így a jelenlegi feltöltés elvész. A médiaanyag még nem lett elküldve az OCUS-nak."
  },
  "media-card": {
    "delete": "törlés",
    "filename": "Eredeti fájlnév",
    "menu-error": "Hiba történt a médiaanyag menüelem beállítása közben",
    "name-is-empty": "A fájlnév üres",
    "no-preview": "Ehhez a fájltípushoz nem áll rendelkezésre előnézet",
    "refused": "ELUTASÍTVA",
    "reload": "betöltés újra",
    "renaming-error": "Hiba történt a médiaanyagok átnevezése közben",
    "select-button": "Hozzáadás egyedileg",
    "select-placeholder": "Válaszd ki vagy add meg a nevet"
  },
  "media-upload-service": {
    "fatal-error": "Nem sikerült feltölteni a médiaanyagot",
    "no-access": "Nincs hozzáférésed a fájl feltöltéséhez",
    "no-media-available": "Elérted a maximális feltöltési korlátot",
    "to-much-file-error": "Nem lehet elküldeni ennyi médiaanyagot"
  },
  "medias-counter": {
    "optional": "opcionális",
    "total-media-uploaded": "összes feltöltött médiaanyag"
  },
  "mission-address": {
    "tooltip": "A címet nem lehetett pontosan megállapítani.\n              Kérlek, egyeztesd a helyszíni kapcsolattartóval."
  },
  "mission-card": {
    "action-required": "Beavatkozás szükséges: Kézbesítési probléma",
    "call-issue": "Nem elérhető",
    "guidelines": "Útmutatóval kapcsolatos probléma",
    "missing-info": "Az elérhetőség helytelen",
    "refusal": "A helyszíni kapcsolattartó elutasítja a megbízást",
    "set-date-later": "Emlékeztető",
    "tooltip": "Helyi idő"
  },
  "mission-informations": {
    "tooltip-text": "Tovább a megbízás oldalára"
  },
  "mission-table": {
    "table-head-address": "Cím",
    "table-head-date": "Dátum",
    "table-head-id": "Megbízás azonosítója",
    "table-head-name": "Megbízás neve",
    "table-head-pack": "Csomag",
    "table-head-state": "Ország",
    "table-head-status": "Státusz",
    "table-head-time-left": "Hátralévő idő"
  },
  "naming-alert": {
    "media-naming-content": "küldés előtt közvetlenül a platformon.",
    "media-naming-title": "Médiaanyag elnevezése"
  },
  "notification-upload": {
    "alert-error": "átviteli probléma miatt a médiaanyag nem lett feltöltve",
    "alert-warning": "Hibás képformátum",
    "sucess-media-1": "médiaanyag sikeresen feltöltve",
    "sucess-media-x": "médiaanyagok sikeresen feltöltve"
  },
  "notify": {
    "cancel": "Mégse",
    "content": "Azért kértünk további médiaanyagokat, mert a jelenleg feltöltöttek nem voltak elegendők.",
    "explain": "Magyarázd el, miért nem tudsz továbblépni, majd erősítsd meg.",
    "send": "Megjegyzés küldése",
    "sent": "Megjegyzés sikeresen elküldve",
    "sent-error": "Probléma a megjegyzés elküldésekor",
    "title": "Értesíts minket"
  },
  "rename-issue": {
    "blocker-notified-by": "felhasználó által értesítve",
    "subtitle": "A médiaanyag átnevezése szükséges"
  },
  "renaming-alert": {
    "blocker-notified-by": "felhasználó által értesítve",
    "comment": "Megjegyzés",
    "desc": "A médiaanyagok nevének szerkesztésével nevezd át őket a feltöltés mezőben, majd nyomd meg a megerősítés gombot, ha végeztél.",
    "subtitle": "A médiaanyag átnevezése szükséges",
    "title": "Kézbesítési probléma"
  },
  "reshoot-alert": {
    "description": "Egyeztess egy új időpontot, és tölts fel további médiaanyagokat, hogy jóváhagyhassuk a megbízásod",
    "subtitle": "A minőség-ellenőrzési csapat néhány problémát talált a kézbesített médiaanyagok áttekintése során.",
    "title": "Újbóli fotózás szükséges"
  },
  "send": {
    "cancel": "Mégse",
    "dialog-content": "Jóváhagyás előtt hagyj megjegyzést",
    "minimum": "minimum elvárt médiaanyag.",
    "missing-media-name": "hiányzik a médiaanyag neve.",
    "missing-media-naming": "A médiaanyag elnevezése hiányzik",
    "missing-media-text": "Válaszd ki a nevet az egyes médiaanyagok menülistájából.\n          Ha nem találod a megfelelőt, létrehozhatsz egy elemet\n          a név megadásával és a billentyűzet enter gombjának megnyomásával.",
    "no-send-title": "Feltöltés",
    "no-send-title-incomplete": "Befejezetlen feltöltés",
    "ok": "OK",
    "out-of": "/",
    "send": "Küldés",
    "send-anyway": "Küldés mindenképpen",
    "title": "Minden médiaanyagot el fog küldeni",
    "title-incomplete": "Befejezetlen feltöltést fog elküldeni"
  },
  "status-bar": {
    "confirm-renaming": "Hagyd jóvá az átnevezést",
    "send-media": "Médiaanyag küldése"
  },
  "stepper": {
    "submit": "küldés"
  },
  "welcome-modal": {
    "confirm": "Indítsa el a kalandot",
    "desc-1": "Új műszerfal, új dizájn, új funkciók:",
    "desc-2": "Az OCUS frissíti a platformot!",
    "drag-drop": "Húzd át a médiaanyagok gyors feltöltéséhez",
    "enjoy": "Élvezze az OCUS élményét",
    "general": "az általános feltételeket",
    "more": "És még sok más jön!",
    "new-map": "Új térkép, amellyel gyorsabban megtalálhatod a megbízást",
    "stats": "Kövesd nyomon a fejlődésed még több statisztikával",
    "subtitle": "következik!",
    "terms": "Olvastam és elfogadtam",
    "title": "Valami van",
    "welcome": "Isten hozott a",
    "welcome-2": "az új OCUS platform"
  }
}