{
  "create-step1": {
    "self-employed": "我是自由業者",
    "status-update": "更新您的狀態將刪除所有先前的法律資訊"
  },
  "create-step2": {
    "default-status": "攝影家",
    "other": "其他"
  },
  "create-step3": {
    "address-label": "您的帳單地址為何？",
    "address-tooltip": "您的地址",
    "Attestation de vigilance-tooltip": "您的業務合規證明",
    "Attestation Urssaf-tooltip": "您的合法業務證明",
    "Attestation-tooltip": "您的證明",
    "Carte d'identité-tooltip": "您的國民身份證",
    "Certificate-tooltip": "您的證書",
    "Justificatif légal-tooltip": "您的辯護法",
    "Kbis-tooltip": "你的 Kbis",
    "Legal document-tooltip": "國民身份證",
    "Legal Id-tooltip": "您的法律編號",
    "Legal justification-tooltip": "您的法律依據",
    "siret-tooltip": "您的公司 ID",
    "upload": "上傳您的 {{documentName}}",
    "vat-label": "增值稅 %",
    "vat-placeholder": "選取"
  },
  "create-stepper": {
    "headline": "您的就業狀態"
  },
  "legal-edit-modal": {
    "change-status": "我已變更我的狀態",
    "not-specified": "未指定",
    "save-and-close": "儲存並關閉",
    "status": "狀態更新",
    "upload": "上傳您的 {{documentName}}"
  }
}