{
  "btn.prepared": "Prepare-se",
  "easy": "É tão fácil como:",
  "home.message": "As fotografias que abrem o apetite aumentam as encomendas dos clientes. Por isso, prepare-se para a sua sessão fotográfica GRATUITA!",
  "home.message-architecture": "Aumente a sua visibilidade com imagens profissionais, tudo o que precisa de fazer é ter o lugar pronto!",
  "home.message-default": "Consiga isso com fotografias incríveis! Reserve hoje mesmo a sua sessão fotográfica.",
  "home.message-food": "As fotografias que abrem o apetite aumentam as encomendas dos clientes. Por isso, prepare-se para a sua sessão fotográfica GRATUITA!",
  "information": "As suas informações",
  "not.need.photoshoot": "Não preciso de uma sessão fotográfica",
  "photoshoot.date": "Data da sessão fotográfica",
  "ready": "Está pronto(a) para aumentar a sua visibilidade?",
  "started": "Vamos começar",
  "title": "Início",
  "welcome": "Bem-vindo!"
}