{
  "assignment-id": "N° d'identification de la mission",
  "assignment-page": "Page des missions",
  "google": "Google",
  "guidelines": "Directives",
  "link": "Lien",
  "mission-details": "Description supplémentaire",
  "mission-pack": "Pack",
  "photographer": "Coordonnées du photographe"
}