{
  "cart": {
    "cannot-add": "ທ່ານບໍ່ສາມາດກວດສອບພາລະກິດເພີ່ມເຕີມໃນມື້ນີ້, ກະລຸນາກັບມາໃໝ່ໃນມື້ອື່ນ",
    "cart-title": "ກະຕ່າຂອງທ່ານ",
    "cart-validate-selection": "ກວດສອບການເລືອກ",
    "empty": "ກະຕ່າຂອງທ່ານວ່າງເປົ່າ",
    "mission-are-waiting": "ມີການມອບໝາຍຢູ່ແຜນທີ່!",
    "missions-limit": "ມີການຈໍາກັດການມອບໝາຍໃໝ່ທີ່ {{ count }} ລາຍການຕໍ່ມື້ເທົ່ານັ້ນ.",
    "missions-to-add": "ທ່ານສາມາດກວດສອບການມອບໝາຍອີກ {{ count }} ລາຍການເທົ່ານັ້ນ.",
    "selected-missions-number": "{{ count }} ເລືອກການມອບໝາຍວຽກ"
  }
}