{
  "edit": {
    "address": "地址",
    "billing-information": "帳單資訊",
    "city": "城市",
    "country": "國家",
    "delete": "刪除",
    "description": "說明",
    "details": "詳情",
    "legal-name": "法定名稱",
    "legal-status": "法律狀態",
    "logo": "標誌",
    "name": "名稱",
    "save": "儲存",
    "state": "州 / 省",
    "status": "狀態",
    "street1": "街道",
    "street2": "其他地址",
    "tax-id": "統一編號",
    "url": "URL",
    "zip-code": "郵遞區號"
  }
}