{
  "cart": {
    "cannot-add": "Hindi ka makakapag-validate ng higit pang mga takdang-aralin ngayon. Bumalik ka bukas.",
    "selected-missions-number": "{{ count }} seçilen görev",
    "selected-missions-number_plural": "{{ count }} seçilen görev"
  }
}