{
  "address": "АДРЕС",
  "address-missing": "Адресът ви липсва",
  "address-update": "Актуализирайте адреса си",
  "equipment": "Оборудване",
  "equipment-update": "Актуализирайте оборудването",
  "general": "ГЛАВНА ИНФОРМАЦИЯ",
  "general-information-update": "Актуализиране на обща информация",
  "languages": "Говорими езици",
  "languages-update": "Актуализирайте езиците си",
  "password": "ПАРОЛА",
  "phone": "ТЕЛЕФОНЕН НОМЕР",
  "phone-missing": "Липсва телефонният ви номер",
  "phone-update": "Редактирайте телефонен номер",
  "profile-title": "Актуализирайте профила си",
  "resume": "ПРОДЪЛЖИ",
  "resume-update": "Актуализиране на автобиографията",
  "skill-update": "Актуализирайте уменията",
  "skills": "умения",
  "unverified": "Не е проверено",
  "verified": "проверено"
}