{
  "equipment-edit": {
    "accessories-title": "อุปกรณ์เสริมของคุณ",
    "camera-title": "อุปกรณ์กล้องของคุณ",
    "cameras-placeholder": "เช่น: Nikon D800",
    "drone-title": "อุปกรณ์โดรนของคุณ",
    "drones-placeholder": "เช่น: Mavic 2 pro DJI",
    "lens-title": "เลนส์กล้องของคุณ",
    "lenses-placeholder": "เช่น: Sony E 30 มม.",
    "not-listed": "ผลิตภัณฑ์ที่ไม่อยู่ในรายการหรือไม่",
    "sucess": "อัปเดตอุปกรณ์เสร็จสมบูรณ์แล้ว"
  },
  "equipment": {
    "accessories": "อุปกรณ์เสริม",
    "cameras": "กล้อง",
    "lenses": "เลนส์",
    "no-accessories": "คุณยังไม่มีอุปกรณ์เสริมชิ้นใดเลย",
    "no-camera": "คุณยังไม่มีกล้องตัวใดเลย",
    "no-lenses": "คุณยังไม่มีเลนส์ชนิดใดเลย"
  },
  "general-information-edit": {
    "email": "อีเมล",
    "file-size-error": "ไฟล์มีขนาดใหญ่เกินไป ขนาดไฟล์สูงสุดที่อนุญาตคือ 2MB",
    "first-name": "ชื่อ",
    "image-formats": "รูปแบบที่ใช้ได้: png, jpg",
    "image-size": "ขนาดไฟล์สูงสุดที่อนุญาตคือ 2MB",
    "last-name": "นามสกุล",
    "profile-picture": "รูปภาพ",
    "sucess": "อัปเดตข้อมูลทั่วไปเสร็จสมบูรณ์แล้ว",
    "upload-error": "เกิดข้อผิดพลาดขณะอัปโหลดภาพ",
    "upload-image": "อัปโหลดรูปภาพ"
  },
  "languages-edit": {
    "langs": "ฝรั่งเศส อังกฤษ...",
    "success": "อัปเดตภาษาเสร็จสมบูรณ์แล้ว"
  },
  "resume-edit": {
    "bio-placeholder": "ฉันเป็นช่างภาพและผู้ผลิตภาพยนตร์ที่ชื่นชอบภูมิทัศน์",
    "bio-title": "อัตชีวประวัติ",
    "book-title": "หนังสือ",
    "error": "URL ไม่ถูกต้อง",
    "portfolio-placeholder": "เว็บไซต์, Instagram, Vimeo...",
    "sucess": "อัปเดตประวัติย่อเสร็จสมบูรณ์แล้ว"
  },
  "resume": {
    "bio": "อัตชีวประวัติ",
    "book": "หนังสือ",
    "no-book": "คุณยังไม่มีหนังสือเล่มใดเลย"
  },
  "skills-edit": {
    "description": "ตรวจสอบให้แน่ใจว่าคุณได้เลือกภาพถ่ายทุกประเภทที่คุณมีประสบการณ์ถ่าย\n      ซึ่งจะทำให้เราเสนองานที่สอดคล้องกัน\n      กับโปรไฟล์ของคุณได้",
    "sucess": "อัปเดตทักษะเสร็จสมบูรณ์แล้ว"
  }
}