{
  "currency-modal": {
    "continue-on-payoneer": "繼續使用 Payoneer",
    "error": "更新貨幣時發生問題",
    "payoneer-error": "擷取 Payoneer 資訊時發生問題",
    "save": "儲存",
    "text": "此貨幣將套用至任何使用中的發票。",
    "title": "變更貨幣",
    "title-first": "我們需要先知道您使用的貨幣"
  }
}