{
  "error-occured": "Er is een fout opgetreden",
  "limit-reached": "Limiet bereikt!",
  "limit-reached (previousy important)": "Limiet bereikt!",
  "missions-limit (previously missions-limit-reached)": "Er is een limiet van {{count}} nieuwe opdrachten per dag.",
  "missions-limit-wait": "Kom morgen terug om meer toe te voegen.",
  "welcome": "welkom"
}