{
  "subtitle": "Cependant, si vous changez d'avis, vous pouvez réactiver le reportage à tout moment !",
  "title": "Nous avons été informés que vous ne souhaitez pas bénéficier d'un reportage photo.",
  "unblock-btn": "Réactiver le reportage"
}