{
  "breadcrumb-home": "Inicio",
  "breadcrumb-upload": "Carga de archivos multimedia",
  "delete-error": "No se puede eliminar la imagen",
  "mission-media-renamed": "Se ha cambiado el nombre de sus archivos multimedia.",
  "mission-upload-ko": "Se ha producido un error al cambiar el nombre de los archivos multimedia",
  "preview-error": "No se puede mostrar la vista previa",
  "send-remember": "Recuerde enviar los archivos multimedia a OCUS una vez que se haya completado la carga.",
  "sending-date": "Fecha de envío",
  "title": "Carga de archivos multimedia",
  "upload-incomplete-ok": "Gracias. Sus archivos multimedia se han enviado. Los revisaremos y le avisaremos una vez que el cliente final los valide.",
  "upload-ko": "Se ha producido un error en sus cargas",
  "upload-ok": "Sus archivos multimedia se han transmitido correctamente"
}