{
  "billing-manager": "Billing manager",
  "email": "Email",
  "firstname": "First name",
  "lastname": "Last name",
  "member": "Member",
  "owner": "Owner",
  "read-only": "Read only",
  "records-none": "No matching records",
  "role-label": "Role",
  "role-update-confirmation": "The role has been successfully updated",
  "save": "Save"
}