{
  "additional-information-form": {
    "continue": "Continuer",
    "documents": "Documents",
    "mission-details": "Détails du reportage"
  },
  "appointment-date-form": {
    "continue": "Continuer",
    "date-fix-now": "Définir maintenant",
    "date-to-fixed": "À définir avec le Contact sur Place",
    "mission-date": "Date d'affectation"
  },
  "appointment-date-summary": {
    "date-to-fixed": "À définir avec le Contact sur Place"
  },
  "appointment-location-form": {
    "continue": "Continuer",
    "mission-address": "Adresse du reportage"
  },
  "appointment-location-summary": {
    "title": "Lieu de rendez-vous\n"
  },
  "change-date": {
    "appointment": "Modifier la date de rendez-vous",
    "changes-ok": "Modification sauvegardées",
    "date-comment": "Merci de laisser un commentaire justifiant le changement de date",
    "date-confirm": "Confirmer",
    "mission-date": "Date d'affectation",
    "new-appointment": "Veuillez confirmer la nouvelle date de reportage et justifier les raisons du changement ci-dessous.",
    "return": "Retour"
  },
  "contact-form": {
    "continue": "Continuer",
    "email": "E-mail",
    "firstname": "Prénom",
    "is-contact": "Êtes-vous le contact sur place ?\n",
    "lastname": "Nom",
    "no": "non",
    "onsite-contact": "Contact sur place",
    "yes": "oui"
  },
  "contact-list": {
    "company": "Entreprise / Magasin / Commerce\n",
    "contact-fail-landing": "Erreur au cours de l'envoi de la plateforme Contact sur Place",
    "contact-onsite-create-title": "Ajouter les coordonnées du contact",
    "contact-onsite-infos1": "Vous devez modifier les coordonnées de contact ?\n",
    "contact-onsite-infos2": "Nous vous rappelons que ce contact sera la personne en contact avec le créateur de l'image",
    "contact-onsite-update-title": "Modifier les coordonnées de contact\n",
    "contact-primary": "Contact primaire",
    "contact-secondary": "Contact secondaire",
    "contact-succes-landing": "La notification a bien été envoyée à la plateforme Contact sur Place.",
    "contact-tertiary": "Contact tertiaire",
    "contacts": "Contacts",
    "created-by": "Créé par",
    "delete-cancel": "Annuler",
    "delete-confirm": "Confimer",
    "drag-info": "Vous pouvez modifier la priorité de contact en déplaçant la carte",
    "email": "E-mail",
    "first-name": "Prénom",
    "language": "Langue",
    "last-name": "Nom",
    "mission-user-title": "Votre commande de reportage est actuellement en cours de traitement. Nous recherchons le meilleur Créateur d'images pour le réaliser.",
    "phone-1": "Téléphone 1",
    "phone-2": "Téléphone 2",
    "phone-3": "Téléphone 3",
    "send-onsite": "Envoyer la plateforme Contact sur Place",
    "you-are-about-to-cancel-contact": "Vous êtes sur le point d'annuler le contact ci-dessous :\n"
  },
  "contact-summary": {
    "is-contact": "Êtes-vous le contact sur place ?\n",
    "onsite-contact": "Contact sur place ?\n"
  },
  "create-stepper": {
    "add-to-cart": "Ajouter au panier",
    "appointment-date": "Date de reportage",
    "appointment-location": "Lieu du reportage",
    "contact": "Contact",
    "edit": "Éditer",
    "organization": "Organisation",
    "select-organization": "Sélectionner une organisation",
    "step-additional-information": "Informations supplémentaires",
    "step-name": "Nom du reportage",
    "step-offer-choice": "Choix du pack"
  },
  "history": {
    "event-ma-client-rating": "Le Client a accepté et évalué la mission\n",
    "event-ma-contact-infos-update": "Les coordonnées du Contact sur Place ont été mises à jour.",
    "event-ma-deliver": "Les médias ont été livrés au Client\n",
    "event-ma-media-validate": "Le Client a accepté les médias\n",
    "event-ma-upload-open": "Autres médias ou nommages demandés\n",
    "event-sp-call-issue": "Le Créateur d'images n'a pas pu joindre le Contact sur Place.",
    "event-sp-comment-client-ic": "Le Client a laissé un message au Créateur d'Image",
    "event-sp-comment-client-ocus": "Le Client a laissé un message à OCUS",
    "event-sp-comment-ocus-client": "OCUS a laissé un message au Client",
    "event-sp-comment-ocus-client-ic": "OCUS a laissé un message au Créateur d'Image et au Client",
    "event-sp-date-change": "La date du reportage a été modifiée\n",
    "event-sp-failed": "Le reportage n'a pas pu avoir lieu\n",
    "event-sp-missing-info": "Informations demandées par le Créateur d'Image\n",
    "event-sp-refusal": "Le Créateur d'images n'a pas pu définir de date de rendez-vous avec le Contact sur Place.",
    "event-sp-set-date-later": "Le Contact sur Place doit être contacté ultérieurement pour définir une nouvelle date de rendez-vous",
    "event-sp-unblock": "Un problème a été résolu",
    "event-sp-unqualified": "Problème d'attribution signalé par Image Creator",
    "event-wa-activation": "Le reportage est en cours de commande",
    "event-wa-attribution": "Le reportage a été assigné",
    "event-wa-cancel": "Le reportage a été annulé par le Client ou le Contact sur Place",
    "event-wa-contact-call-confirmation": "Le Créateur d'images a confirmé la date de reportage avec le  Contact sur Place.",
    "event-wa-deselection": "Le reportage a été retiré du panier par le Créateur d'Image",
    "event-wa-incomplete-upload": "Le Créateur d'Image a uploadé moins de médias qu'attendu",
    "event-wa-media-treated": "Le reportage a été validé et noté par le client\n",
    "event-wa-unassign": "Le Créateur d'images a été retiré de ce reportage.",
    "event-wa-validate-upload": "Le Créateur d'images a téléchargé tous les médias attendus.",
    "event-wa-waiting-attribution": "Le reportage a été commandé par le Client",
    "event-wa-waiting-media-treatment": "Le reportage est terminé, les médias vont être édités",
    "new-date": "Nouvelle date",
    "prev-date": "Date précédente",
    "title": "Historique",
    "unblock": "Le reportage est déverrouillé"
  },
  "mission-media": {
    "download": "Télécharger",
    "mission-medias": "Détails du reportage"
  },
  "mission-name-form": {
    "continue": "Continuer",
    "name": "Nom du reportage",
    "reference": "Référence",
    "reference-placeholder": "(code, id, référence interne etc.)"
  },
  "mission-status": {
    "accept": "Veuillez consulter et accepter les médias pour les télécharger",
    "download": "Télécharger",
    "feedback-description": "Vous avez refusé les médias de ce reportage",
    "feedback-description2": "Nous ferons de notre mieux pour nous aligner sur vos besoins et vous le ferons savoir une fois\n          les médias sont disponibles pour validation.",
    "feedback-subtitle": "Les médias sont en attente de validation par OCUS",
    "feedback-title": "Nous analysons vos retours",
    "final-validation-description": "La mission est terminée et la postproduction est terminée.",
    "final-validation-title": "Votre contenu est prêt à être validé",
    "help": "Un problème ?",
    "status-final-validation-description": "Nous vous remercions de votre confiance en OCUS",
    "status-final-validation-description2": "Vous avez évalué les médias, vous pouvez maintenant les télécharger",
    "status-final-validation-title": "Votre contenu est disponible !",
    "submit": "Accepter le contenu"
  },
  "mission-tooltip": {
    "cancel": "Annuler le reportage",
    "cancel-comment": "Effacer le commentaire"
  },
  "mission-validation-modal": {
    "alert": "En soumettant vos commentaires, les visuels seront considérés comme refusés et vous\n          ne pas être en mesure de les valider ou de les télécharger jusqu'à une autre action de notre poste\n          équipe de production.",
    "cancel": "Annuler",
    "feedback-label": "Ajoutez vos commentaires ci-dessous\n",
    "feedback-optional": "Optionnel",
    "feedback-placeholder": "Ecrire un commentaire",
    "feedback-required": "Obligatoire",
    "refused-description": "Vous êtes sur le point de refuser les médias",
    "refused-text": "Nous avons besoin de vos commentaires pour traiter votre requête",
    "refused-title": "Dites-nous ce qui ne va pas",
    "submit": "Soumettre",
    "validated-description": "Comment noteriez-vous la prestation d'OCUS ?",
    "validated-label": "Faites-nous savoir ce que nous aurions pu mieux faire.\n",
    "validated-text": "Aidez-nous à améliorer notre produit.\n",
    "validated-title": "Il est temps d'évaluer\n"
  },
  "offer-choice-form": {
    "select": "Sélectionner"
  }
}