{
  "ic-attribution-list": {
    "adress": "Adress",
    "assign": "Assign",
    "assignment-success": "{{firstName}} {{lastName}} have been assigned on assignment {{missionName}}",
    "by-flight": "By Flight",
    "by-road": "By Road",
    "days": "Days",
    "days-help": "Number of days since the last assignment has been computed (any subtypes)",
    "distance": "Distance",
    "distance-flight": "By Flight",
    "distance-km": "Km",
    "distance-road": "By Road",
    "firstname": "name",
    "hidden-columns": "Hidden columns",
    "hide-all": "Hide all",
    "hide-column": "Hide column",
    "ic-activity": "IC Activity",
    "ic-rating": "IC Rating",
    "image-creator": "Image creator",
    "lastname": "lastname",
    "mission-assignment": "Assignment",
    "mission-nb": "Mission NB",
    "mission-notification": "Assignment Notification",
    "mission-number": "Assignment Nb",
    "modal-confirm": "Confirm",
    "modal-mission": "Assignment :",
    "modal-please-confirm": "Please press confirm to proceed.",
    "modal-to-operator": "to operator :",
    "modal-you-are-about-to-assign": "You are about to assign assignment",
    "modal-you-are-about-to-send": "You are about to send a notification to {{selectionNumber}} image creators selected",
    "multi-sub-types": "Multi sub-types",
    "name": "Name",
    "no-data-text": "No data",
    "no-match-text": "No matching data",
    "no-skills": "No skills",
    "notification-date": "Notification Date",
    "notification-nb": "Notification NB",
    "notification-success": "{{firstName}} {{lastName}} have been notified on assignment {{missionName}}",
    "notifications-date": "Notifications Date",
    "notifications-number": "Notifications Nb",
    "notify": "Notify",
    "notify-selection": "Notify selection",
    "ocus-evaluations": "Ocus Evaluations",
    "page-title": "Image Maker Selection",
    "phone": "phone number",
    "phone-number": "Phone Number",
    "rating": "IC Rating",
    "rating-help": "When selecting several product subtypes the rating reported corresponds to the IC overall rating",
    "records-none": "no matching records",
    "registration-date": "Registration date",
    "select-loading-text": "Loading",
    "selected": "selected",
    "show-all": "Show All",
    "skills-validation": "Skills Validation",
    "skills-validation-help": "The skills validation reported conrresponds to the current assignment subtype",
    "success": "Success",
    "validation-date": "Validation date"
  },
  "operator-filters": {
    "360": "360°",
    "drone": "Drone",
    "ic-skills-filters": "IC Skills Filter",
    "include-boost": "Boost",
    "main-filters": "Main Filters",
    "map": "Map°",
    "matterport": "Matterport°",
    "max-distance": "distance max (Km)",
    "mission-number": "Assignment Number Min",
    "no": "No",
    "photo": "Photo",
    "rating": "Image Creator Rating Min",
    "rating-help": "When selecting multiple IC skills the rating reported corresponds to the IC overall rating",
    "skills-validation": "Skills validation",
    "skills-validation-disabled": "The Skills validation is applicable when only one IC\n                     skill filter is selected.",
    "skills-validation-help": "The skills validation reported conrresponds to the current assignment subtype",
    "video": "Video",
    "yes": "Yes"
  },
  "operators-address-filters": {
    "address": "Country or City",
    "city": {
      "ES": "ES",
      "Ezequielview": "Ezequielview",
      "FR": "FR",
      "Glenville": "Glenville",
      "IN": "IN",
      "Lévis-Saint-Nom": "Lévis-Saint-Nom",
      "Paris": "Paris",
      "Port Dawn": "Port Dawn",
      "South Clement": "South Clement"
    }
  },
  "rating-attributes": {
    "boost": "BOOST",
    "boost-info": "By default boost applies for the next 2 days",
    "customer": "CUSTOMER",
    "datepicker-placeholder": "End date",
    "end-date": "END DATE",
    "mission-booster": "Assignment booster",
    "ocus": "OCUS",
    "ocus-tooltip": "Average of the last 4 OCUS ratings on assignments related to the subtype.",
    "ocus-tooltip-score": "OCUS score on an assignment = QC - delay penalty",
    "ocus-validation": "OCUS VALIDATION",
    "title": "Rating by types and subtypes"
  },
  "rating-details": {
    "average": "Average based on the last 4 assignment",
    "customer": "CUSTOMER",
    "date": "Assignment date",
    "name": "Assignment name",
    "no-missions": "There are no assignments for this subtype.",
    "operator": "IC RATING",
    "overall": "Overall rating",
    "please-wait": "Please wait...",
    "rating": "Rating",
    "rating-date": "OCUS rating date",
    "rating-details": "IC Rating details",
    "subtype-rating-details": "Subtype Rating details",
    "types": "type(s)"
  }
}