{
  "equipment-modal": {
    "description": "Podaj pełną nazwę produktu, który chcesz dodać:",
    "info": "Niedokładne informacje mogą opóźnić zatwierdzenie aplikacji.",
    "title": "Produkt nie znajduje się na liście"
  },
  "phone-modal": {
    "change": "zmień",
    "confirm": "Potwierdź",
    "ok": "ok",
    "phone": "numer telefonu",
    "phone-text1": "Potwierdź numer telefonu, korzystając z wiadomości tekstowej z kodem potwierdzającym.",
    "phone-text2": "Dodaj numer telefonu i wprowadź kod potwierdzający otrzymany w wiadomości tekstowej, aby potwierdzić.",
    "phone-text3": "Twój numer telefonu został zweryfikowany.",
    "phone-validation-failed": "Nieprawidłowy numer telefonu",
    "phone-validation-failed-description": "podany kod jest nieprawidłowy. spróbuj ponownie.",
    "phone-verification-success": "Weryfikacja telefoniczna zakończona pomyślnie",
    "phone-verification-success-description": "Twój numer telefonu został zweryfikowany.",
    "send": "wyślij",
    "validation-code": "kod potwierdzający"
  }
}