{
  "learn": "Saiba mais",
  "message-architecture": "As fotografias fantásticas aumentam as reservas na {{organization}}. Confirme hoje mesmo a sua sessão fotográfica!",
  "message-default": "Consiga isso com fotografias incríveis! Confirme hoje mesmo a sua sessão fotográfica!",
  "message-food": "As fotografias apetitosas aumentam as encomendas na {{organization}}. Confirme hoje mesmo a sua sessão fotográfica!",
  "started": "Vamos começar"
}