{
  "edit": {
    "email": "email",
    "firstname": "firstname",
    "language": "languages",
    "languages": "languages",
    "lastname": "lastname",
    "locale": "locale",
    "not-verified": "not verified",
    "phone-1": "phone 1",
    "phone-2": "phone 2",
    "position": "position",
    "roles": "roles",
    "save": "save",
    "sex": "sex",
    "sex-female": "female",
    "sex-male": "male",
    "sex-not-applicable": "not applicable",
    "sex-not-known": "not known",
    "verified": "verified"
  },
  "member-activity": {
    "connection": "Last connection date",
    "mission-date": "Last assignment date",
    "missions-number": "Number of assignments",
    "title": "Activity"
  },
  "member-profile": {
    "edit-general-info": "edit general info",
    "email": "email",
    "general-info": "general info",
    "id": "ID",
    "locale": "locale",
    "name": "name",
    "not-specified": "not specified",
    "not-verified": "not verified",
    "phone-1": "phone 1",
    "phone-2": "phone 2",
    "pin": "PIN",
    "position": "position",
    "roles": "roles",
    "sex": "sex",
    "sex-female": "female",
    "sex-male": "male",
    "sex-not-applicable": "not applicable",
    "sex-not-known": "not known",
    "spoken-languages": "spoken languages",
    "verified": "verified"
  },
  "member-status": {
    "confirm-button": "Confirm",
    "confirm-confirm-to-proceed": "Please press confirm to proceed.",
    "confirm-deactivate-title": "USER STATUS",
    "confirm-user-will-no-longer-have-access-to-its-dashboards": "User will no longer have access to its dashboard, no emails will be sent anymore, no invoices will be sent. Please ensure all ongoing topics are closed with the IC or Customer before proceeding.",
    "confirm-your-about-to-deactivate": "You are about to deactivate user:",
    "description-disabled": "The user is disabled with no access to the map",
    "description-enabled": "The user is active with access to the map",
    "label-disabled": "User disabled",
    "label-enabled": "User enabled",
    "switch-success": "Your modification has been saved"
  },
  "operator-application-card": {
    "accept": "accept",
    "awaiting-validation": "Skills awaiting validation",
    "decline": "decline",
    "refused": "application denied",
    "score": "score",
    "skills": "Please qualify the IC skills before acception this profile"
  },
  "operator-documents-validation-card": {
    "awaiting-validation": "Documents awaiting validation",
    "document-pending": "Pending document",
    "documents-pending": "Pendings documents",
    "documents-uploaded": "Documents uploaded. Not validated",
    "documents-validated": "Documents validated"
  },
  "operator-edit": {
    "accessory": "accessory",
    "address": "Address",
    "biography": "biography",
    "book": "book",
    "custom-equipment": "Other Specified",
    "drone": "drone",
    "lenses": "lenses",
    "location": "location",
    "not-specified": "not specified",
    "operator-edit-camera": "camera",
    "save": "save",
    "skills": "skills",
    "specialties": "specialties"
  },
  "operator-profile": {
    "accessories": "accessories",
    "biography": "biography",
    "book": "book",
    "custom-equipment": "Other Specified",
    "cv": "CV",
    "drone": "drone",
    "edit-cv": "edit CV",
    "equipment": "camera",
    "lenses": "lenses",
    "location": "location",
    "not-specified": "not specified",
    "skills-and-specialties": "skills and specialties"
  },
  "skills-evaluation": {
    "awesome": "awesome",
    "off": "off",
    "on": "on"
  }
}