{
  "ACTIVATED": "ZAMÓWIONO",
  "APPOINTED": "SPOTKANIE POTWIERDZONE",
  "ARCHIVED": "ZARCHIWIZOWANO",
  "ATTRIBUTED": "PRZYPISANO",
  "CANCELED": "ANULOWANO",
  "CREATED": "UTWORZONO",
  "MEDIA_TREATED-can_download": "ZAKOŃCZONO",
  "MEDIA_TREATED-can_download,can_rate": "ZAKOŃCZONO",
  "REFUSED": "ODMOWA DOSTĘPU DO MATERIAŁÓW",
  "UNASSIGNED": "ANULOWANO PRZYPISANIE",
  "WAITING_APPOINTMENT": "OCZEKIWANIE NA SPOTKANIE",
  "WAITING_ATTRIBUTION": "ZAMÓWIONO",
  "WAITING_MEDIA_TREATMENT": "TRWAJĄCA POSTPRODUKCJA",
  "WAITING_MEDIA_TREATMENT-can_deliver": "TRWAJĄCA POSTPRODUKCJA",
  "WAITING_MEDIA_TREATMENT-can_download": "TRWAJĄCA POSTPRODUKCJA",
  "WAITING_MEDIA_TREATMENT-can_upload": "OCZEKIWANIE NA PRZESŁANIE MATERIAŁÓW",
  "WAITING_MEDIA_TREATMENT-can_validate": "TRWAJĄCA POSTPRODUKCJA",
  "WAITING_MEDIA_TREATMENT-can_validate,can_deliver": "TRWAJĄCA POSTPRODUKCJA"
}