{
  "back-to-login": "واپس لاگ ان کریں",
  "confirmation": "تصدیق",
  "password-request-confirmation": "آپ کا شکریہ! اگر یہ ای میل ہمارے ریکارڈز میں موجود ہے، تو آپ کو اپنا پاس ورڈ ری سیٹ کرنے کے لیے ایک ای میل موصول ہوگا",
  "password-reset-request-subtitle": "براہ کرم پاس ورڈ ری سیٹ ای میل حاصل کرنے کے لیے اپنے ای میل پتے کی تصدیق کریں",
  "password-reset-title": "پاس ورڈ ری سیٹ کریں"
}