{
  "helpcenter": "Centro de ajuda.",
  "text": "Se precisar de mais informações, visite nosso",
  "title-403": "Este link não está mais disponível.",
  "title-other": "Você recebeu um link por e-mail. Siga-o para acessar seu espaço."
}