{
  "error-occured": "エラー",
  "hello": "Hello {{firstname}},",
  "mission-section-emotional-empty": "ミッションは日々追加されます。定期的にプラットフォームをチェックしましょう！",
  "mission-section-see-more": "もっと見る",
  "mission-section-sub-title-empty": "プロフィールに不備はありません",
  "mission-section-sub-title-few-suggestion": "提案があります",
  "mission-section-title": "選択できるミッション",
  "subtitle": "Welcome to OCUS!",
  "welcome": "ようこそ"
}