{
  "section-content": "ພວກເຮົາກໍາລັງເລືອກຊ່າງຖ່າຍຮູບທີ່ເກັ່ງທີ່ສຸດສໍາລັບການຖ່າຍຮູບຂອງທ່ານ.\n            ຈະມີລາຍລະອຽດການຕິດຕໍ່ຂອງພວກເຂົາໃນໄວໆນີ້!",
  "section-label": "ວັນທີນັດໝາຍ",
  "section-link-label": "ສົ່ງອອກ",
  "section-text": "ຊ່າງຖ່າຍຮູບຈະໂທຫາທ່ານກ່ອນການຖ່າຍຮູບ\n         ມື້ເພື່ອກວດລາຍລະອຽດດ້ານເຕັກນິກຄັ້ງສຸດທ້າຍ."
}