{
  "support-modal-trigger": {
    "ask-for-help": "Meminta bantuan",
    "claim-cancellation-fees": "Saya ingin menuntut bayaran pembatalan",
    "claim-reshedule-fee": "Saya ingin menuntut bayaran penjadualan semula",
    "confirm": "Sahkan",
    "go-help-center": "Pergi ke Pusat Bantuan",
    "help-center": "Pusat bantuan",
    "leave-comment": "Tinggalkan komen tambahan",
    "please-use-help-center": "Sekiranya anda perlu menghubungi kami, gunakan widget Pusat Bantuan.",
    "use-help-center": "Sekiranya anda perlu menghubungi kami, gunakan widget Pusat Bantuan."
  }
}