<svg xmlns="http://www.w3.org/2000/svg" width="68" height="68" viewBox="0 0 68 68">
  <defs>
    <style>
      .cls-1 {
        fill: #ffae17;
      }

      .cls-2 {
        fill: #fff;
        opacity: 0.2;
      }

      .cls-3 {
        fill: #ffbd3a;
      }

      .cls-4 {
        fill: #e29804;
      }
    </style>
  </defs>
  <g id="组_24903" data-name="组 24903" transform="translate(-36 -482)">
    <g id="组_24745" data-name="组 24745" transform="translate(-4183 -12262)">
      <rect id="矩形_21522" data-name="矩形 21522" class="cls-1" width="68" height="68" rx="10" transform="translate(4219 12744)"/>
      <path id="交叉_941" data-name="交叉 941" class="cls-2" d="M34,68V34H68V58A10,10,0,0,1,58,68Z" transform="translate(4219 12744)"/>
      <path id="交叉_942" data-name="交叉 942" class="cls-3" d="M0,34V0H34V24A10,10,0,0,1,24,34Z" transform="translate(4253 12778) rotate(180)"/>
      <path id="交叉_941-2" data-name="交叉 941" class="cls-3" d="M34,68V34H68V58A10,10,0,0,1,58,68Z" transform="translate(4219 12744)"/>
      <path id="交叉_941-3" data-name="交叉 941" class="cls-3" d="M34,68V34H68V58A10,10,0,0,1,58,68Z" transform="translate(4219 12744)"/>
    </g>
    <path id="减去_3186" data-name="减去 3186" class="cls-4" d="M58,72H10a9.97,9.97,0,0,1-8.41-4.589A9.964,9.964,0,0,0,7,69H55A10.011,10.011,0,0,0,65,59V11a9.965,9.965,0,0,0-1.589-5.411A9.971,9.971,0,0,1,68,14V62A10.012,10.012,0,0,1,58,72Z" transform="translate(36 478)"/>
  </g>
</svg>
