<svg xmlns="http://www.w3.org/2000/svg" xmlns:xlink="http://www.w3.org/1999/xlink" width="48" height="39" viewBox="0 0 48 39">
  <defs>
    <style>
      .cls-1 {
        fill: #fff;
      }

      .cls-2 {
        fill: #b9defb;
      }

      .cls-3, .cls-6 {
        fill: none;
      }

      .cls-3, .cls-4 {
        stroke: #4399ef;
      }

      .cls-3 {
        stroke-width: 1.5px;
      }

      .cls-4 {
        fill: #4399ef;
        stroke-width: 0.2px;
      }

      .cls-5 {
        stroke: none;
      }

      .cls-7 {
        filter: url(#矩形_21602);
      }
    </style>
    <filter id="矩形_21602" x="0" y="0" width="48" height="39" filterUnits="userSpaceOnUse">
      <feOffset input="SourceAlpha"/>
      <feGaussianBlur stdDeviation="2" result="blur"/>
      <feFlood flood-opacity="0.161"/>
      <feComposite operator="in" in2="blur"/>
      <feComposite in="SourceGraphic"/>
    </filter>
  </defs>
  <g id="icon_problem" transform="translate(-321 -22)">
    <g id="组_24805" data-name="组 24805" transform="translate(307 -38)">
      <g class="cls-7" transform="matrix(1, 0, 0, 1, 14, 60)">
        <rect id="矩形_21602-2" data-name="矩形 21602" class="cls-1" width="36" height="27" rx="6" transform="translate(6 6)"/>
      </g>
      <path id="减去_3194" data-name="减去 3194" class="cls-2" d="M-4845,744h-24a5.965,5.965,0,0,1-5.124-2.876A5.988,5.988,0,0,0-4871,742h24a6.007,6.007,0,0,0,6-6V721a5.986,5.986,0,0,0-.876-3.124A5.964,5.964,0,0,1-4839,723v15A6.007,6.007,0,0,1-4845,744Z" transform="translate(4895 -651)"/>
    </g>
    <g id="组_18706" data-name="组 18706" transform="translate(-7 -2)">
      <g id="椭圆_4329" data-name="椭圆 4329" class="cls-3" transform="translate(342 34)">
        <circle class="cls-5" cx="9" cy="9" r="9"/>
        <circle class="cls-6" cx="9" cy="9" r="8.25"/>
      </g>
      <path id="路径_22236" data-name="路径 22236" class="cls-4" d="M3.216-9.1a2.7,2.7,0,0,1,1.872.636,2.152,2.152,0,0,1,.72,1.716,2.317,2.317,0,0,1-.456,1.464,12.285,12.285,0,0,1-1.008.936,2.161,2.161,0,0,0-.72,1.275H2.34c0-1.18.868-1.815,1.62-2.487l.2-.228a1.419,1.419,0,0,0,.34-.877,1.382,1.382,0,0,0-.348-.984,1.38,1.38,0,0,0-1.02-.36,1.332,1.332,0,0,0-1.176.516,2.008,2.008,0,0,0-.324,1.224H.372a2.789,2.789,0,0,1,.756-2.064A2.8,2.8,0,0,1,3.216-9.1ZM3-2.081a.86.86,0,0,1,.636.24.785.785,0,0,1,.252.612.853.853,0,0,1-.264.624A.9.9,0,0,1,3-.365a.847.847,0,0,1-.624-.252.833.833,0,0,1-.252-.612.785.785,0,0,1,.252-.612A.844.844,0,0,1,3-2.081Z" transform="translate(348 48)"/>
    </g>
  </g>
</svg>
