{
  "version": 2,
  "projects": {
    "atoms": "libs/atoms",
    "blog": "apps/blog",
    "catalog": "apps/catalog",
    "e2e": "apps/e2e",
    "emotion": "libs/emotion",
    "gatekeeper": "apps/gatekeeper",
    "home": "apps/home",
    "layout": "libs/layout",
    "model": "libs/model",
    "molecules": "libs/molecules",
    "theme": "libs/theme",
    "utils": "libs/utils"
  }
}
