{
  "version": 2,
  "projects": {
    "waweb": {
      "root": "apps/waweb",
      "sourceRoot": "apps/waweb/src",
      "projectType": "application",
      "targets": {
        "build": {
          "executor": "@nrwl/gatsby:build",
          "options": {
            "outputPath": "apps/waweb/public",
            "uglify": true,
            "color": true,
            "profile": false
          },
          "configurations": {
            "production": {}
          }
        },
        "serve": {
          "executor": "@nrwl/gatsby:server",
          "options": {
            "buildTarget": "waweb:build"
          },
          "configurations": {
            "production": {
              "buildTarget": "waweb:build:production"
            }
          }
        },
        "lint": {
          "executor": "@nrwl/linter:eslint",
          "options": {
            "lintFilePatterns": ["apps/waweb/**/*.{ts,tsx,js,jsx}"]
          }
        },
        "test": {
          "executor": "@nrwl/jest:jest",
          "outputs": ["coverage/apps/waweb"],
          "options": {
            "jestConfig": "apps/waweb/jest.config.js",
            "passWithNoTests": true
          }
        }
      }
    },
    "waweb-e2e": {
      "root": "apps/waweb-e2e",
      "sourceRoot": "apps/waweb-e2e/src",
      "projectType": "application",
      "targets": {
        "e2e": {
          "executor": "@nrwl/cypress:cypress",
          "options": {
            "cypressConfig": "apps/waweb-e2e/cypress.json",
            "tsConfig": "apps/waweb-e2e/tsconfig.e2e.json",
            "devServerTarget": "waweb:serve"
          },
          "configurations": {
            "production": {
              "devServerTarget": "waweb:serve:production"
            }
          }
        },
        "lint": {
          "executor": "@nrwl/linter:eslint",
          "options": {
            "lintFilePatterns": ["apps/waweb-e2e/**/*.{js,ts}"]
          }
        }
      }
    }
  },
  "cli": {
    "defaultCollection": "@nrwl/gatsby"
  },
  "generators": {
    "@nrwl/react": {
      "application": {
        "babel": true
      }
    },
    "@nrwl/gatsby": {
      "application": {
        "style": "css"
      }
    }
  },
  "defaultProject": "waweb"
}
