{
  "$schema": "https://static.bit.dev/teambit/schemas/schema.json",
  "teambit.workspace/workspace": {
    "name": "Design",
    /**
     * set the icon to be shown on the Bit server.
     **/
    "icon": "https://cdn.watheia.org/compendium/v1/icon-gold.png",
    "defaultDirectory": "{name}",
    "defaultScope": "watheia.labs"
  },
  // "teambit.ui-foundation/ui": {
  // "port": 8080,
  // "portRange": [3003, 3100],
  //   "host": "watheia.org",
  //   "publicDir": "public/bit"
  // },
  "teambit.dependencies/dependency-resolver": {
    "packageManager": "teambit.dependencies/pnpm",
    "policy": {
      "dependencies": {
        "@babel/core": "7.14.0",
        "@babel/preset-env": "7.14.1",
        "@babel/preset-react": "7.13.13",
        "@babel/preset-typescript": "7.13.0",
        "@emotion/cache": "11.4.0",
        "@emotion/react": "11.4.0",
        "@emotion/server": "11.4.0",
        "@emotion/styled": "11.3.0",
        "@fontsource/fira-mono": "4.3.0",
        "@material-ui/core": "5.0.0-alpha.33",
        "@material-ui/icons": "5.0.0-alpha.29",
        "@material-ui/styles": "5.0.0-alpha.33",
        "@testing-library/react": "11.2.6",
        "@types/jest": "26.0.23",
        "@types/mocha": "8.2.2",
        "@types/node": "15.0.2",
        "babel-jest": "26.6.3",
        "classnames": "2.3.1",
        "clsx": "1.1.1",
        "core-js": "3.12.0",
        "jest": "26.6.3",
        "next": "10.2.0",
        "react-lazy-load-image-component": "1.5.1",
        "react-test-renderer": "17.0.2",
        "ts-node": "9.1.1",
        "typescript": "4.2.4"
      },
      "peerDependencies": {
        "@types/react": "^17.0.0",
        "@types/react-dom": "^17.0.0",
        "react": "^17.0.0",
        "react-dom": "^17.0.0"
      }
    },
    "packageManagerArgs": [],
    "devFilePatterns": ["**/*.spec.ts"],
    "strictPeerDependencies": true
  },
  "teambit.workspace/variants": {
    "*": {
      "defaultScope": "watheia.labs",
      "teambit.pkg/pkg": {
        "packageManagerPublishArgs": ["--access public"],
        "packageJson": {
          "license": "EPL-2.0",
          "public": true,
          "name": "@watheia/design.{name}",
          "author": "Aaron R Miller <amiller@watheia.org>",
          "homepage": "https://www.watheia.io/home",
          "private": false,
          "engines": {
            "node": ">=12.15.0"
          },
          "repository": {
            "type": "git",
            "url": "https://gitlab.com/watheia/watheia-micro"
          },
          "keywords": [
            "watheia",
            "micro",
            "domain-specific",
            "micro-component",
            "micro-frontend",
            "webcomponent",
            "snowpack",
            "svelte",
            "preact"
          ]
        }
      }
    },
    "documents": {
      "teambit.react/react": {
        "mdx": true
      }
    },
    "theme": {
      "teambit.react/react": {}
    },
    "typography": {
      "teambit.react/react": {}
    }
  }
}
