"Story","Title","Result","Date","Stability","Duration (s)"
"User Library API","Create Library API","SUCCESS","2020-04-07T08:26:28.839-07:00[America/Los_Angeles]","0.0","0.83"
"User Library API","Update Library API","SUCCESS","2020-04-07T08:26:29.676-07:00[America/Los_Angeles]","0.0","0.85"
"User Library API","Delete Library API","SUCCESS","2020-04-07T08:26:30.526-07:00[America/Los_Angeles]","0.0","0.81"
