"Story","Title","Result","Date","Stability","Duration (s)"
"Member Profile UI","Navigate to own profile page","PENDING","2020-04-07T08:27:38.488-07:00[America/Los_Angeles]","0.0","3.82"
"Member Profile UI","Adding member profile attributes","PENDING","2020-04-07T08:27:42.47-07:00[America/Los_Angeles]","0.0","3.13"
