"Story","Title","Result","Date","Stability","Duration (s)"
"Landing Page","View landing page","SUCCESS","2020-04-07T08:27:01.441-07:00[America/Los_Angeles]","0.0","3.13"
"Member Home Page","View member home page","SUCCESS","2020-04-07T08:27:04.737-07:00[America/Los_Angeles]","0.0","8.04"
