"Story","Title","Result","Date","Stability","Duration (s)"
"User Attribute API","Create User Attribute API","SUCCESS","2020-04-07T08:26:23.771-07:00[America/Los_Angeles]","0.0","1.08"
"User Attribute API","Delete User Attribute API (happy path)","SUCCESS","2020-04-07T08:26:24.852-07:00[America/Los_Angeles]","0.0","1.02"
"User Attribute API","Delete User Attribute API (authorize for principal only)","PENDING","2020-04-07T08:26:25.87-07:00[America/Los_Angeles]","0.0","0.0"
"User Attribute API","Count User Attribute API","SUCCESS","2020-04-07T08:26:25.879-07:00[America/Los_Angeles]","0.0","0.98"
"User Attribute API","Find User Attribute API","SUCCESS","2020-04-07T08:26:26.864-07:00[America/Los_Angeles]","0.0","1.02"
"User Attribute API","Update User Attribute API (happy path)","SUCCESS","2020-04-07T08:26:27.883-07:00[America/Los_Angeles]","0.0","0.95"
"User Attribute API","Update User Attribute API (authorize for principal only)","PENDING","2020-04-07T08:26:28.833-07:00[America/Los_Angeles]","0.0","0.0"
