"Story","Title","Result","Date","Stability","Duration (s)"
"Member Login UI","Navigate to login from landing page","SUCCESS","2020-04-07T08:26:31.34-07:00[America/Los_Angeles]","0.0","2.45"
"Member Login UI","Sign in with valid member account (happy path)","SUCCESS","2020-04-07T08:26:33.964-07:00[America/Los_Angeles]","0.0","3.6"
"Member Login UI","Sign in with valid member account (invalid credentials)","PENDING","2020-04-07T08:26:37.739-07:00[America/Los_Angeles]","0.0","3.7"
"Member Login UI","Member logout","SUCCESS","2020-04-07T08:26:41.612-07:00[America/Los_Angeles]","0.0","3.73"
