"Story","Title","Result","Date","Stability","Duration (s)"
"Search API","Search API - search members by name","PENDING","2020-04-07T08:26:20.171-07:00[America/Los_Angeles]","0.0","0.86"
"Search API","Search API - search members by email","PENDING","2020-04-07T08:26:21.038-07:00[America/Los_Angeles]","0.0","0.87"
"Search UI","Search UI - search members by name","PENDING","2020-04-07T08:28:08.489-07:00[America/Los_Angeles]","0.0","3.16"
"Search UI","Search API - search members by email","PENDING","2020-04-07T08:28:11.81-07:00[America/Los_Angeles]","0.0","3.25"
