"Story","Title","Result","Date","Stability","Duration (s)"
"Comment API","Comment API - Top Level","PENDING","2020-04-07T08:26:16.168-07:00[America/Los_Angeles]","0.0","1.15"
"Comment API","Comment API - Reply","PENDING","2020-04-07T08:26:17.317-07:00[America/Los_Angeles]","0.0","0.88"
