"Story","Title","Result","Date","Stability","Duration (s)"
"Member Account UI","Navigate to own account page","SUCCESS","2020-04-07T08:25:57.76-07:00[America/Los_Angeles]","0.0","9.14"
"Member Account UI","Change member user name (happy path)","PENDING","2020-04-07T08:26:07.076-07:00[America/Los_Angeles]","0.0","3.69"
"Member Account UI","Change member password (happy path)","PENDING","2020-04-07T08:26:10.931-07:00[America/Los_Angeles]","0.0","3.62"
"Member Login UI","Navigate to login from landing page","SUCCESS","2020-04-07T08:26:31.34-07:00[America/Los_Angeles]","0.0","2.45"
"Member Login UI","Sign in with valid member account (happy path)","SUCCESS","2020-04-07T08:26:33.964-07:00[America/Los_Angeles]","0.0","3.6"
"Member Login UI","Sign in with valid member account (invalid credentials)","PENDING","2020-04-07T08:26:37.739-07:00[America/Los_Angeles]","0.0","3.7"
"Member Login UI","Member logout","SUCCESS","2020-04-07T08:26:41.612-07:00[America/Los_Angeles]","0.0","3.73"
"Album Content UI","Create a new album","PENDING","2020-04-07T08:26:45.515-07:00[America/Los_Angeles]","0.0","5.21"
"Discussion Content UI","Create a new discussion","PENDING","2020-04-07T08:26:50.906-07:00[America/Los_Angeles]","0.0","5.37"
"Album Content UI","Create a new gallery","PENDING","2020-04-07T08:26:56.45-07:00[America/Los_Angeles]","0.0","4.83"
"Landing Page","View landing page","SUCCESS","2020-04-07T08:27:01.441-07:00[America/Los_Angeles]","0.0","3.13"
"Member Home Page","View member home page","SUCCESS","2020-04-07T08:27:04.737-07:00[America/Los_Angeles]","0.0","8.04"
"Member Libraries UI","Create new library","SUCCESS","2020-04-07T08:27:12.939-07:00[America/Los_Angeles]","0.0","5.93"
"Member Libraries UI","Navigate to library page","SUCCESS","2020-04-07T08:27:19.032-07:00[America/Los_Angeles]","0.0","5.93"
"Member Libraries UI","Delete library","SUCCESS","2020-04-07T08:27:25.14-07:00[America/Los_Angeles]","0.0","7.32"
"Member Libraries UI","Edit library access","SUCCESS","2020-04-07T08:27:32.628-07:00[America/Los_Angeles]","0.0","5.7"
"Member Profile UI","Navigate to own profile page","PENDING","2020-04-07T08:27:38.488-07:00[America/Los_Angeles]","0.0","3.82"
"Member Profile UI","Adding member profile attributes","PENDING","2020-04-07T08:27:42.47-07:00[America/Los_Angeles]","0.0","3.13"
"Member Registration UI","Navigate to registration page from landing page","SUCCESS","2020-04-07T08:27:45.764-07:00[America/Los_Angeles]","0.0","2.42"
"Member Registration UI","Register new member account (happy path)","SUCCESS","2020-04-07T08:27:48.342-07:00[America/Los_Angeles]","0.0","4.32"
"Member Registration UI","Register new member account (password mismatch)","SUCCESS","2020-04-07T08:27:52.825-07:00[America/Los_Angeles]","0.0","8.92"
"Member Registration UI","Register new member account (invalid email)","PENDING","2020-04-07T08:28:01.909-07:00[America/Los_Angeles]","0.0","4.08"
"Member Registration UI","Register new member account (invalid user name)","SUCCESS","2020-04-07T08:28:06.143-07:00[America/Los_Angeles]","0.0","2.18"
"Search UI","Search UI - search members by name","PENDING","2020-04-07T08:28:08.489-07:00[America/Los_Angeles]","0.0","3.16"
"Search UI","Search API - search members by email","PENDING","2020-04-07T08:28:11.81-07:00[America/Los_Angeles]","0.0","3.25"
