"Story","Title","Result","Date","Stability","Duration (s)"
"Member Registration UI","Navigate to registration page from landing page","SUCCESS","2020-04-07T08:27:45.764-07:00[America/Los_Angeles]","0.0","2.42"
"Member Registration UI","Register new member account (happy path)","SUCCESS","2020-04-07T08:27:48.342-07:00[America/Los_Angeles]","0.0","4.32"
"Member Registration UI","Register new member account (password mismatch)","SUCCESS","2020-04-07T08:27:52.825-07:00[America/Los_Angeles]","0.0","8.92"
"Member Registration UI","Register new member account (invalid email)","PENDING","2020-04-07T08:28:01.909-07:00[America/Los_Angeles]","0.0","4.08"
"Member Registration UI","Register new member account (invalid user name)","SUCCESS","2020-04-07T08:28:06.143-07:00[America/Los_Angeles]","0.0","2.18"
