"Story","Title","Result","Date","Stability","Duration (s)"
"Member Account UI","Navigate to own account page","SUCCESS","2020-04-07T08:25:57.76-07:00[America/Los_Angeles]","0.0","9.14"
"Member Account UI","Change member user name (happy path)","PENDING","2020-04-07T08:26:07.076-07:00[America/Los_Angeles]","0.0","3.69"
"Member Account UI","Change member password (happy path)","PENDING","2020-04-07T08:26:10.931-07:00[America/Los_Angeles]","0.0","3.62"
"API Authentication","Sign in with valid admin account","SUCCESS","2020-04-07T08:26:14.744-07:00[America/Los_Angeles]","0.0","0.68"
"API Authentication","Allow restricted api call with valid credentials","SUCCESS","2020-04-07T08:26:15.432-07:00[America/Los_Angeles]","0.0","0.48"
"API Authentication","Deny restricted api call","SUCCESS","2020-04-07T08:26:15.92-07:00[America/Los_Angeles]","0.0","0.24"
"Comment API","Comment API - Top Level","PENDING","2020-04-07T08:26:16.168-07:00[America/Los_Angeles]","0.0","1.15"
"Comment API","Comment API - Reply","PENDING","2020-04-07T08:26:17.317-07:00[America/Los_Angeles]","0.0","0.88"
"Library Content API","Create Content API","PENDING","2020-04-07T08:26:18.203-07:00[America/Los_Angeles]","0.0","0.83"
"Library Content API","Load Content API","PENDING","2020-04-07T08:26:19.035-07:00[America/Los_Angeles]","0.0","1.13"
"User API","Create User API","SUCCESS","2020-04-07T08:26:21.916-07:00[America/Los_Angeles]","0.0","0.9"
"User API","Delete User API","SUCCESS","2020-04-07T08:26:22.824-07:00[America/Los_Angeles]","0.0","0.94"
"User Attribute API","Create User Attribute API","SUCCESS","2020-04-07T08:26:23.771-07:00[America/Los_Angeles]","0.0","1.08"
"User Attribute API","Delete User Attribute API (happy path)","SUCCESS","2020-04-07T08:26:24.852-07:00[America/Los_Angeles]","0.0","1.02"
"User Attribute API","Delete User Attribute API (authorize for principal only)","PENDING","2020-04-07T08:26:25.87-07:00[America/Los_Angeles]","0.0","0.0"
"User Attribute API","Count User Attribute API","SUCCESS","2020-04-07T08:26:25.879-07:00[America/Los_Angeles]","0.0","0.98"
"User Attribute API","Find User Attribute API","SUCCESS","2020-04-07T08:26:26.864-07:00[America/Los_Angeles]","0.0","1.02"
"User Attribute API","Update User Attribute API (happy path)","SUCCESS","2020-04-07T08:26:27.883-07:00[America/Los_Angeles]","0.0","0.95"
"User Attribute API","Update User Attribute API (authorize for principal only)","PENDING","2020-04-07T08:26:28.833-07:00[America/Los_Angeles]","0.0","0.0"
"User Library API","Create Library API","SUCCESS","2020-04-07T08:26:28.839-07:00[America/Los_Angeles]","0.0","0.83"
"User Library API","Update Library API","SUCCESS","2020-04-07T08:26:29.676-07:00[America/Los_Angeles]","0.0","0.85"
"User Library API","Delete Library API","SUCCESS","2020-04-07T08:26:30.526-07:00[America/Los_Angeles]","0.0","0.81"
"Member Login UI","Navigate to login from landing page","SUCCESS","2020-04-07T08:26:31.34-07:00[America/Los_Angeles]","0.0","2.45"
"Member Login UI","Sign in with valid member account (happy path)","SUCCESS","2020-04-07T08:26:33.964-07:00[America/Los_Angeles]","0.0","3.6"
"Member Login UI","Sign in with valid member account (invalid credentials)","PENDING","2020-04-07T08:26:37.739-07:00[America/Los_Angeles]","0.0","3.7"
"Member Login UI","Member logout","SUCCESS","2020-04-07T08:26:41.612-07:00[America/Los_Angeles]","0.0","3.73"
"Album Content UI","Create a new album","PENDING","2020-04-07T08:26:45.515-07:00[America/Los_Angeles]","0.0","5.21"
"Discussion Content UI","Create a new discussion","PENDING","2020-04-07T08:26:50.906-07:00[America/Los_Angeles]","0.0","5.37"
"Album Content UI","Create a new gallery","PENDING","2020-04-07T08:26:56.45-07:00[America/Los_Angeles]","0.0","4.83"
"Landing Page","View landing page","SUCCESS","2020-04-07T08:27:01.441-07:00[America/Los_Angeles]","0.0","3.13"
"Member Home Page","View member home page","SUCCESS","2020-04-07T08:27:04.737-07:00[America/Los_Angeles]","0.0","8.04"
"Member Libraries UI","Create new library","SUCCESS","2020-04-07T08:27:12.939-07:00[America/Los_Angeles]","0.0","5.93"
"Member Libraries UI","Navigate to library page","SUCCESS","2020-04-07T08:27:19.032-07:00[America/Los_Angeles]","0.0","5.93"
"Member Libraries UI","Delete library","SUCCESS","2020-04-07T08:27:25.14-07:00[America/Los_Angeles]","0.0","7.32"
"Member Libraries UI","Edit library access","SUCCESS","2020-04-07T08:27:32.628-07:00[America/Los_Angeles]","0.0","5.7"
"Member Profile UI","Navigate to own profile page","PENDING","2020-04-07T08:27:38.488-07:00[America/Los_Angeles]","0.0","3.82"
"Member Profile UI","Adding member profile attributes","PENDING","2020-04-07T08:27:42.47-07:00[America/Los_Angeles]","0.0","3.13"
"Member Registration UI","Navigate to registration page from landing page","SUCCESS","2020-04-07T08:27:45.764-07:00[America/Los_Angeles]","0.0","2.42"
"Member Registration UI","Register new member account (happy path)","SUCCESS","2020-04-07T08:27:48.342-07:00[America/Los_Angeles]","0.0","4.32"
"Member Registration UI","Register new member account (password mismatch)","SUCCESS","2020-04-07T08:27:52.825-07:00[America/Los_Angeles]","0.0","8.92"
"Member Registration UI","Register new member account (invalid email)","PENDING","2020-04-07T08:28:01.909-07:00[America/Los_Angeles]","0.0","4.08"
"Member Registration UI","Register new member account (invalid user name)","SUCCESS","2020-04-07T08:28:06.143-07:00[America/Los_Angeles]","0.0","2.18"
