{
	"title": "User",
	"properties": {
		"id": {
			"type": "string"
		},
		"email": {
			"type": "string",
			"format": "email",
			"transform": [
				"toLowerCase"
			]
		},
		"userName": {
			"type": "string",
			"minLength": 4,
			"maxLength": 32
		},
		"slug": {
			"type": "string",
			"minLength": 4,
			"maxLength": 32
		},
		"roles": {
			"type": "array",
			"items": {
				"type": "string"
			}
		},
		"libraries": {
			"type": "array",
			"items": {
				"type": "object",
				"properties": {
					"id": {
						"type": "string"
					},
					"slug": {
						"type": "string"
					},
					"userId": {
						"type": "string"
					},
					"access": {
						"type": "string"
					},
					"libraryType": {
						"type": "string"
					},
					"name": {
						"type": "string",
						"minLength": 4,
						"maxLength": 64
					},
					"description": {
						"type": "string"
					},
					"createdDate": {
						"type": "string",
						"format": "date-time"
					},
					"lastUpdate": {
						"type": "string",
						"format": "date-time"
					}
				},
				"required": [
					"id",
					"slug",
					"access",
					"libraryType",
					"name",
					"createdDate",
					"lastUpdate"
				],
				"additionalProperties": false
			}
		}
	},
	"required": [
		"id",
		"email",
		"userName",
		"slug",
		"roles"
	],
	"additionalProperties": false
}