"Story","Title","Result","Date","Stability","Duration (s)"
"Library Content API","Create Content API","PENDING","2020-04-07T08:26:18.203-07:00[America/Los_Angeles]","0.0","0.83"
"Library Content API","Load Content API","PENDING","2020-04-07T08:26:19.035-07:00[America/Los_Angeles]","0.0","1.13"
"User API","Create User API","SUCCESS","2020-04-07T08:26:21.916-07:00[America/Los_Angeles]","0.0","0.9"
"User API","Delete User API","SUCCESS","2020-04-07T08:26:22.824-07:00[America/Los_Angeles]","0.0","0.94"
"User Attribute API","Create User Attribute API","SUCCESS","2020-04-07T08:26:23.771-07:00[America/Los_Angeles]","0.0","1.08"
"User Attribute API","Delete User Attribute API (happy path)","SUCCESS","2020-04-07T08:26:24.852-07:00[America/Los_Angeles]","0.0","1.02"
"User Attribute API","Delete User Attribute API (authorize for principal only)","PENDING","2020-04-07T08:26:25.87-07:00[America/Los_Angeles]","0.0","0.0"
"User Attribute API","Count User Attribute API","SUCCESS","2020-04-07T08:26:25.879-07:00[America/Los_Angeles]","0.0","0.98"
"User Attribute API","Find User Attribute API","SUCCESS","2020-04-07T08:26:26.864-07:00[America/Los_Angeles]","0.0","1.02"
"User Attribute API","Update User Attribute API (happy path)","SUCCESS","2020-04-07T08:26:27.883-07:00[America/Los_Angeles]","0.0","0.95"
"User Attribute API","Update User Attribute API (authorize for principal only)","PENDING","2020-04-07T08:26:28.833-07:00[America/Los_Angeles]","0.0","0.0"
"User Library API","Create Library API","SUCCESS","2020-04-07T08:26:28.839-07:00[America/Los_Angeles]","0.0","0.83"
"User Library API","Update Library API","SUCCESS","2020-04-07T08:26:29.676-07:00[America/Los_Angeles]","0.0","0.85"
"User Library API","Delete Library API","SUCCESS","2020-04-07T08:26:30.526-07:00[America/Los_Angeles]","0.0","0.81"
