"Story","Title","Result","Date","Stability","Duration (s)"
"Library Content API","Create Content API","PENDING","2020-04-07T08:26:18.203-07:00[America/Los_Angeles]","0.0","0.83"
"Library Content API","Load Content API","PENDING","2020-04-07T08:26:19.035-07:00[America/Los_Angeles]","0.0","1.13"
