"Story","Title","Result","Date","Stability","Duration (s)"
"API Authentication","Sign in with valid admin account","SUCCESS","2020-04-07T08:26:14.744-07:00[America/Los_Angeles]","0.0","0.68"
"API Authentication","Allow restricted api call with valid credentials","SUCCESS","2020-04-07T08:26:15.432-07:00[America/Los_Angeles]","0.0","0.48"
"API Authentication","Deny restricted api call","SUCCESS","2020-04-07T08:26:15.92-07:00[America/Los_Angeles]","0.0","0.24"
