{
	"title": "UserAttribute",
	"properties": {
		"id": {
			"type": "string"
		},
		"userId": {
			"type": "string"
		},
		"label": {
			"type": "string"
		},
		"markdown": {
			"type": "string"
		},
		"html": {
			"type": "string"
		}
	},
	"required": [
		"label",
		"markdown",
		"html"
	],
	"additionalProperties": false
}