{
  "title": "Library",
  "properties": {
    "id": {
      "type": "string"
    },
    "slug": {
      "type": "string"
    },
    "userId": {
      "type": "string"
    },
    "access": {
      "type": "string"
    },
    "libraryType": {
      "type": "string"
    },
    "name": {
      "type": "string",
      "minLength": 4,
      "maxLength": 64
    },
    "description": {
      "type": "string"
    },
    "createdDate": {
      "type": "string",
      "format": "date-time"
    },
    "lastUpdate": {
      "type": "string",
      "format": "date-time"
    }
  },
  "required": [
    "id",
    "slug",
    "access",
    "libraryType",
    "name",
    "createdDate",
    "lastUpdate"
  ],
  "additionalProperties": false
}