"Story","Title","Result","Date","Stability","Duration (s)"
"Member Libraries UI","Create new library","SUCCESS","2020-04-07T08:27:12.939-07:00[America/Los_Angeles]","0.0","5.93"
"Member Libraries UI","Navigate to library page","SUCCESS","2020-04-07T08:27:19.032-07:00[America/Los_Angeles]","0.0","5.93"
"Member Libraries UI","Delete library","SUCCESS","2020-04-07T08:27:25.14-07:00[America/Los_Angeles]","0.0","7.32"
"Member Libraries UI","Edit library access","SUCCESS","2020-04-07T08:27:32.628-07:00[America/Los_Angeles]","0.0","5.7"
