"Story","Title","Result","Date","Stability","Duration (s)"
"User API","Create User API","SUCCESS","2020-04-07T08:26:21.916-07:00[America/Los_Angeles]","0.0","0.9"
"User API","Delete User API","SUCCESS","2020-04-07T08:26:22.824-07:00[America/Los_Angeles]","0.0","0.94"
