"Story","Title","Result","Date","Stability","Duration (s)"
"Member Account UI","Navigate to own account page","SUCCESS","2020-04-07T08:25:57.76-07:00[America/Los_Angeles]","0.0","9.14"
"Member Account UI","Change member user name (happy path)","PENDING","2020-04-07T08:26:07.076-07:00[America/Los_Angeles]","0.0","3.69"
"Member Account UI","Change member password (happy path)","PENDING","2020-04-07T08:26:10.931-07:00[America/Los_Angeles]","0.0","3.62"
