"Story","Title","Result","Date","Stability","Duration (s)"
"Album Content UI","Create a new album","PENDING","2020-04-07T08:26:45.515-07:00[America/Los_Angeles]","0.0","5.21"
"Discussion Content UI","Create a new discussion","PENDING","2020-04-07T08:26:50.906-07:00[America/Los_Angeles]","0.0","5.37"
"Album Content UI","Create a new gallery","PENDING","2020-04-07T08:26:56.45-07:00[America/Los_Angeles]","0.0","4.83"
