{
  "title": "User",
  "properties": {
    "id": {
      "type": "string"
    },
    "email": {
      "type": "string",
      "format": "email",
      "transform": [
        "toLowerCase"
      ]
    },
    "userName": {
      "type": "string",
      "minLength": 4,
      "maxLength": 32
    },
    "slug": {
      "type": "string",
      "minLength": 4,
      "maxLength": 32
    },
    "roles": {
      "type": "array",
      "items": {
        "type": "string"
      }
    }
  },
  "additionalProperties": false
}