{
  "name-ux": "{%= name %}-ux",
  "name-ux/Gruntfile.js": "{%= name %}-ux/Gruntfile.js",
  "name-ux/module-include.xml": "{%= name %}-ux/module-include.xml",
  "name-ux/name-ux.gradle": "{%= name %}-ux/{%= gradleFile %}",
  "name-ux/README.md": "{%= name %}-ux/README.md",
  "name-ux/src/com/authorname/name/ClassName.java": "{%= name %}-ux/src/{%= fullClassName.replace(/\\./g, '/') %}.java",
  "name-ux/src/com/authorname/name/ModuleJsBuild.java": "{%= name %}-ux/src/{%= package.replace(/\\./g, '/') %}/B{%= jsBuildName %}.java",
  "name-ux/src/rc/name.css": "{%= name %}-ux/src/rc/{%= name %}.css",
  "name-ux/src/rc/name.less": "{%= name %}-ux/src/rc/{%= name %}.less",
  "name-ux/src/rc/name.js": "{%= name %}-ux/src/rc/{%= name %}.js",
  "name-ux/src/rc/name.htm": "{%= name %}-ux/src/rc/{%= name %}.htm",
  "name-ux/src/rc/name.min.htm": "{%= name %}-ux/src/rc/{%= name %}.min.htm",
  "name-ux/src/rc/name.run.js": "{%= name %}-ux/src/rc/{%= name %}.run.js",
  "name-ux/src/rc/widgetName.css": "{%= name %}-ux/src/rc/{%= widgetName %}.css",
  "name-ux/src/rc/widgetName.js": "{%= name %}-ux/src/rc/{%= widgetName %}.js",
  "name-ux/src/rc/template/name.hbs": "{%= name %}-ux/src/rc/template/{%= name %}.hbs",
  "name-ux/src/rc/template/widgetName-content.hbs": "{%= name %}-ux/src/rc/template/{%= widgetName %}-content.hbs",
  "name-ux/src/rc/template/widgetName-structure.hbs": "{%= name %}-ux/src/rc/template/{%= widgetName %}-structure.hbs",
  "name-ux/srcTest/rc/browserMain.js": "{%= name %}-ux/srcTest/rc/browserMain.js",
  "name-ux/srcTest/rc/spec/allSpecs.js": "{%= name %}-ux/srcTest/rc/spec/allSpecs.js",
  "name-ux/srcTest/rc/spec/nameSpec.js": "{%= name %}-ux/srcTest/rc/spec/{%= name %}Spec.js",
  "name-ux/srcTest/rc/spec/widgetNameSpec.js": "{%= name %}-ux/srcTest/rc/spec/{%= widgetName %}Spec.js",
  "name-ux/srcTest/rc/stations/nameUnitTest/config.bog": "{%= name %}-ux/srcTest/rc/stations/{%= name %}UnitTest/config.bog",
  "name-ux/tutorials/example.json": "{%= name %}-ux/tutorials/example.json",
  "name-ux/tutorials/example.md": "{%= name %}-ux/tutorials/example.md"
}
