{
    "$schema": "http://json-schema.org/draft-04/schema#",
    "type": "object",
    "properties": {
        "VolumesFrom": {
            "$ref": "defs.json#/definitions/ArrayOfStrings"
        },
        "Binds": {
            "$ref": "defs.json#/definitions/ArrayOfStrings"
        },
        "Mounts": {
            "type": "array",
            "items": {
                "$ref": "mount_spec.json"
            }
        },
        "NetworkMode": {
            "type": "string"
        },
        "PortBindings": {
            "$ref": "defs.json#/definitions/mapStringObjectPortBindings"
        },
        "BridgeNetwork": {
            "$ref": "defs.json#/definitions/ArrayOfStrings"
        },
        "IP": {
            "type": "string"
        },
        "MacAddress": {
            "type": "string"
        },
        "GroupAdd": {
            "$ref": "defs.json#/definitions/ArrayOfStrings"
        },
        "IpcMode": {
            "type": "string"
        },
        "PidMode": {
            "type": "string"
        },
        "Privileged": {
            "type": "boolean"
        },
        "SystemContainer": {
            "type": "boolean"
        },
        "NsChangeFiles": {
            "type": "array",
            "items": {
                "type": "string"
            }
        },
        "UserRemap": {
            "type": "string"
        },
        "ShmSize": {
            "type": "int64"
        },
        "AutoRemove": {
            "type": "boolean"
        },
        "AutoRemoveBak": {
            "type": "boolean"
        },
        "ReadonlyRootfs": {
            "type": "boolean"
        },
        "Tmpfs": {
            "$ref": "defs.json#/definitions/mapStringString"
        },
        "UTSMode": {
            "type": "string"
        },
        "UsernsMode": {
            "type": "string"
        },
        "CgroupnsMode": {
            "type": "string"
        },
        "Sysctls": {
            "$ref": "defs.json#/definitions/mapStringString"
        },
        "Runtime": {
            "type": "string"
        },
        "RestartPolicy": {
            "type": "object",
            "properties": {
                "Name": {
                    "type": "string"
                },
                "MaximumRetryCount": {
                    "type": "integer"
                }
            }
        },
        "CapAdd": {
            "type": "array",
            "items": {
                "type": "string"
            }
        },
        "CapDrop": {
            "type": "array",
            "items": {
                "type": "string"
            }
        },
        "Dns": {
            "type": "array",
            "items": {
                "type": "string"
            }
        },
        "DnsOptions": {
            "type": "array",
            "items": {
                "type": "string"
            }
        },
        "DnsSearch": {
            "type": "array",
            "items": {
                "type": "string"
            }
        },
        "ExtraHosts": {
            "type": "array",
            "items": {
                "type": "string"
            }
        },
        "HookSpec": {
            "type": "string"
        },
        "CPUShares": {
            "type": "int64"
        },
        "Memory": {
            "type": "int64"
        },
        "OomScoreAdj": {
            "type": "integer"
        },
        "BlkioWeight": {
            "type": "uint16"
        },
        "BlkioWeightDevice": {
            "$ref": "defs.json#/definitions/ArrayOfBlkioWeightDevice"
        },
        "BlkioDeviceReadBps": {
            "$ref": "defs.json#/definitions/ArrayOfBlkioDevice"
        },
        "BlkioDeviceWriteBps": {
            "$ref": "defs.json#/definitions/ArrayOfBlkioDevice"
        },
        "BlkioDeviceReadIops": {
            "$ref": "defs.json#/definitions/ArrayOfBlkioDevice"
        },
        "BlkioDeviceWriteIops": {
            "$ref": "defs.json#/definitions/ArrayOfBlkioDevice"
        },
        "NanoCpus": {
            "type": "int64"
        },
        "CPUPeriod": {
            "type": "int64"
        },
        "CPUQuota": {
            "type": "int64"
        },
        "CPURealtimePeriod": {
            "type": "int64"
        },
        "CPURealtimeRuntime": {
            "type": "int64"
        },
        "CpusetCpus": {
            "type": "string"
        },
        "CpusetMems": {
            "type": "string"
        },
        "Devices": {
            "type": "array",
            "items": {
                "type": "object",
                "properties": {
                    "CgroupPermissions": {
                        "type": "string"
                    },
                    "PathInContainer": {
                        "type": "string"
                    },
                    "PathOnHost": {
                        "type": "string"
                    }
                }
            }
        },
        "DeviceCgroupRules": {
            "type": "array",
            "items": {
                "type": "string"
            }
        },
        "SecurityOpt": {
            "type": "array",
            "items": {
                "type": "string"
            }
        },
        "StorageOpt": {
            "$ref": "defs.json#/definitions/mapStringString"
        },
        "KernelMemory": {
            "type": "int64"
        },
        "MemoryReservation": {
            "type": "int64"
        },
        "MemorySwap": {
            "type": "int64"
        },
        "MemorySwappiness": {
            "$ref": "defs.json#/definitions/uint64Pointer"
        },
        "OomKillDisable": {
            "type": "boolean"
        },
        "PidsLimit": {
            "type": "int64"
        },
        "FilesLimit": {
            "type": "int64"
        },
        "Ulimits": {
            "type": "array",
            "items": {
                "type": "object",
                "properties": {
                    "Name": {
                        "type": "string"
                    },
                    "Hard": {
                        "type": "int64"
                    },
                    "Soft": {
                        "type": "int64"
                    }
                }
            }
        },
        "Hugetlbs": {
            "type": "array",
            "items": {
                "type": "object",
                "properties": {
                    "PageSize": {
                        "type": "string"
                    },
                    "Limit": {
                        "type": "uint64"
                    }
                }
            }
        },
        "HostChannel": {
            "type": "object",
            "properties": {
                "PathOnHost": {
                    "type": "string"
                },
                "PathInContainer": {
                    "type": "string"
                },
                "Permissions": {
                    "type": "string"
                },
                "Size": {
                    "type": "uint64"
                }
            }
        },
        "EnvTargetFile": {
            "type": "string"
        },
        "ExternalRootfs": {
            "type": "string"
        },
        "CgroupParent": {
            "type": "string"
        }
    }
}