module github.com/aliyun/aliyun-cli

go 1.16

require (
	github.com/alibabacloud-go/tea v1.1.17
	github.com/aliyun/alibaba-cloud-sdk-go v1.61.1546
	github.com/aliyun/aliyun-oss-go-sdk v2.2.2+incompatible
	github.com/aliyun/credentials-go v1.2.1
	github.com/alyu/configparser v0.0.0-20191103060215-744e9a66e7bc
	github.com/baiyubin/aliyun-sts-go-sdk v0.0.0-20180326062324-cfa1a18b161f // indirect
	github.com/droundy/goopt v0.0.0-20220217183150-48d6390ad4d1
	github.com/golang/snappy v0.0.4 // indirect
	github.com/jmespath/go-jmespath v0.4.0
	github.com/kr/text v0.2.0 // indirect
	github.com/onsi/ginkgo v1.16.5
	github.com/onsi/gomega v1.19.0
	github.com/satori/go.uuid v1.2.1-0.20181028125025-b2ce2384e17b // indirect
	github.com/stretchr/testify v1.7.1
	github.com/syndtr/goleveldb v1.0.0
	golang.org/x/crypto v0.0.0-20220331220935-ae2d96664a29
	golang.org/x/time v0.0.0-20220224211638-0e9765cccd65 // indirect
	gopkg.in/check.v1 v1.0.0-20201130134442-10cb98267c6c
	gopkg.in/ini.v1 v1.66.4
)
