module github.com/alibabacloud-go/OpenPlatform-20191219

require (
	github.com/alibabacloud-go/endpoint-util v1.1.0
	github.com/alibabacloud-go/tea v1.1.0
	github.com/alibabacloud-go/tea-rpc v1.1.0
	github.com/alibabacloud-go/tea-utils v1.1.0
)
