module github.com/alibabacloud-go/CS-20151215

require (
	github.com/alibabacloud-go/endpoint-util v1.1.0
	github.com/alibabacloud-go/tea v1.1.0
	github.com/alibabacloud-go/tea-roa v1.1.0
	github.com/alibabacloud-go/tea-utils v1.1.0
)
