module github.com/alibabacloud-go/Dyvmsapi-20170525

require (
	github.com/alibabacloud-go/endpoint-util v1.1.0
	github.com/alibabacloud-go/tea v1.1.0
	github.com/alibabacloud-go/tea-rpc v1.1.0
	github.com/alibabacloud-go/tea-utils v1.1.0
)
