module github.com/alibabacloud-go/ECI-20180808

require (
	github.com/alibabacloud-go/endpoint-util v1.1.0
	github.com/alibabacloud-go/tea v1.1.0
	github.com/alibabacloud-go/tea-rpc v1.1.0
	github.com/alibabacloud-go/tea-utils v1.1.0
	github.com/creack/pty v1.1.10 // indirect
	github.com/kr/pty v1.1.8 // indirect
	github.com/kr/text v0.2.0 // indirect
	github.com/niemeyer/pretty v0.0.0-20200227124842-a10e7caefd8e // indirect
)
