{
  "image": "registry.gitlab.com/wasmkitchen/images/wasm-tools:0.0.6",
  "forwardPorts": [8080,3000,5000],
  "postCreateCommand": "echo 'hello'",
  "customizations": {
    // Configure properties specific to VS Code.
    "vscode": {
      // Add the IDs of extensions you want installed when the container is created.
      "extensions": [
        "golang.go",
        "pkief.material-icon-theme",
        "aaron-bond.better-comments",
        "rust-lang.rust-analyzer"
      ]
    }
  }
}


