// hello.gr

import Process from "sys/process"

print("content-type: text/plain\n")

print("--------- ARGV ---------")
match (Process.argv()) {
  Ok(values) => {
    print(values)
  },
  Err(err) => fail "😡 ouch"
}


print("--------- ENV ---------")

match (Process.env()) {
  Ok(values) => {
    print(values)
  },
  Err(err) => fail "😡 ouch"
}
