%%MatrixMarket matrix coordinate pattern symmetric
146 146 657
2 1
3 1
4 1
5 1
6 1
7 1
8 1
9 1
10 1
11 2
12 2
13 2
14 2
15 2
16 2
17 2
18 2
19 3
20 3
21 3
22 3
23 3
24 3
25 3
26 3
27 4
28 4
29 4
30 4
31 4
32 4
33 4
34 4
35 5
36 5
37 5
38 5
39 5
40 5
41 5
42 5
43 6
44 6
45 6
46 6
47 6
48 6
49 6
50 6
51 7
52 7
53 7
54 7
55 7
56 7
57 7
58 7
59 8
60 8
61 8
62 8
63 8
64 8
65 8
66 8
67 9
68 9
69 9
70 9
71 9
72 9
73 9
74 9
75 10
76 10
77 10
78 10
79 10
80 10
81 10
82 10
83 11
84 11
85 11
86 11
87 11
88 11
89 11
90 11
91 12
92 12
93 12
94 12
95 12
96 12
97 12
98 12
99 13
100 13
101 13
102 13
103 13
104 13
105 13
106 13
107 14
108 14
109 14
110 14
111 14
112 14
113 14
114 14
115 15
116 15
117 15
118 15
119 15
120 15
121 15
122 15
123 16
124 16
125 16
126 16
127 16
128 16
129 16
130 16
131 17
132 17
133 17
134 17
135 17
136 17
137 17
138 17
139 18
140 18
141 18
142 18
143 18
144 18
145 18
146 18
83 19
91 19
99 19
107 19
115 19
123 19
131 19
139 19
84 20
92 20
100 20
108 20
116 20
124 20
132 20
140 20
85 21
93 21
101 21
109 21
117 21
125 21
133 21
141 21
86 22
94 22
102 22
110 22
118 22
126 22
134 22
142 22
87 23
95 23
103 23
111 23
119 23
127 23
135 23
143 23
88 24
96 24
104 24
112 24
120 24
128 24
136 24
144 24
89 25
97 25
105 25
113 25
121 25
129 25
137 25
145 25
90 26
98 26
106 26
114 26
122 26
130 26
138 26
146 26
83 27
92 27
101 27
110 27
119 27
128 27
137 27
146 27
84 28
93 28
102 28
111 28
120 28
129 28
138 28
139 28
85 29
94 29
103 29
112 29
121 29
130 29
131 29
140 29
86 30
95 30
104 30
113 30
122 30
123 30
132 30
141 30
87 31
96 31
105 31
114 31
115 31
124 31
133 31
142 31
88 32
97 32
106 32
107 32
116 32
125 32
134 32
143 32
89 33
98 33
99 33
108 33
117 33
126 33
135 33
144 33
90 34
91 34
100 34
109 34
118 34
127 34
136 34
145 34
83 35
93 35
103 35
113 35
115 35
125 35
135 35
145 35
84 36
94 36
104 36
114 36
116 36
126 36
136 36
146 36
85 37
95 37
105 37
107 37
117 37
127 37
137 37
139 37
86 38
96 38
106 38
108 38
118 38
128 38
138 38
140 38
87 39
97 39
99 39
109 39
119 39
129 39
131 39
141 39
88 40
98 40
100 40
110 40
120 40
130 40
132 40
142 40
89 41
91 41
101 41
111 41
121 41
123 41
133 41
143 41
90 42
92 42
102 42
112 42
122 42
124 42
134 42
144 42
83 43
94 43
105 43
108 43
119 43
130 43
133 43
144 43
84 44
95 44
106 44
109 44
120 44
123 44
134 44
145 44
85 45
96 45
99 45
110 45
121 45
124 45
135 45
146 45
86 46
97 46
100 46
111 46
122 46
125 46
136 46
139 46
87 47
98 47
101 47
112 47
115 47
126 47
137 47
140 47
88 48
91 48
102 48
113 48
116 48
127 48
138 48
141 48
89 49
92 49
103 49
114 49
117 49
128 49
131 49
142 49
90 50
93 50
104 50
107 50
118 50
129 50
132 50
143 50
83 51
95 51
99 51
111 51
115 51
127 51
131 51
143 51
84 52
96 52
100 52
112 52
116 52
128 52
132 52
144 52
85 53
97 53
101 53
113 53
117 53
129 53
133 53
145 53
86 54
98 54
102 54
114 54
118 54
130 54
134 54
146 54
87 55
91 55
103 55
107 55
119 55
123 55
135 55
139 55
88 56
92 56
104 56
108 56
120 56
124 56
136 56
140 56
89 57
93 57
105 57
109 57
121 57
125 57
137 57
141 57
90 58
94 58
106 58
110 58
122 58
126 58
138 58
142 58
83 59
96 59
101 59
114 59
119 59
124 59
137 59
142 59
84 60
97 60
102 60
107 60
120 60
125 60
138 60
143 60
85 61
98 61
103 61
108 61
121 61
126 61
131 61
144 61
86 62
91 62
104 62
109 62
122 62
127 62
132 62
145 62
87 63
92 63
105 63
110 63
115 63
128 63
133 63
146 63
88 64
93 64
106 64
111 64
116 64
129 64
134 64
139 64
89 65
94 65
99 65
112 65
117 65
130 65
135 65
140 65
90 66
95 66
100 66
113 66
118 66
123 66
136 66
141 66
83 67
97 67
103 67
109 67
115 67
129 67
135 67
141 67
84 68
98 68
104 68
110 68
116 68
130 68
136 68
142 68
85 69
91 69
105 69
111 69
117 69
123 69
137 69
143 69
86 70
92 70
106 70
112 70
118 70
124 70
138 70
144 70
87 71
93 71
99 71
113 71
119 71
125 71
131 71
145 71
88 72
94 72
100 72
114 72
120 72
126 72
132 72
146 72
89 73
95 73
101 73
107 73
121 73
127 73
133 73
139 73
90 74
96 74
102 74
108 74
122 74
128 74
134 74
140 74
83 75
98 75
105 75
112 75
119 75
126 75
133 75
140 75
84 76
91 76
106 76
113 76
120 76
127 76
134 76
141 76
85 77
92 77
99 77
114 77
121 77
128 77
135 77
142 77
86 78
93 78
100 78
107 78
122 78
129 78
136 78
143 78
87 79
94 79
101 79
108 79
115 79
130 79
137 79
144 79
88 80
95 80
102 80
109 80
116 80
123 80
138 80
145 80
89 81
96 81
103 81
110 81
117 81
124 81
131 81
146 81
90 82
97 82
104 82
111 82
118 82
125 82
132 82
139 82
