%%MatrixMarket matrix coordinate pattern symmetric
620 620 930
2 1
3 1
4 1
5 2
6 2
7 3
8 3
9 4
10 4
11 5
12 5
13 6
14 6
15 7
16 7
17 8
18 8
19 9
20 9
21 10
22 10
23 11
24 11
25 12
26 12
27 13
28 13
29 14
30 14
31 15
32 15
33 16
34 16
35 17
36 17
37 18
38 18
39 19
40 19
41 20
42 20
43 21
44 21
45 22
46 22
47 23
48 23
49 24
50 24
51 25
52 25
53 26
54 26
55 27
56 27
57 28
58 28
59 29
60 29
61 30
62 30
63 31
64 31
65 32
66 32
67 33
68 33
69 34
70 34
71 35
72 35
73 36
74 36
75 37
76 37
77 38
78 38
79 39
80 39
81 40
82 40
83 41
84 41
85 42
86 42
87 43
88 43
89 44
90 44
91 45
92 45
93 46
94 46
95 47
96 47
97 48
98 48
99 49
100 49
101 50
102 50
103 51
104 51
105 52
106 52
107 53
108 53
109 54
110 54
111 55
112 55
113 56
114 56
115 57
116 57
117 58
118 58
119 59
120 59
121 60
122 60
123 61
124 61
125 62
126 62
127 63
128 63
129 64
130 64
131 65
132 65
133 66
134 66
135 67
136 67
137 68
138 68
139 69
140 69
141 70
142 70
143 71
144 71
145 72
146 72
147 73
148 73
149 74
150 74
151 75
152 75
153 76
154 76
155 77
156 77
157 78
158 78
159 79
160 79
161 80
162 80
163 81
164 81
165 82
166 82
167 83
168 83
169 84
170 84
171 85
172 85
173 86
174 86
175 87
176 87
177 88
178 88
179 89
180 89
181 90
182 90
183 91
184 91
185 92
186 92
187 93
188 93
189 94
190 94
191 95
192 95
193 96
194 96
195 97
196 97
197 98
198 98
199 99
200 99
201 100
202 100
203 101
204 101
205 102
206 102
207 103
208 103
209 104
210 104
211 105
212 105
213 106
214 106
215 107
216 107
217 108
218 108
219 109
220 109
221 110
222 110
223 111
224 111
225 112
226 112
227 113
228 113
229 114
230 114
231 115
232 115
233 116
234 116
235 117
236 117
237 118
238 118
239 119
240 119
241 120
242 120
243 121
244 121
245 122
246 122
247 123
248 123
249 124
250 124
251 125
252 125
253 126
254 126
255 127
256 127
257 128
258 128
259 129
260 129
261 130
262 130
263 131
264 131
265 132
266 132
267 133
268 133
269 134
270 134
271 135
272 135
273 136
274 136
275 137
276 137
277 138
278 138
279 139
280 139
281 140
282 140
283 141
284 141
285 142
286 142
287 143
288 143
289 144
290 144
291 145
292 145
293 146
294 146
295 147
296 147
297 148
298 148
299 149
300 149
301 150
302 150
303 151
304 151
305 152
306 152
307 153
308 153
309 154
310 154
311 155
312 155
313 156
314 156
315 157
316 157
317 158
318 158
319 159
320 159
321 160
322 160
323 161
324 161
325 162
326 162
327 163
328 163
329 164
330 164
331 165
332 165
333 166
334 166
335 167
336 167
337 168
338 168
339 169
340 169
341 170
342 170
343 171
344 171
345 172
346 172
347 173
348 173
349 174
350 174
351 175
352 175
353 176
354 176
355 177
356 177
357 178
358 178
359 179
360 179
361 180
362 180
363 181
364 181
365 182
366 182
367 183
368 183
369 184
370 184
371 185
372 185
373 186
374 186
375 187
376 187
377 188
378 188
379 189
380 189
381 190
382 190
305 191
383 191
384 192
385 192
386 193
387 193
388 194
389 194
390 195
391 195
256 196
392 196
322 197
393 197
296 198
394 198
378 199
395 199
396 200
397 200
292 201
398 201
329 202
399 202
400 203
401 203
402 204
403 204
350 205
404 205
405 206
406 206
371 207
407 207
262 208
408 208
301 209
409 209
410 210
411 210
276 211
412 211
413 212
414 212
415 213
416 213
417 214
418 214
419 215
420 215
359 216
421 216
422 217
423 217
424 218
425 218
380 219
426 219
263 220
427 220
331 221
428 221
429 222
430 222
297 223
431 223
432 224
433 224
434 225
435 225
436 226
437 226
438 227
439 227
272 228
440 228
354 229
441 229
304 230
442 230
346 231
443 231
444 232
445 232
316 233
446 233
361 234
447 234
448 235
449 235
450 236
451 236
382 237
452 237
453 238
454 238
341 239
455 239
278 240
456 240
309 241
457 241
458 242
459 242
460 243
461 243
260 244
462 244
463 245
464 245
465 246
466 246
467 247
468 247
327 248
469 248
470 249
471 249
472 250
473 250
348 251
474 251
279 252
475 252
363 253
476 253
477 254
478 254
479 255
480 255
481 256
482 257
483 257
419 258
441 258
396 259
484 259
485 260
379 261
435 261
486 262
487 263
372 264
469 264
335 265
488 265
458 266
489 266
417 267
490 267
352 268
399 268
450 269
491 269
492 270
493 270
494 271
495 271
496 272
497 273
498 273
393 274
467 274
444 275
499 275
500 276
347 277
387 277
501 278
502 279
342 280
421 280
367 281
503 281
410 282
504 282
465 283
505 283
320 284
447 284
402 285
506 285
507 286
508 286
470 287
509 287
510 288
511 288
339 289
426 289
386 290
512 290
321 291
452 291
513 292
439 293
514 293
358 294
515 294
330 295
466 295
516 296
517 297
429 298
518 298
406 299
455 299
519 300
520 300
521 301
522 302
523 302
362 303
418 303
524 304
525 305
477 306
526 306
407 307
454 307
527 308
528 308
529 309
530 310
531 310
422 311
532 311
533 312
534 312
374 313
474 313
434 314
535 314
353 315
404 315
536 316
391 317
537 317
326 318
538 318
477 319
539 319
540 320
462 321
493 322
487 323
522 323
437 324
541 324
401 325
542 325
408 326
543 327
410 328
544 328
496 329
448 330
524 331
510 332
545 332
385 333
446 333
482 334
546 334
442 335
472 336
547 336
495 337
536 337
415 338
548 338
549 339
396 340
550 340
534 341
383 342
528 343
551 343
427 344
461 344
507 345
552 345
486 346
425 347
521 348
439 349
553 349
554 350
429 351
555 351
556 352
412 353
508 354
502 355
530 355
389 356
557 356
449 357
558 357
456 358
559 359
458 360
560 360
481 361
400 362
516 363
533 364
561 364
398 365
433 365
497 366
562 366
394 367
424 368
563 368
480 369
513 369
463 370
564 370
511 371
431 372
444 373
565 373
566 374
520 375
567 375
414 376
475 376
492 377
568 377
501 378
473 379
529 380
391 381
569 381
570 382
431 383
473 384
571 384
514 385
544 386
453 387
485 388
519 388
572 389
510 390
573 390
527 392
574 392
535 393
442 394
551 395
575 395
522 397
576 397
547 398
474 399
460 400
518 401
577 402
546 403
570 403
469 404
435 405
578 405
539 406
505 407
456 408
498 409
579 409
492 411
580 411
462 412
448 413
581 413
489 414
582 415
483 416
517 416
569 417
468 418
565 419
466 420
583 420
452 421
584 422
543 423
567 423
484 424
432 425
447 426
558 427
562 428
585 428
480 430
586 430
587 432
537 433
560 434
500 436
527 436
588 437
533 438
580 438
519 440
589 440
512 441
567 443
590 443
530 445
576 445
563 446
526 449
591 450
554 451
562 451
592 453
555 454
490 455
483 457
593 457
507 459
573 459
594 460
504 461
595 463
498 464
525 464
553 465
550 467
596 468
597 470
551 471
559 471
499 472
542 475
546 476
598 476
495 478
586 478
534 479
581 479
521 481
599 482
600 484
585 485
516 486
561 487
557 488
579 488
601 489
602 490
549 491
564 491
531 493
511 494
594 494
529 496
603 497
604 499
598 500
524 501
545 502
541 503
593 503
605 504
606 505
548 506
566 506
523 508
541 509
556 509
607 512
552 513
601 514
548 515
574 515
575 517
604 518
608 520
571 523
590 525
600 526
609 528
587 531
540 532
557 532
610 535
568 536
605 537
564 538
589 538
611 539
575 540
607 542
574 543
612 544
578 545
606 547
598 549
613 550
596 552
614 553
593 554
613 555
590 556
610 558
589 559
612 560
592 561
602 563
611 565
585 566
583 568
614 569
579 570
591 571
588 572
596 572
615 573
616 576
587 577
597 577
595 578
617 580
597 581
592 582
595 582
588 583
591 584
594 584
618 586
608 599
610 599
615 600
619 601
609 602
607 603
609 603
617 604
620 605
608 606
620 611
618 612
619 613
616 614
617 615
618 616
620 619
