<?xml version="1.0" encoding="UTF-8" standalone="no"?>
<!-- Created with Inkscape (http://www.inkscape.org/) -->

<svg
   width="112"
   height="112"
   viewBox="0 0 29.633333 29.633333"
   version="1.1"
   id="svg5"
   xmlns:xlink="http://www.w3.org/1999/xlink"
   xmlns="http://www.w3.org/2000/svg"
   xmlns:svg="http://www.w3.org/2000/svg">
  <defs
     id="defs2">
    <linearGradient
       id="linearGradient3665">
      <stop
         style="stop-color:#000000;stop-opacity:1;"
         offset="0.72785413"
         id="stop3661" />
      <stop
         style="stop-color:#000000;stop-opacity:0;"
         offset="1"
         id="stop3663" />
    </linearGradient>
    <linearGradient
       id="linearGradient1045">
      <stop
         style="stop-color:#000000;stop-opacity:0.43929204;"
         offset="0"
         id="stop1041" />
      <stop
         style="stop-color:#000000;stop-opacity:0;"
         offset="1"
         id="stop1043" />
    </linearGradient>
    <linearGradient
       id="linearGradient1029">
      <stop
         style="stop-color:#ffffff;stop-opacity:1;"
         offset="0"
         id="stop1027" />
      <stop
         style="stop-color:#000000;stop-opacity:0;"
         offset="1"
         id="stop1025" />
    </linearGradient>
    <linearGradient
       id="linearGradient1017">
      <stop
         style="stop-color:#000000;stop-opacity:1;"
         offset="0"
         id="stop1013" />
      <stop
         style="stop-color:#000000;stop-opacity:0;"
         offset="1"
         id="stop1015" />
    </linearGradient>
    <radialGradient
       xlink:href="#linearGradient1017"
       id="radialGradient1019"
       cx="14.816667"
       cy="14.816667"
       fx="14.816667"
       fy="14.816667"
       r="7.897625"
       gradientUnits="userSpaceOnUse"
       gradientTransform="matrix(1.6234434,0,0,1.6234434,-9.2373552,-9.2373537)" />
    <radialGradient
       xlink:href="#linearGradient1029"
       id="radialGradient1035"
       cx="14.816667"
       cy="14.816667"
       fx="14.816667"
       fy="14.816667"
       r="1.233884"
       gradientUnits="userSpaceOnUse" />
    <radialGradient
       xlink:href="#linearGradient1045"
       id="radialGradient1047"
       cx="14.816667"
       cy="14.816667"
       fx="14.816667"
       fy="14.816667"
       r="7.897625"
       gradientUnits="userSpaceOnUse" />
    <filter
       style="color-interpolation-filters:sRGB"
       id="filter3669"
       x="-0.087830625"
       y="-0.095865898"
       width="1.1757526"
       height="1.1917305">
      <feGaussianBlur
         stdDeviation="0.76327843"
         id="feGaussianBlur3671" />
    </filter>
    <radialGradient
       xlink:href="#linearGradient3665"
       id="radialGradient3731"
       cx="13.915266"
       cy="15.864431"
       fx="13.915266"
       fy="15.864431"
       r="13.134636"
       gradientTransform="matrix(1,0,0,0.92960482,0,1.1167795)"
       gradientUnits="userSpaceOnUse" />
  </defs>
  <g
     id="layer1">
    <circle
       style="fill:url(#radialGradient1019);fill-opacity:1;stroke-width:0.429535"
       id="path171-3"
       cx="14.816667"
       cy="14.816667"
       r="12.821347" />
    <circle
       style="fill:url(#radialGradient1047);fill-opacity:1;stroke-width:0.264583"
       id="path171"
       cx="14.816667"
       cy="14.816667"
       r="7.897625" />
    <circle
       style="fill:url(#radialGradient1035);fill-opacity:1;stroke-width:0.264583"
       id="path1023"
       cx="14.816667"
       cy="14.816667"
       r="1.233884" />
    <path
       style="opacity:1;fill:none;fill-rule:evenodd;stroke:url(#radialGradient3731);stroke-width:0.264583;filter:url(#filter3669)"
       id="path3635"
       d="m 14.840081,14.860844 c -0.584974,0.156743 -0.499892,-0.711202 -0.260518,-0.972266 0.648691,-0.707466 1.763427,-0.23781 2.205049,0.45123 0.789959,1.23253 0.04882,2.820901 -1.162977,3.437832 -1.778362,0.905371 -3.895656,-0.137652 -4.670615,-1.874725 -1.0328999,-2.315245 0.322563,-4.976928 2.586472,-5.9033983 2.848898,-1.1658684 6.061401,0.5065703 7.136182,3.2982193 1.301703,3.381062 -0.690034,7.147697 -4.009968,8.368965 C 12.751279,23.105924 8.4285766,20.793549 7.0619581,16.944987 5.4841428,12.501669 8.1180011,7.6216636 12.49542,6.1104551 17.469322,4.393324 22.90747,7.349229 24.562735,12.255665 26.419693,17.759944 23.141345,23.756828 17.705778,25.555763 11.671268,27.552921 5.1152087,23.951843 3.1728965,17.987058 2.986008,17.413129 2.8422905,16.825193 2.742987,16.229832" />
  </g>
</svg>
