module telegraf_input_libvirt

go 1.18

require (
	github.com/influxdata/telegraf v1.24.0
	github.com/libvirt/libvirt-go v7.4.0+incompatible
)

require (
	github.com/BurntSushi/toml v1.2.0 // indirect
	github.com/alecthomas/participle v0.4.1 // indirect
	github.com/alecthomas/units v0.0.0-20210208195552-ff826a37aa15 // indirect
	github.com/benbjohnson/clock v1.3.0 // indirect
	github.com/blues/jsonata-go v1.5.4 // indirect
	github.com/caio/go-tdigest v3.1.0+incompatible // indirect
	github.com/coreos/go-semver v0.3.0 // indirect
	github.com/fatih/color v1.13.0 // indirect
	github.com/gobwas/glob v0.2.3 // indirect
	github.com/gogo/protobuf v1.3.2 // indirect
	github.com/golang/protobuf v1.5.2 // indirect
	github.com/golang/snappy v0.0.4 // indirect
	github.com/gosnmp/gosnmp v1.34.0 // indirect
	github.com/influxdata/toml v0.0.0-20190415235208-270119a8ce65 // indirect
	github.com/mattn/go-colorable v0.1.12 // indirect
	github.com/mattn/go-isatty v0.0.14 // indirect
	github.com/matttproud/golang_protobuf_extensions v1.0.2-0.20181231171920-c182affec369 // indirect
	github.com/naoina/go-stringutil v0.1.0 // indirect
	github.com/philhofer/fwd v1.1.1 // indirect
	github.com/prometheus/client_model v0.2.0 // indirect
	github.com/prometheus/common v0.37.0 // indirect
	github.com/prometheus/prometheus v1.8.2-0.20210430082741-2a4b8e12bbf2 // indirect
	github.com/sleepinggenius2/gosmi v0.4.4 // indirect
	github.com/tinylib/msgp v1.1.6 // indirect
	github.com/wavefronthq/wavefront-sdk-go v0.10.2 // indirect
	golang.org/x/sys v0.0.0-20220804214406-8e32c043e418 // indirect
	google.golang.org/protobuf v1.28.1 // indirect
)
