42 18509 279
6335 32835 308
19170 34894 311
11479 40837 324
26963 51427 324
5706 33851 308
23282 40109 324
9962 10453 255
2996 14938 276
4828 10264 262
32392 46996 324
3903 4056 189
293 12675 268
17422 36138 324
19719 39614 324
5448 27174 308
14772 26310 282
1870 21782 279
25668 51967 324
17036 26930 308
28704 52515 324
31323 61656 340
17674 22338 274
15142 22853 279
28254 35122 311
25548 53192 340
32663 65420 340
20038 32897 308
8724 18465 279
27530 28308 259
12317 15352 276
22191 24033 282
289 30395 308
9041 17983 279
19265 41913 324
27447 51252 324
15891 22620 279
24371 39721 324
15007 46108 324
24394 27942 308
19630 32253 308
24085 44039 324
18757 30597 308
4967 12343 268
13932 40240 324
16945 49384 324
24627 35950 324
5538 27076 308
16119 18201 279
22930 39471 324
4834 35949 324
4640 34298 311
22705 32635 308
13978 16284 271
31674 54060 340
5022 33767 308
26925 45997 324
6271 12100 268
26778 42351 324
5098 21610 279
23987 37277 324
9162 27798 308
22356 47123 324
23656 39230 324
4032 16084 276
27351 28501 259
16942 38666 324
13967 17397 271
31108 61299 340
18008 29345 308
15458 27745 308
27754 38137 324
14946 23855 282
32210 41968 324
24222 42810 324
6423 31369 308
27507 40537 324
16414 45582 324
901 33492 308
18763 20418 274
17411 23770 282
27625 48162 324
21549 28032 308
27596 31637 285
3603 27953 308
10292 41128 324
9375 20395 279
4597 28618 308
27349 50548 324
19669 44153 324
8282 13016 268
54 2053 182
26419 54357 340
6901 10689 260
18128 18595 261
3729 18622 279
24649 47132 324
17808 20229 274
14311 20928 279
22814 32328 308
14310 21926 279
18936 36387 324
20601 25850 282
16520 48076 324
22799 53102 340
6225 17233 276
5845 38454 324
14990 47692 324
3196 23681 282
3094 17437 276
30524 32111 285
29315 38818 324
7449 32649 308
13459 20077 279
20581 40377 324
14799 30080 308
19590 40388 324
28010 55167 340
20473 44095 324
18539 30831 308
6039 30218 308
18191 47848 324
7959 14150 276
19816 42704 324
19157 30668 308
16203 18837 279
24273 44328 324
20329 42975 324
26363 31249 308
18876 47309 324
29870 50012 324
23845 25261 264
21882 53880 340
10323 28974 308
10022 15721 276
3558 32034 308
27893 52282 324
5076 15788 276
2601 5111 238
21004 47873 324
17862 32550 308
13402 23191 279
15256 31679 308
5003 15588 276
24183 34468 311
27089 58515 340
28618 52375 324
9833 40765 324
4170 6324 262
25722 42911 324
19977 51306 324
2369 31061 308
21426 31981 308
3435 19984 279
7442 16954 276
30146 48206 324
21719 25472 282
16140 28563 308
16280 42276 324
16688 29217 308
22550 39987 324
19867 32816 308
194 23389 279
3298 23714 282
28287 44392 324
24489 40771 324
12456 38190 324
18115 29816 308
31317 51988 324
5787 18050 279
4314 28669 308
31186 51239 324
913 11721 268
1833 22778 279
4314 32070 308
28322 47880 324
23647 51629 324
482 4626 238
23197 43419 324
7130 9291 260
5536 25986 282
11174 21640 279
12045 33704 308
26293 52732 340
17254 37278 324
26155 55665 340
4746 25395 282
13187 21500 279
4475 32497 308
2169 16187 276
18788 28693 308
17959 25350 282
10203 13828 276
26478 30892 308
9315 35139 311
29335 55209 340
24373 44532 324
11834 39904 324
7488 35785 324
7519 15696 276
17774 50044 324
1764 4432 238
17193 31178 308
3103 11583 268
29214 36841 324
4803 8902 262
30528 33153 285
1544 3468 217
11024 40996 324
13062 27243 308
31004 58436 340
17506 45099 324
22726 35757 324
8493 8635 203
17223 48509 324
13065 20965 279
19188 27548 308
22414 53388 340
14271 43441 324
236 31069 308
19712 45472 324
18897 23564 282
7286 19836 279
141 13835 276
2696 24320 282
28020 30145 272
26577 48271 324
22659 48961 324
17372 39838 324
4679 27272 308
23852 49336 324
1019 29483 308
21120 44272 324
2801 20888 279
31061 32987 285
9011 13768 276
32171 52486 324
9577 39804 324
12044 34802 311
7165 12274 268
7883 24969 282
29566 33053 285
29578 44052 324
2626 28253 308
5630 37558 324
25424 53944 340
6903 21865 279
124 24720 282
3738 16999 276
10196 42721 324
