<?xml version="1.0" encoding="UTF-8"?>
<svg width="12px" height="24px" viewBox="0 0 12 24" version="1.1" 
    xmlns="http://www.w3.org/2000/svg" 
    xmlns:xlink="http://www.w3.org/1999/xlink">
    <!-- Generator: Sketch 58 (84663) - https://sketch.com -->
    <title>right copy 3</title>
    <desc>Created with Sketch.</desc>
    <g id="Page-7-All-Page-Final" stroke="none" stroke-width="1" fill="none" fill-rule="evenodd">
        <g id="right-copy-3" transform="translate(6.000000, 12.000000) scale(1, -1) rotate(-270.000000) translate(-6.000000, -12.000000) translate(-6.000000, 6.000000)" fill="#364546" fill-rule="nonzero">
            <path d="M17.2975132,5.61962029 L7.16819366,-5.37709931 C7.03779324,-5.51811393 6.83815672,-5.56387868 6.6636852,-5.49009926 C6.48921367,-5.41770937 6.375,-5.24168763 6.375,-5.04652627 L6.375,-3.13404355 C6.375,-3.01172032 6.41997757,-2.89405872 6.50091129,-2.80535309 L14.4890914,5.95014851 L6.50095446,14.7056949 C6.42002073,14.7944006 6.375,14.9120622 6.375,15.0343854 L6.375,16.9468681 C6.375,17.1420295 6.48925684,17.3180512 6.66372836,17.3904411 C6.71949709,17.4137941 6.77794203,17.425 6.83548051,17.425 C6.95867243,17.425 7.07918814,17.3736323 7.16819366,17.2774412 L17.2975132,6.28076638 C17.4674956,6.09586959 17.4674956,5.80451708 17.2975132,5.61962029 Z" id="Path" transform="translate(11.900000, 5.950000) rotate(-90.000000) translate(-11.900000, -5.950000) "></path>
        </g>
    </g>
</svg>