<?xml version="1.0" encoding="utf-8"?>
<!-- Generator: Adobe Illustrator 21.0.0, SVG Export Plug-In . SVG Version: 6.00 Build 0)  -->
<svg version="1.1" id="Layer_1" xmlns="http://www.w3.org/2000/svg" xmlns:xlink="http://www.w3.org/1999/xlink" x="0px" y="0px"
	 viewBox="0 0 36 50" style="enable-background:new 0 0 36 50;" xml:space="preserve">
<style type="text/css">
	.st0{fill:#FFFFFF;}
</style>
<g>
	<g>
		<path class="st0" d="M31.8,48.7c0,0.7-0.7,1.3-1.4,1.3H5.5c-0.7,0-1.3-0.6-1.4-1.3L1.8,16.2C1.8,15.6,2.3,15,3,15h30
			c0.7,0,1.2,0.6,1.2,1.3L31.8,48.7z"/>
	</g>
	<g>
		<path class="st0" d="M35.7,8.7c0-0.7-0.6-1.3-1.3-1.3H1.6C0.9,7.4,0.3,8,0.3,8.7v3.2c0,0.7,0.6,1.3,1.3,1.3h32.8
			c0.7,0,1.3-0.6,1.3-1.3V8.7z"/>
	</g>
	<path class="st0" d="M25.6,8.2h-3.8V3.8h-7.6v4.4h-3.8V3.1c0-1.7,1.4-3.1,3.1-3.1h9c1.7,0,3.1,1.4,3.1,3.1V8.2z"/>
</g>
</svg>
