{
  "$schema": "https://raw.githubusercontent.com/todogroup/repolinter/master/rulesets/schema.json",
  "version": 2,
  "axioms": {
    "linguist": "language",
    "licensee": "license",
    "packagers": "packager"
  },
  "rules": {
    "license-file-exists": {
      "level": "error",
      "rule": {
        "type": "file-existence",
        "options": {
          "globsAny": ["LICENSE*", "COPYING*"],
          "nocase": true
        }
      }
    },
    "readme-file-exists": {
      "level": "error",
      "rule": {
        "type": "file-existence",
        "options": {
          "globsAny": ["README*"],
          "nocase": true
        }
      }
    },
    "changelog-file-exists": {
      "level": "error",
      "rule": {
        "type": "file-existence",
        "options": {
          "globsAny": ["CHANGELOG*"],
          "nocase": true
        }
      }
    },
    "binaries-not-present": {
      "level": "error",
      "rule": {
        "type": "file-type-exclusion",
        "options": {
          "type": ["**/*.exe", "**/*.dll", "!node_modules/**"]
        }
      }
    },
    "integrates-with-ci": {
      "level": "error",
      "rule": {
        "type": "file-existence",
        "options": {
          "globsAny": [
            ".gitlab-ci.yml",
            ".travis.yml",
            "appveyor.yml",
            ".appveyor.yml",
            "circle.yml",
            ".circleci/config.yml",
            "Jenkinsfile",
            ".drone.yml",
            ".github/workflows/*",
            "azure-pipelines.yml"
          ]
        }
      }
    },
    "license-detectable-by-licensee": {
      "level": "off",
      "where": ["license=*"],
      "rule": {
        "type": "license-detectable-by-licensee",
        "options": {}
      }
    },
    "terraform-deployment-providers": {
      "level": "error",
      "rule": {
        "type": "file-existence",
        "options": {
          "globsAny": ["providers.tf"],
          "fail-message": "The providers.tf file is mandatory for terraform deployment repositories."
        }
      }
    },
    "terraform-deployment-outputs": {
      "level": "error",
      "rule": {
        "type": "file-existence",
        "options": {
          "globsAny": ["outputs.tf"],
          "fail-message": "The outputs.tf file is mandatory for terraform deployment repositories."
        }
      }
    },
    "terraform-deployment-versions": {
      "level": "error",
      "rule": {
        "type": "file-existence",
        "options": {
          "globsAny": ["versions.tf"],
          "fail-message": "The versions.tf file is mandatory for terraform deployment repositories."
        }
      }
    },
    "terraform-deployment-variables": {
      "level": "error",
      "rule": {
        "type": "file-existence",
        "options": {
          "globsAny": ["variables.tf"],
          "fail-message": "The variables.tf file is mandatory for terraform deployment repositories."
        }
      }
    },
    "terraform-deployment-file": {
      "level": "error",
      "rule": {
        "type": "file-existence",
        "options": {
          "globsAny": ["deploy.tf"],
          "fail-message": "The deploy.tf file is mandatory for terraform deployment repositories."
        }
      }
    },
    "notice-file-exists": {
      "level": "error",
      "where": ["license=Apache-2.0"],
      "rule": {
        "type": "file-existence",
        "options": {
          "globsAny": ["NOTICE*"],
          "fail-message": "The NOTICE file is described in section 4.4 of the Apache License version 2.0. Its presence is not mandated by the license itself, but by ASF policy."
        }
      }
    }
  }
}
