<svg xmlns='http://www.w3.org/2000/svg' version='1.1' xmlns:xlink="http://www.w3.org/1999/xlink" height = '60px' width = '210px'>
  <style>
    use {
      fill: #559cd6;
    }

    text {
      font-family: 'Arial';
      font-weight: bold;
      font-style: italic;
      font-size: 30px
    }
  </style>

  <defs>
    <g id='textBg'>
      <text x='0' y='50%'>KLANGSTOF</text>
      <text x='-50%' y='100%'>KLANGSTOF</text>
      <text x='50%' y='100%'>KLANGSTOF</text>
    </g>
  </defs>

  <use xlink:href='#textBg' />
</svg>