{
  "beta": {
    "zipCodes": {
      "$zipCode": {
        "enabled": "true/false"
      }
    }
  },
  "categories": {
    "$categoryID": {
      "parent": "parent category",
      "child": "child category"
    }
  },
  "eventsPrivate": {
    "$eventID": {
      "owner": "$userPublicID",
      "name": "Name of event",
      "description": "Description of event",
      "addressName": "Name of location",
      "address": "Address of event",
      "startTime": "Start time of event: EEE MMM d yyyy HH:mm:ss Z",
      "endTime": "End time of event: EEE MMM d yyyy HH:mm:ss Z",
      "category": "$categoryID",
      "coverPic": "!!",
      "prices": {
        "$priceID": {
          "name": "Name of price",
          "cost": "Cost in USD"
        }
      },
      "url": "URL for site"
    }
  },
  "eventsPublic": {
    "$eventID": {
      "owner": "$userPublicID",
      "name": "Name of event",
      "description": "Description of event",
      "addressName": "Name of location",
      "address": "Address of event",
      "startTime": "Start time of event: EEE MMM d yyyy HH:mm:ss Z",
      "endTime": "End time of event: EEE MMM d yyyy HH:mm:ss Z",
      "category": "$categoryID",
      "coverPic": "!!",
      "prices": {
        "$priceID": {
          "name": "Name of price",
          "cost": "Cost in USD"
        }
      },
      "url": "URL for site"
    }
  },
  "eventTags": {
    "$eventID": {
      "$tagID": true
    }
  },
  "legal": {
    "tAndAs": {
      "$tAndAID": {
        "tAndA": "The terms and agreements for a user",
        "active": "Boolean to enable"
      }
    }
  },
  "locations": {
    "$eventID": {
      "g": "Randomly generated GeoFire info",
      "l": {
        "0": "latitude",
        "1": "longitude"
      }
    }
  },
  "tags": {
    "$tagID": {
      "tag": "tag itself",
      "used": "Integer of times used",
      "firstUser": "$userPublicID"
    }
  },
  "userNames": {
    "$userName": {
      "active": "True/false",
      "user": "$userPublicID"
    }
  },
  "usersMappings": {
    "$userID": {
      "events": {
        "$eventID": true
      }
    }
  },
  "usersPrivate": {
    "$userID": {
      "email": "Email address for the account",
      "beta": {
        "zipCode": "Current zip code, matched against validZipCodes",
        "access": "true/false if match validZipCodes"
      },
      "tAndA": "true/false if accepted",
      "resets": {
        "date": "Date of password reset"
      },
      "secret": {
        "firstName": "First name",
        "lastName": "Last name",
        "birthday": "Date of birth",
        "gender": "Gender",
        "bio": "Description of the user, by the user",
        "profilePic": "!!",
        "created": "Date created"
      },
      "public": "$userPublicID",
      "created": "Date created"
    }
  },
  "usersPublic": {
    "$userPublicID": {
      "userName": "$userNameID",
      "firstName": "First name",
      "lastName": "Last name",
      "birthday": "Date of birth",
      "gender": "Gender",
      "bio": "Description of the user, by the user",
      "profilePic": "!!",
      "created": "Date created"
    }
  },
  "usersTelecomm": {
    "$userPublicID": {
      "CC": "Country code",
      "tele": "hashed phone number w/o country code",
      "verified": "true/false for verified or unverified"
    }
  }
}