^D:\UE_PROJECTS\BANANACATWITHHISFRIENDS\HELLOWORLD\HELLOWORLD.CPP
D:\UE_PROJECTS\BANANACATWITHHISFRIENDS\HELLOWORLD\HELLOWORLD\X64\DEBUG\VC143.PDB
D:\UE_PROJECTS\BANANACATWITHHISFRIENDS\HELLOWORLD\HELLOWORLD\X64\DEBUG\VC143.IDB
D:\UE_PROJECTS\BANANACATWITHHISFRIENDS\HELLOWORLD\HELLOWORLD\X64\DEBUG\HELLOWORLD.OBJ
