<?xml version="1.0" encoding="utf-8"?>
<Module VenderID="1" ProductCode="10553344" Revision="16777216" IONodeID="862e1237-54b7-443f-9692-3647800f4e78" DeviceName="N3EI1" SerialNo="0" IsEnabled="1">
  <IOPort IOPortID="0b77c7ac-d107-4ba3-bb21-fc973b0aacd9" Index="28672" SubIndex="1" />
  <IOPort IOPortID="021304e2-00a1-41cf-acbd-a1287faf3cd3" Index="28673" SubIndex="1" />
  <IOPort IOPortID="ca3840c0-a76d-47e0-9cec-643e82ec12c9" Index="28672" SubIndex="3" />
  <IOPort IOPortID="edf04bd3-5649-4e39-949e-143338e0543a" Index="28672" SubIndex="2" />
  <IOAllocation Index="5632">
    <IOEntry>
      <IOPortReference IOPortID="0b77c7ac-d107-4ba3-bb21-fc973b0aacd9" />
    </IOEntry>
    <IOEntry>
      <IOPortReference IOPortID="021304e2-00a1-41cf-acbd-a1287faf3cd3" />
    </IOEntry>
    <IOEntry>
      <IOPortReference IOPortID="ca3840c0-a76d-47e0-9cec-643e82ec12c9" />
    </IOEntry>
    <IOEntry>
      <IOPortReference IOPortID="edf04bd3-5649-4e39-949e-143338e0543a" />
    </IOEntry>
  </IOAllocation>
  <IOPort IOPortID="c08aedc8-06db-4b17-9f19-5848cea19d2b" Index="28674" SubIndex="1" />
  <IOPort IOPortID="2de90c5d-10da-4a9e-9b1b-7396a1931f31" Index="28674" SubIndex="2" />
  <IOAllocation Index="5633">
    <IOEntry>
      <IOPortReference IOPortID="c08aedc8-06db-4b17-9f19-5848cea19d2b" />
    </IOEntry>
    <IOEntry>
      <IOPortReference IOPortID="2de90c5d-10da-4a9e-9b1b-7396a1931f31" />
    </IOEntry>
  </IOAllocation>
  <IOPort IOPortID="a83eb84f-93d3-420a-998a-deb8c6422d54" Index="24576" SubIndex="1" />
  <IOPort IOPortID="035ae0b5-45fc-43f7-8d0f-dc6e4d32bec2" Index="24577" SubIndex="1" />
  <IOPort IOPortID="90c3e960-717d-48ef-b2c0-bc2e838f27aa" Index="24576" SubIndex="3" />
  <IOPort IOPortID="7e916f13-a6b6-415e-bac1-8c2bb71d6eda" Index="24576" SubIndex="2" />
  <IOAllocation Index="6656">
    <IOEntry>
      <IOPortReference IOPortID="a83eb84f-93d3-420a-998a-deb8c6422d54" />
    </IOEntry>
    <IOEntry>
      <IOPortReference IOPortID="035ae0b5-45fc-43f7-8d0f-dc6e4d32bec2" />
    </IOEntry>
    <IOEntry>
      <IOPortReference IOPortID="90c3e960-717d-48ef-b2c0-bc2e838f27aa" />
    </IOEntry>
    <IOEntry>
      <IOPortReference IOPortID="7e916f13-a6b6-415e-bac1-8c2bb71d6eda" />
    </IOEntry>
  </IOAllocation>
  <IOPort IOPortID="b4960f6b-2403-419c-9a2c-a63416860cfc" Index="24578" SubIndex="1">
    <SubIOPort IOPortID="6906c3b5-30eb-41c4-a583-f0bd37345845" />
    <SubIOPort IOPortID="21a627b2-79cc-439f-b559-feabd562954e" />
    <SubIOPort IOPortID="b890c0c0-75fe-4274-af2c-55ac64ee8b2d" />
    <SubIOPort IOPortID="3bc8055b-fb42-416c-a573-e23890da46ce" />
    <SubIOPort IOPortID="b1a1034e-8a3e-4da3-993e-1a3fb35642cb" />
    <SubIOPort IOPortID="6823a1cc-b7b3-4a74-8e3b-7fbd415a2e40" />
    <SubIOPort IOPortID="b1458749-3551-4ba2-8f55-291d121dd5d3" />
    <SubIOPort IOPortID="5af08914-b850-4100-9125-6a5b9670e4a9" />
    <SubIOPort IOPortID="e101273a-1508-468a-b6c8-3d6c08876ec6" />
    <SubIOPort IOPortID="2783fd62-f81b-4c3a-8cb0-270f7cf6a7ab" />
    <SubIOPort IOPortID="b94f9877-e8b8-4e2c-b0f7-e48086321dc7" />
    <SubIOPort IOPortID="e8407594-c6e5-4bdf-8fc1-8854332ba137" />
  </IOPort>
  <IOPort IOPortID="b7114b7d-de76-4373-93a5-f08feeaf0b88" Index="24578" SubIndex="2">
    <SubIOPort IOPortID="7556a890-2572-4479-8d30-86db0f612d58" />
    <SubIOPort IOPortID="aa00c446-65fc-444f-a950-3e3881286393" />
    <SubIOPort IOPortID="19f7d900-b5b7-41e9-ad3f-02511e87383f" />
    <SubIOPort IOPortID="7a186848-fd70-4655-b9a5-292928cc37ce" />
    <SubIOPort IOPortID="fc4c13af-06f7-43ca-a2c0-4a6f98b7820c" />
    <SubIOPort IOPortID="6f6f874e-2bad-40a2-8762-55261d206625" />
    <SubIOPort IOPortID="deb84ad3-7146-4a41-8071-61eaa868ad27" />
    <SubIOPort IOPortID="303904bb-9b10-40b7-978f-5ffd3dafbfca" />
  </IOPort>
  <IOAllocation Index="6657">
    <IOEntry>
      <IOPortReference IOPortID="b4960f6b-2403-419c-9a2c-a63416860cfc" />
    </IOEntry>
    <IOEntry>
      <IOPortReference IOPortID="b7114b7d-de76-4373-93a5-f08feeaf0b88" />
    </IOEntry>
  </IOAllocation>
</Module>