<?xml version="1.0" encoding="utf-8"?>
<Module VenderID="1" ProductCode="2237955" Revision="16777216" IONodeID="0b2af8f1-7905-474a-9e0d-0d8e8358678d" DeviceName="N1AO1" SerialNo="0" IsEnabled="1">
  <Parameter Index="16385" SubIndex="1" Value="1693450240" />
  <Parameter Index="16385" SubIndex="2" Value="4" />
  <Parameter Index="16385" SubIndex="3" Value="1693974528" />
  <Parameter Index="16385" SubIndex="4" Value="4" />
  <Parameter Index="20496" SubIndex="1" Value="True" />
  <Parameter Index="20496" SubIndex="2" Value="True" />
  <Parameter Index="20497" SubIndex="1" Value="2" />
  <Parameter Index="20497" SubIndex="2" Value="2" />
  <Parameter Index="20498" SubIndex="1" Value="4" />
  <Parameter Index="20498" SubIndex="2" Value="0" />
  <Parameter Index="20498" SubIndex="3" Value="4" />
  <Parameter Index="20498" SubIndex="4" Value="0" />
  <IOPort IOPortID="9fe99fc7-eb0a-4806-8c04-14da1fcf5278" Index="28672" SubIndex="1" />
  <IOPort IOPortID="84dc8704-ce89-4867-a7e8-0a8c38fec074" Index="28672" SubIndex="2" />
  <IOAllocation Index="5632">
    <IOEntry>
      <IOPortReference IOPortID="9fe99fc7-eb0a-4806-8c04-14da1fcf5278" />
    </IOEntry>
    <IOEntry>
      <IOPortReference IOPortID="84dc8704-ce89-4867-a7e8-0a8c38fec074" />
    </IOEntry>
  </IOAllocation>
</Module>