<?xml version="1.0" encoding="utf-8"?>
<Module VenderID="1" ProductCode="10553344" Revision="16777216" IONodeID="d116de13-886e-44fb-bd96-be53a219b7cc" DeviceName="N5EI1" SerialNo="0" IsEnabled="1">
  <IOPort IOPortID="9bd6ecd2-067a-44cf-bfcd-5561e770b48a" Index="28672" SubIndex="1" />
  <IOPort IOPortID="1a9bd7c5-d73c-4acb-aa9a-087c1f7cd31c" Index="28673" SubIndex="1" />
  <IOPort IOPortID="2cb0bacf-4d5c-4bba-9115-c9ad84842087" Index="28672" SubIndex="3" />
  <IOPort IOPortID="d98d3e2c-863e-4b08-80c2-9bf8131aab6a" Index="28672" SubIndex="2" />
  <IOAllocation Index="5632">
    <IOEntry>
      <IOPortReference IOPortID="9bd6ecd2-067a-44cf-bfcd-5561e770b48a" />
    </IOEntry>
    <IOEntry>
      <IOPortReference IOPortID="1a9bd7c5-d73c-4acb-aa9a-087c1f7cd31c" />
    </IOEntry>
    <IOEntry>
      <IOPortReference IOPortID="2cb0bacf-4d5c-4bba-9115-c9ad84842087" />
    </IOEntry>
    <IOEntry>
      <IOPortReference IOPortID="d98d3e2c-863e-4b08-80c2-9bf8131aab6a" />
    </IOEntry>
  </IOAllocation>
  <IOPort IOPortID="c1ef25f0-f677-487a-8f58-d43fd12b831a" Index="28674" SubIndex="1" />
  <IOPort IOPortID="d6a3fc4e-e8ce-4486-aa5e-c360e1cb0086" Index="28674" SubIndex="2" />
  <IOAllocation Index="5633">
    <IOEntry>
      <IOPortReference IOPortID="c1ef25f0-f677-487a-8f58-d43fd12b831a" />
    </IOEntry>
    <IOEntry>
      <IOPortReference IOPortID="d6a3fc4e-e8ce-4486-aa5e-c360e1cb0086" />
    </IOEntry>
  </IOAllocation>
  <IOPort IOPortID="bffb1c89-57f6-41f0-b278-907316d2ccaf" Index="24576" SubIndex="1" />
  <IOPort IOPortID="3516e0eb-7ec5-4780-87e4-1537a17428a1" Index="24577" SubIndex="1" />
  <IOPort IOPortID="d20ddd36-cc49-4cf1-a631-e3a5e5a939f9" Index="24576" SubIndex="3" />
  <IOPort IOPortID="bafbc88a-af95-41aa-9f76-14acf16dc19c" Index="24576" SubIndex="2" />
  <IOAllocation Index="6656">
    <IOEntry>
      <IOPortReference IOPortID="bffb1c89-57f6-41f0-b278-907316d2ccaf" />
    </IOEntry>
    <IOEntry>
      <IOPortReference IOPortID="3516e0eb-7ec5-4780-87e4-1537a17428a1" />
    </IOEntry>
    <IOEntry>
      <IOPortReference IOPortID="d20ddd36-cc49-4cf1-a631-e3a5e5a939f9" />
    </IOEntry>
    <IOEntry>
      <IOPortReference IOPortID="bafbc88a-af95-41aa-9f76-14acf16dc19c" />
    </IOEntry>
  </IOAllocation>
  <IOPort IOPortID="89359936-eeee-49de-8a98-85fc7955ed6c" Index="24578" SubIndex="1">
    <SubIOPort IOPortID="cf99b49c-c88d-4cf3-8344-8a7ff30af7d1" />
    <SubIOPort IOPortID="26b79750-9777-4784-b35d-900034ce1a1c" />
    <SubIOPort IOPortID="1206da92-afa7-464e-8523-4576c4bdf1ac" />
    <SubIOPort IOPortID="6fa15478-a7ce-409c-b214-e2bc19a33ad6" />
    <SubIOPort IOPortID="0c5a028d-2e64-4734-894e-58a9cf273009" />
    <SubIOPort IOPortID="62d784f4-ab56-4a45-bc42-81e1ba01fa21" />
    <SubIOPort IOPortID="efd858fc-8f91-48ba-9d94-a672268f918e" />
    <SubIOPort IOPortID="1512dd4e-d16f-4ffd-8f59-b8aa862c8d3b" />
    <SubIOPort IOPortID="b8714c7f-137b-4d2b-80a7-d93935570aa7" />
    <SubIOPort IOPortID="c81dc89b-a1e2-47a0-84ce-df8deb178fca" />
    <SubIOPort IOPortID="15d0dfa5-4312-4433-b275-79b7ccc74b9c" />
    <SubIOPort IOPortID="d07e3302-292d-4283-b3d7-6a7d2fd7a6ae" />
  </IOPort>
  <IOPort IOPortID="4e165b72-a1c8-4b1e-aa96-36f4c0a29166" Index="24578" SubIndex="2">
    <SubIOPort IOPortID="d3402934-183d-44ae-8ed8-81360080c1a3" />
    <SubIOPort IOPortID="a5e68785-9500-4b7d-bd8c-184041770170" />
    <SubIOPort IOPortID="a653d16b-0db1-4dcc-b64f-be7d9071f780" />
    <SubIOPort IOPortID="d07f7e11-9fff-4d43-966c-22ae559a5670" />
    <SubIOPort IOPortID="4d71d183-ab4f-487e-8576-7020525f922b" />
    <SubIOPort IOPortID="5b886a5c-04d7-418c-832e-4b4f81884815" />
    <SubIOPort IOPortID="0d2cbf8c-3347-40e6-9628-4d5125ad1b5b" />
    <SubIOPort IOPortID="1b2afa61-9626-4c1e-a2dc-984e1dc59980" />
  </IOPort>
  <IOAllocation Index="6657">
    <IOEntry>
      <IOPortReference IOPortID="89359936-eeee-49de-8a98-85fc7955ed6c" />
    </IOEntry>
    <IOEntry>
      <IOPortReference IOPortID="4e165b72-a1c8-4b1e-aa96-36f4c0a29166" />
    </IOEntry>
  </IOAllocation>
</Module>