{
  "swagger" : "2.0",
  "info" : {
    "description" : "An API for keeping track of your customers.",
    "version" : "1.0.0",
    "title" : "Customers API",
    "contact" : { }
  },
  "host" : "l8nhnld.eu.api-mocks.com",
  "schemes" : [ "https" ],
  "consumes" : [ "application/json" ],
  "produces" : [ "application/json" ],
  "paths" : {
    "/customers" : {
      "get" : {
        "summary" : "Get the list of customer",
        "description" : "Load the list of customer",
        "parameters" : [ ],
        "responses" : {
          "200" : {
            "description" : "status 200",
            "schema" : {
              "$ref" : "#/definitions/Customer"
            },
            "examples" : {
              "application/json" : "{\n\t\"Customer\": [{\n\t\t\t\"ID\": \"461140\",\n\t\t\t\"NAME\": \"Jason\",\n\t\t\t\"LAST_NAME\": \"HARRISON\",\n\t\t\t\"EMAIL\": \"jharrison5z@vistaprint.com\",\n\t\t\t\"JOB_TITLE\": \"Electrical Engineer\",\n\t\t\t\"CREDITCARDNUMBER\": \"4343354898-76-9480\",\n\t\t\t\"COMPANY\": \"Zoonder\",\n\t\t\t\"CITY\": \"Portland\",\n\t\t\t\"STATE\": \"\"\n\t\t}, {\n\t\t\t\"ID\": \"380630\",\n\t\t\t\"NAME\": \"VICTOR\",\n\t\t\t\"LAST_NAME\": \"COX\",\n\t\t\t\"EMAIL\": \"vcoxc9@virginia.edu\",\n\t\t\t\"JOB_TITLE\": \"Librarian\",\n\t\t\t\"CREDITCARDNUMBER\": \"30003746-83-0775\",\n\t\t\t\"COMPANY\": \"Skalith\",\n\t\t\t\"CITY\": \"Bend\",\n\t\t\t\"STATE\": \"\"\n\t\t}, {\n\t\t\t\"ID\": \"149072\",\n\t\t\t\"NAME\": \"Beverly\",\n\t\t\t\"LAST_NAME\": \"WRIGHT\",\n\t\t\t\"EMAIL\": \"bwrighth3@arizona.edu\",\n\t\t\t\"JOB_TITLE\": \"Biostatistician\",\n\t\t\t\"CREDITCARDNUMBER\": \"6011204780-36-8180\",\n\t\t\t\"COMPANY\": \"Skynoodle\",\n\t\t\t\"CITY\": \"Indianapolis\",\n\t\t\t\"STATE\": \"\"\n\t\t}, {\n\t\t\t\"ID\": \"678157\",\n\t\t\t\"NAME\": \"Kenneth\",\n\t\t\t\"LAST_NAME\": \"HARPER\",\n\t\t\t\"EMAIL\": \"kharperfu@craigslist.org\",\n\t\t\t\"JOB_TITLE\": \"Structural Engineer\",\n\t\t\t\"CREDITCARDNUMBER\": \"6249148211-57-8650\",\n\t\t\t\"COMPANY\": \"Dynava\",\n\t\t\t\"CITY\": \"Overland Park\",\n\t\t\t\"STATE\": \"\"\n\t\t}\t]\n}\n"
            }
          }
        }
      },
      "post" : {
        "summary" : "Create a customer",
        "description" : "add a new customer",
        "consumes" : [ ],
        "parameters" : [ {
          "name" : "body",
          "in" : "body",
          "required" : true,
          "schema" : {
            "$ref" : "#/definitions/Customer"
          },
          "x-examples" : {
            "application/json" : "{\n\t\"ID\": \"461145\",\n\t\"NAME\": \"John\",\n\t\"LAST_NAME\": \"Smith\",\n\t\"EMAIL\": \"jsmith@vistaprint.com\",\n\t\"JOB_TITLE\": \"Electrical Engineer\",\n\t\"CREDITCARDNUMBER\": \"4343354898-76-9480\",\n\t\"COMPANY\": \"Zoonder\",\n\t\"CITY\": \"San Francisco\",\n\t\"STATE\": \"CA\"\n}"
          }
        } ],
        "responses" : {
          "201" : {
            "description" : "status 201",
            "schema" : {
              "$ref" : "#/definitions/Customer"
            },
            "examples" : {
              "application/json" : "{\n\t\"ID\": \"461145\",\n\t\"NAME\": \"John\",\n\t\"LAST_NAME\": \"Smith\",\n\t\"EMAIL\": \"jsmith@vistaprint.com\",\n\t\"JOB_TITLE\": \"Electrical Engineer\",\n\t\"CREDITCARDNUMBER\": \"4343354898-76-9480\",\n\t\"COMPANY\": \"Zoonder\",\n\t\"CITY\": \"San Francisco\",\n\t\"STATE\": \"CA\"\n}"
            }
          },
          "409" : {
            "description" : "Status 409",
            "schema" : {
              "$ref" : "#/definitions/Error"
            },
            "examples" : {
              "application/json" : "{\n\t\"ID\": \"461145\",\n\t\"errorCode\": \"23000\",\n\t\"errorMessage\": \"Duplicate entry '461145' for key 'PRIMARY' - Line: 0\"\n}"
            }
          }
        }
      },
      "parameters" : [ ]
    },
    "/customers/{id}" : {
      "delete" : {
        "summary" : "Delete a customer",
        "description" : "Delete a customer",
        "parameters" : [ ],
        "responses" : {
          "200" : {
            "description" : "Status 200",
            "schema" : {
              "type" : "object",
              "properties" : { }
            }
          }
        }
      },
      "parameters" : [ {
        "name" : "id",
        "in" : "path",
        "required" : true,
        "type" : "string"
      } ]
    }
  },
  "definitions" : {
    "Customer" : {
      "type" : "object",
      "required" : [ "ID" ],
      "properties" : {
        "ID" : {
          "type" : "string"
        },
        "NAME" : {
          "type" : "string"
        },
        "LAST_NAME" : {
          "type" : "string"
        },
        "EMAIL" : {
          "type" : "string"
        },
        "JOB_TITLE" : {
          "type" : "string"
        },
        "CREDITCARDNUMBER" : {
          "type" : "string"
        },
        "COMPANY" : {
          "type" : "string"
        },
        "CITY" : {
          "type" : "string"
        },
        "STATE" : {
          "type" : "string"
        }
      },
      "example" : "{\n  \"ID\":  \"46145\",\n  \"NAME\" :  \"John\",\n  \"LAST_NAME\": \"Smith\",\n  \"EMAIL\": \"jsmith@vistaprint.come\",\n  \"JOB_TITLE\": \"Electrical : \"4343354898-76-9480\",\n  \"COMPANY\": \"Zoonder\",\n  \"CITY\": \"San Francisco\",\n  \"STATE\": \"CA\"\n}"
    },
    "Customers" : {
      "type" : "array",
      "items" : {
        "$ref" : "#/definitions/Customer"
      }
    },
    "Error" : {
      "type" : "object",
      "required" : [ "ID" ],
      "properties" : {
        "ID" : {
          "type" : "string"
        },
        "ErrorCode" : {
          "type" : "integer",
          "minimum" : 400,
          "maximum" : 599
        },
        "errorMessage" : {
          "type" : "string"
        }
      }
    }
  }
}