Id,SalePrice
1461,125009.7143659517
1462,158261.07086843846
1463,184319.89924381772
1464,193820.39686528937
1465,197561.60889008536
1466,176310.87456874357
1467,181033.110307007
1468,162625.5231662529
1469,193091.774145539
1470,129525.38367697215
1471,193430.21883721012
1472,98527.83635731875
1473,99903.09359561683
1474,142147.86416084427
1475,116137.31778830959
1476,391267.54423756414
1477,254506.13566025655
1478,291215.4360006014
1479,303404.4885295103
1480,491945.67296480865
1481,339262.90123058896
1482,209015.8458210417
1483,182721.69282572062
1484,164856.9611211355
1485,179689.76155357496
1486,193238.40475817726
1487,340639.8799122619
1488,247097.0766608644
1489,201626.73084961082
1490,235327.4841462578
1491,191483.4457103191
1492,80663.41556506002
1493,177424.2922175129
1494,291402.3875349404
1495,295300.3978320162
1496,233077.7593769923
1497,190807.64450664012
1498,170875.13536730612
1499,161097.54829258093
1500,160997.02438229285
1501,182346.79416319937
1502,148685.89346749676
1503,273772.08809438045
1504,246110.57617744204
1505,231965.72411612727
1506,192974.78400037866
1507,261419.42143365613
1508,198169.0148258331
1509,169883.09941657545
1510,152660.8402998562
1511,152329.25433003876
1512,179272.8557431413
1513,144904.47720026365
1514,157440.30719161042
1515,198835.047889895
1516,147403.21559544172
1517,163071.74614615174
1518,119385.53982495892
1519,215266.08331889127
1520,130470.04556553355
1521,135852.1799346063
1522,174191.53302730637
1523,117957.43615815199
1524,125357.75986595056
1525,124638.43156753472
1526,122530.9181611759
1527,110741.10674668281
1528,128719.00236659806
1529,152495.0216962421
1530,180035.67812640974
1531,108265.31706011253
1532,96975.40789789197
1533,151635.20771526895
1534,123412.18488453125
1535,144279.79102279953
1536,103111.28483200996
1537,56512.08324686246
1538,163298.10167059774
1539,222114.15852445044
1540,107952.85662358167
1541,138879.38536786535
1542,138640.3464551649
1543,193007.41318695305
1544,83652.1279979545
1545,114546.30183966446
1546,132777.264825596
1547,129872.29975824131
1548,141509.30099592544
1549,119539.93862666463
1550,135691.23790808982
1551,103150.43054640641
1552,135731.6076260759
1553,144198.1679616167
1554,112603.5205932697
1555,158867.807037474
1556,75146.07572514533
1557,111124.82405706782
1558,103837.54477434474
1559,82459.4910825062
1560,139316.66513252637
1561,160602.51650473493
1562,127419.1081839865
1563,123673.250541249
1564,150782.17126385402
1565,156404.47870871215
1566,252535.16790555045
1567,78741.03640338467
1568,243955.00850234999
1569,144218.8528232442
1570,132493.48485596746
1571,121150.87814066614
1572,138998.9531785659
1573,239633.28504972707
1574,117002.62506269723
1575,220422.60632068236
1576,241536.07447620784
1577,179386.2928379205
1578,146306.9876180857
1579,148043.5175326654
1580,187793.62460133294
1581,148408.3906770799
1582,128998.99104760285
1583,321551.07368830784
1584,215482.6648790557
1585,141470.5898034811
1586,58896.60853003824
1587,102982.31453110978
1588,149382.01622582477
1589,112435.56107432669
1590,127972.18613140026
1591,85547.21296095356
1592,123121.3883021786
1593,139635.85613819817
1594,147202.4210186164
1595,90778.05724864364
1596,208609.0964581788
1597,178528.12660101918
1598,218068.6694509167
1599,168927.5611322862
1600,166997.95516294264
1601,63801.25894642103
1602,118742.35153018423
1603,93337.42962779524
1604,261465.4304343573
1605,261127.71709999358
1606,174296.5767355124
1607,164851.87998629332
1608,218485.9037715276
1609,183658.17686473212
1610,156296.9919098951
1611,145180.18207256883
1612,167636.60682099132
1613,163785.142702959
1614,117892.05461123877
1615,86394.06641578308
1616,72909.68898232459
1617,94187.1153338402
1618,127377.40152669103
1619,146908.4570478372
1620,179378.86125600946
1621,152042.24585462603
1622,142203.02311056072
1623,280019.33217234747
1624,225937.6443787392
1625,122957.42404074667
1626,169277.72191130766
1627,191304.54368915857
1628,275857.5111203386
1629,185422.59157725621
1630,352973.6565912819
1631,219255.32446326612
1632,253984.21366024052
1633,165123.53266799508
1634,190431.1397270969
1635,175102.51578415162
1636,154899.50287167417
1637,211355.32736582967
1638,181214.07966062232
1639,194296.78956874495
1640,256041.29823919147
1641,178911.68624852985
1642,248750.8895100218
1643,220933.04771113934
1644,225216.3467640693
1645,187426.46329747958
1646,158109.86933425887
1647,158213.15419609635
1648,128394.17009187552
1649,142952.5806884353
1650,125844.71082358039
1651,122743.00185422704
1652,98221.87217167276
1653,100666.96403744983
1654,146178.70406616313
1655,135722.71646241375
1656,141067.2264886073
1657,150393.7302138828
1658,142565.29819226518
1659,123936.09382487313
1660,152585.78566159718
1661,443041.88046322577
1662,423042.00588701956
1663,378304.6840351862
1664,485224.64188459783
1665,307903.5838766317
1666,320091.42532454187
1667,380856.7407778732
1668,340086.79999233346
1669,313578.0143111007
1670,352009.5877016173
1671,273429.80967836455
1672,451993.54771429184
1673,306207.9664417072
1674,246626.35335862322
1675,193215.38536029344
1676,198799.9309908508
1677,222250.38689878405
1678,484506.96276199585
1679,396887.89548051317
1680,356900.7609541564
1681,250127.49913142627
1682,302303.82281241514
1683,187817.89477823413
1684,168930.7395623185
1685,168665.9411204853
1686,168040.40888323216
1687,164787.6959592502
1688,187545.2920295675
1689,187484.5559856981
1690,188052.58784943877
1691,174975.59075276298
1692,261056.44422859463
1693,164816.24000876019
1694,181929.5478425553
1695,162263.34509926056
1696,291728.3130134747
1697,168740.33347308496
1698,353920.8314935212
1699,311452.09906402655
1700,259362.13592049576
1701,278529.92048777844
1702,255606.67835530813
1703,254813.92263521702
1704,288662.6059238286
1705,220106.0233434288
1706,434728.3220043721
1707,208118.05477268583
1708,205917.9495290172
1709,264306.4247535788
1710,222452.60831078474
1711,271332.6762634396
1712,263029.72477963637
1713,302473.4031997983
1714,225806.82489354612
1715,213895.17048558994
1716,178749.63434753576
1717,170320.29146711697
1718,131264.30469601974
1719,197907.8036974519
1720,221207.37595512578
1721,161617.25419878768
1722,124755.72827389333
1723,162723.38599298042
1724,210384.29186247676
1725,242628.31319234858
1726,182753.29620424932
1727,151789.03094005038
1728,172428.44172280692
1729,175674.35102923604
1730,156836.34069118503
1731,127320.35169441607
1732,127433.52676850453
1733,115548.84237932823
1734,131842.15061753636
1735,122440.55540458586
1736,115521.60625128946
1737,280616.0567260775
1738,228117.36540284764
1739,284627.0178993722
1740,222922.54199857058
1741,189726.20494365267
1742,183305.01025178254
1743,179149.3055857059
1744,291260.45811221196
1745,228781.74535668187
1746,214254.77223667444
1747,215860.91923749834
1748,230703.75071579948
1749,153335.13097344758
1750,124847.81129658334
1751,235135.8230798367
1752,119750.96839967027
1753,148558.8979442421
1754,187256.7807935699
1755,170645.32708739172
1756,129859.75903168289
1757,128028.50053682015
1758,144222.3505335679
1759,160039.4471265621
1760,168589.4046483648
1761,141366.73865309887
1762,185452.30770917865
1763,164855.45016746345
1764,120165.98324973206
1765,176876.95229376087
1766,185457.39971331297
1767,232898.65551937776
1768,142373.37743412826
1769,168686.24366089547
1770,154203.48129947635
1771,123266.83202205258
1772,126803.99587289369
1773,131574.0633111282
1774,138196.96397974985
1775,143355.08992079349
1776,134895.55130792386
1777,112030.546792832
1778,136404.7820785305
1779,118035.91794976011
1780,173827.26930908608
1781,133500.75792970537
1782,87207.46320589115
1783,150628.0744148966
1784,104169.90822567773
1785,137892.11246098817
1786,139788.61526938947
1787,164704.95645280535
1788,52502.11395396679
1789,94713.01656585032
1790,75475.73929728902
1791,180599.31904367515
1792,164059.26438637433
1793,127889.05038271929
1794,140945.26584264333
1795,135859.82052964048
1796,124132.31257590099
1797,117894.44445103695
1798,124243.95340523294
1799,115112.27693640649
1800,128068.16142376374
1801,138173.053208682
1802,125900.13664515325
1803,150271.44075544653
1804,143634.59261563196
1805,134548.78290659928
1806,122531.01405292231
1807,132246.5849819687
1808,110632.45203226859
1809,126315.21429457654
1810,146128.23152931235
1811,109213.68078065617
1812,90341.5709847775
1813,135311.35811667837
1814,96026.33796483601
1815,48979.73865085383
1816,103450.50316780873
1817,98481.92015218409
1818,144212.11070856487
1819,120002.72404233491
1820,52211.25483250819
1821,128312.51216253694
1822,160048.60530548304
1823,24850.720290760713
1824,135358.63538420116
1825,135999.51764336674
1826,104632.3138863648
1827,104527.25600552882
1828,146840.98009209536
1829,132889.1396738725
1830,147317.21956270916
1831,155609.6890120015
1832,93202.93537119683
1833,141072.1111144446
1834,123991.58397369744
1835,129555.56471581427
1836,127434.44347634853
1837,92399.70743925154
1838,125904.20713741664
1839,102414.86675600952
1840,183122.5589699013
1841,137989.73374702022
1842,87560.5609104259
1843,134965.01815699364
1844,138833.44792820615
1845,137339.42852275807
1846,165167.51385610737
1847,168377.85838290982
1848,50081.525020751724
1849,117003.43903869225
1850,121124.1439619787
1851,152859.1544875128
1852,124519.57283818477
1853,125261.83201219719
1854,175545.30631744425
1855,150867.4374495435
1856,235563.92727949115
1857,150309.58615377074
1858,141678.4942038285
1859,117529.23206128144
1860,152061.50630692247
1861,117127.70179202517
1862,279378.52091818326
1863,268048.1123956827
1864,268108.3028486523
1865,334704.6869844656
1866,323980.66882640694
1867,225160.20650887265
1868,283356.3102632493
1869,199159.30687383818
1870,232295.00950213033
1871,230724.56548869447
1872,163851.21500416874
1873,266673.251596096
1874,141780.39602994372
1875,207291.51829539708
1876,200635.5137072811
1877,217530.34373078542
1878,207311.54767178744
1879,132309.68096670654
1880,135000.3993568378
1881,263516.71129919146
1882,242585.66621046598
1883,191198.62388110257
1884,208442.0818760022
1885,236343.86495303008
1886,270413.20404629095
1887,210145.8418223083
1888,278126.22862297704
1889,166028.0577788751
1890,121715.66290277873
1891,135273.74308990227
1892,93547.27217978891
1893,133341.35923941308
1894,135135.2109182909
1895,130541.70584744369
1896,132055.6742306216
1897,117205.02501279741
1898,125932.3897388367
1899,167521.8228550724
1900,178325.71740683095
1901,176734.3513691959
1902,157199.2802468934
1903,201001.45954777644
1904,138117.87173604753
1905,188984.1264956417
1906,163811.30428704535
1907,206320.22631232467
1908,109307.3704620928
1909,129161.90325348524
1910,118875.95451867723
1911,221337.40706668116
1912,346088.2507109797
1913,144679.4559387171
1914,68479.364575401
1915,343207.82360578864
1916,69709.02047791379
1917,249280.49025156177
1918,137564.10992324003
1919,175933.21259131358
1920,171107.18763305555
1921,389770.64222967246
1922,321419.6946047219
1923,229919.860938057
1924,213760.55116799736
1925,201384.86722617966
1926,386196.6345287943
1927,134897.5551107438
1928,155510.0086911768
1929,128840.63040395628
1930,133725.53985996963
1931,143463.44394207667
1932,152167.33731124306
1933,160908.88933343673
1934,180480.9802596215
1935,177102.70968474355
1936,189151.27948395218
1937,194305.48514958768
1938,177721.928742285
1939,232031.80475822184
1940,192284.59225251974
1941,171458.78092688098
1942,195704.0765337353
1943,216154.3835538804
1944,343906.8777661759
1945,391204.93051054893
1946,143639.32091551935
1947,308010.25242159225
1948,173741.87722501307
1949,275188.0635449621
1950,187479.3144933061
1951,258573.92652727407
1952,213552.58026921147
1953,152139.17947203032
1954,187372.87120660458
1955,147437.15690995686
1956,309349.03929387766
1957,158332.99164708238
1958,318160.2250042212
1959,136150.16515230085
1960,117811.90070208051
1961,126242.10636311474
1962,98265.62757835511
1963,110759.27404315553
1964,121608.27704523868
1965,140231.3813976671
1966,141617.17339885974
1967,294958.01954763406
1968,395431.04882182094
1969,383591.5940745027
1970,410634.64521780866
1971,460973.33209359867
1972,382913.3333695613
1973,259504.39002449383
1974,338485.31776420865
1975,353261.8603811674
1976,281607.0952794837
1977,356450.3731993069
1978,338593.8958077016
1979,364673.032789838
1980,203803.57054361387
1981,343829.0263297517
1982,218727.2727450946
1983,201827.64350970302
1984,173003.92568183123
1985,227188.66464968468
1986,227352.04547029643
1987,173566.20653901566
1988,169826.49665540666
1989,190536.14520353527
1990,205297.10176200315
1991,226934.05531709426
1992,210229.20494126668
1993,161753.64369861817
1994,236437.54536415898
1995,179179.1110217013
1996,244430.23078497167
1997,299973.9840616132
1998,330841.3415928575
1999,255062.4781331981
2000,311787.7656524323
2001,268462.870381355
2002,247936.8409907466
2003,266791.7343963087
2004,290224.6609058837
2005,213076.3566543896
2006,217816.86737022555
2007,254715.670635438
2008,212215.25039684138
2009,196163.9985203682
2010,187801.48968996343
2011,134372.64447762893
2012,165569.84037103163
2013,172674.2971687427
2014,180654.6539943385
2015,193759.49217053817
2016,195460.30972477014
2017,191465.53376753934
2018,123005.07713799186
2019,129290.83743449028
2020,107114.2311904058
2021,110641.6366134146
2022,194498.05831811592
2023,136820.63411202584
2024,280174.8393308403
2025,355249.83920457494
2026,179966.51569525938
2027,162082.54655749607
2028,155746.3496973406
2029,175593.7582852496
2030,271745.59092796256
2031,225458.51055396567
2032,239831.4974195077
2033,260073.47232833243
2034,168518.28024478664
2035,221382.19530468993
2036,195130.42103326556
2037,203884.92174219247
2038,355862.96860423824
2039,228884.2458528749
2040,335028.23302625335
2041,283742.1830970233
2042,210739.46153646318
2043,177233.14164796684
2044,177978.56186047342
2045,193703.62337866228
2046,141096.88341464903
2047,155876.4999416807
2048,134044.90074440913
2049,137284.0809741745
2050,178631.80628071452
2051,109588.65013140334
2052,122409.78772917953
2053,145865.29718094724
2054,100931.72167309778
2055,150137.51948274975
2056,142006.23742574968
2057,111890.80660419763
2058,212241.7870213574
2059,130271.84046529615
2060,172241.8664882962
2061,174661.33820038597
2062,132370.65244525074
2063,120253.36881277882
2064,141055.42341639072
2065,116412.74658789801
2066,163898.59606571117
2067,114223.58611330893
2068,137559.05388109063
2069,81035.9643355842
2070,116341.08358007921
2071,96166.21516131477
2072,151773.25037376955
2073,144241.9328910142
2074,180610.86857786347
2075,146104.61047970847
2076,124788.25474921337
2077,152441.61928012085
2078,122790.71077695694
2079,131342.12377567755
2080,119455.28559351104
2081,131039.51766663138
2082,139594.9159835895
2083,140205.24557587318
2084,110970.02517643843
2085,121810.15735413335
2086,118455.81744768185
2087,120690.89628484081
2088,89452.98908525906
2089,79351.70448960684
2090,123829.9062277022
2091,108481.73584451053
2092,128086.98441004669
2093,129454.13885668301
2094,109506.43482702212
2095,138243.27075544285
2096,76114.95841354525
2097,103109.10402271192
2098,152056.65703146203
2099,48779.763630334666
2100,88958.55750023255
2101,108468.27563620085
2102,123551.97617463254
2103,92784.77765257574
2104,132408.07847491401
2105,123861.39388746013
2106,81949.08591463277
2107,200281.80287201644
2108,120456.1145063917
2109,112048.98720985235
2110,134163.82533552148
2111,138483.88752166735
2112,144395.56342380808
2113,115356.15533214636
2114,137734.44234937444
2115,158046.2672300352
2116,111677.0922902148
2117,143890.2396953549
2118,119493.67890538258
2119,131910.6187189308
2120,106881.47478015453
2121,110812.95030716527
2122,120126.41101456172
2123,76858.52862275057
2124,151250.7005903024
2125,127839.22884598174
2126,140854.07511047734
2127,164107.02841569606
2128,131311.71686513376
2129,88202.83965730888
2130,143310.84599772538
2131,136327.45767006688
2132,111834.86569881288
2133,126019.9783805338
2134,120076.9471021498
2135,92761.97850018486
2136,94883.44595385689
2137,118417.70331291604
2138,134534.0925099367
2139,151615.4223030605
2140,142954.9409168825
2141,158213.01525622112
2142,132318.74458759063
2143,154495.4503742769
2144,129965.01385080232
2145,132873.26564826973
2146,172572.17987442412
2147,147081.18388746545
2148,139428.38882946997
2149,145036.8246402213
2150,219588.32104587264
2151,108970.34193063335
2152,163154.47567901027
2153,159519.8015954116
2154,111339.10420158993
2155,152084.81946961436
2156,266836.3743424067
2157,228806.2746060065
2158,237526.90392306633
2159,207707.75753633716
2160,166550.71337456835
2161,234729.08321184822
2162,408062.9660297778
2163,340892.76639848325
2164,243240.69411406986
2165,200558.8320825775
2166,151439.03382230666
2167,208042.13142205315
2168,203653.22930499897
2169,188689.19656763037
2170,217298.6644236135
2171,153265.4624834875
2172,134311.7778180253
2173,167359.20744767593
2174,231913.32363617478
2175,301427.78246049874
2176,307894.8541029785
2177,248197.41479634342
2178,204120.49137482344
2179,141569.82101603423
2180,214490.4940397623
2181,186474.24989546396
2182,220802.97573829282
2183,183795.0232648566
2184,124230.94703104801
2185,122919.5199655934
2186,153161.8886690916
2187,151639.42316719552
2188,154000.65466276318
2189,290281.75228009716
2190,85638.92024946433
2191,84325.49355137731
2192,84606.00036666212
2193,105265.54921691409
2194,101067.93707674892
2195,111969.78068715292
2196,103368.35211144558
2197,117426.80143456928
2198,159253.50236564828
2199,170209.55426585334
2200,152767.503571179
2201,135738.1371097123
2202,207065.70993386357
2203,132756.8405789613
2204,179251.33812368065
2205,125429.08972697609
2206,137796.48007340037
2207,237310.60727790886
2208,267060.33707665256
2209,232110.42826163687
2210,122055.13908266081
2211,118483.58131608032
2212,121057.78949588232
2213,114450.6034573484
2214,151946.43916593987
2215,97125.7328893301
2216,147310.37577807496
2217,62548.4237279862
2218,93343.65224510226
2219,71255.72503017177
2220,83231.83708598302
2221,342684.0859314372
2222,272255.5117241148
2223,309811.26133561577
2224,211430.3540440505
2225,135393.12533779073
2226,192077.52077176594
2227,186683.7810794226
2228,258906.97919336174
2229,251152.16665919466
2230,157443.3046201313
2231,209937.56215014937
2232,177626.78566740977
2233,163633.57233189355
2234,229929.49000905477
2235,217871.13475490108
2236,267967.76469542703
2237,318195.9257706788
2238,206081.0708795294
2239,113906.88978083906
2240,158069.41314532788
2241,146907.40252935144
2242,120050.30991789987
2243,129452.63249699539
2244,102797.09394547348
2245,95720.38535547916
2246,142848.88298951718
2247,126134.22308127725
2248,127483.86309449209
2249,121695.51614291314
2250,135985.87140836063
2251,99951.06397719828
2252,180655.7342431089
2253,152081.3034257273
2254,183920.1250412333
2255,190867.90807490353
2256,177753.33501691048
2257,215560.0450157525
2258,157843.7239412075
2259,178934.47332010855
2260,160250.8637292462
2261,177649.00567307396
2262,202927.65289342328
2263,375943.13749547466
2264,442805.1885971159
2265,177103.70237366675
2266,289891.05906528333
2267,360048.1669483
2268,417120.87932744995
2269,156867.17080509168
2270,188399.6738831264
2271,214074.0631073572
2272,192288.4249856839
2273,157234.36736961684
2274,189604.73124678378
2275,165100.5038184367
2276,185128.96464868632
2277,188355.64053904495
2278,153892.7565138234
2279,131669.47982577022
2280,121696.63643335519
2281,164810.62656573392
2282,187052.4088190373
2283,112002.56784612179
2284,110705.29493317407
2285,139209.56312684764
2286,124951.85455317743
2287,354085.53685720684
2288,262861.37006722763
2289,376059.9551251268
2290,444094.06785888923
2291,328350.7875890484
2292,435205.8912427536
2293,455772.3112457498
2294,378385.6626343596
2295,476839.1358333214
2296,295459.208740747
2297,331011.02029470564
2298,347056.14764537
2299,361779.05431488703
2300,342958.1226335
2301,295616.65929631336
2302,262885.0229768319
2303,262082.03883352637
2304,257038.35326801913
2305,196033.6640081088
2306,191849.71590980684
2307,202234.14819682913
2308,223034.47377585148
2309,285408.9175019964
2310,206265.76707942865
2311,200985.10277385853
2312,172378.6739302962
2313,170390.03280982812
2314,172515.04917887776
2315,170883.8496022357
2316,201597.0385416094
2317,186793.08082325474
2318,175631.5886706234
2319,176900.35129962245
2320,176029.16472954224
2321,238499.3871318357
2322,177655.45428236664
2323,196109.37129301587
2324,169749.323463578
2325,215341.03038784975
2326,168468.2215707537
2327,202592.41958972657
2328,216341.571898721
2329,193784.51182880366
2330,178056.92236082838
2331,359242.10903455294
2332,390660.08809524146
2333,339916.2100578364
2334,257282.06467590993
2335,276340.4692657029
2336,306096.89379294985
2337,200640.2148360741
2338,277787.1666562761
2339,222163.5052614156
2340,401988.5774232954
2341,222934.5629484258
2342,238935.74974215392
2343,232974.79034471593
2344,232558.75147300438
2345,244038.80304005623
2346,207689.95194838414
2347,198011.9866530561
2348,237643.99857921427
2349,182621.34711552633
2350,304708.23696152266
2351,282994.8226760264
2352,262051.5698134694
2353,255414.72131790794
2354,136859.5355952119
2355,139412.39879080455
2356,145736.95151437703
2357,185014.97285086042
2358,199839.62287201878
2359,134173.24729669833
2360,124132.17687577047
2361,147839.39326223003
2362,304561.2368741703
2363,138670.56865696973
2364,158995.17457997703
2365,213105.01112928882
2366,187633.9365269193
2367,234754.35088254616
2368,208738.32561927784
2369,231112.69996991687
2370,171728.30437177178
2371,170174.8849227199
2372,186235.5903482198
2373,280682.70651026303
2374,324831.21884372167
2375,238815.09425183767
2376,306693.8496679814
2377,342210.7889084063
2378,150735.63464763883
2379,214711.77162295772
2380,152748.61842734742
2381,168682.72192101282
2382,208258.96753389554
2383,208656.8211905199
2384,259810.31070904768
2385,157271.0876103472
2386,132407.45776582582
2387,137948.310444847
2388,105838.7506874591
2389,126042.81966666928
2390,155638.70960341
2391,141355.5453991627
2392,114106.8632817266
2393,164164.38355501107
2394,140042.8571105434
2395,207104.95782474068
2396,141720.80287840718
2397,215356.23568315257
2398,129185.10111236919
2399,53153.83034750135
2400,71070.8804690761
2401,121800.87996691967
2402,137901.07894176658
2403,129820.80350864466
2404,158191.86978937354
2405,155478.46474147332
2406,123150.868493026
2407,120309.02113673158
2408,145540.31060463656
2409,124496.71413491206
2410,169429.39222160348
2411,118606.562905795
2412,154924.14294592012
2413,133844.75954840455
2414,148483.86679175415
2415,126016.3269578312
2416,127157.9603275733
2417,131249.08727691366
2418,131556.5318918823
2419,129452.92926097728
2420,127633.75294899865
2421,178242.8566095657
2422,109739.37908636741
2423,111799.7033890671
2424,149813.3697235465
2425,231091.05172452284
2426,143466.90271708232
2427,133528.71216068344
2428,153686.2245619661
2429,119890.3534332668
2430,133880.5469581648
2431,111618.4058401358
2432,138316.52924360975
2433,149083.46011152773
2434,142702.52129460862
2435,147789.55093504794
2436,112663.75054564525
2437,113416.39268941595
2438,123677.36943388947
2439,89465.76198036665
2440,115204.44641222598
2441,85568.64677894686
2442,98103.74766452616
2443,133354.07885205344
2444,133893.95853639775
2445,83990.86310568913
2446,141735.63995101373
2447,177574.54575323942
2448,128012.1790948984
2449,116364.48188064991
2450,156930.3037392596
2451,120550.66650232219
2452,209847.13288665403
2453,88155.35577740996
2454,133522.44956266784
2455,127105.59767065023
2456,138636.77993682804
2457,134749.54613210727
2458,136322.8879428726
2459,109259.12162116391
2460,133172.93934231868
2461,132328.3146319788
2462,144727.16416058518
2463,121911.33755105929
2464,182222.23259256867
2465,137799.83657495165
2466,123994.38642876029
2467,120371.3047901951
2468,68685.98507527009
2469,65716.00722918505
2470,198014.04921488583
2471,190845.32808882397
2472,167211.02803410363
2473,124362.67905924628
2474,104259.80302608659
2475,232404.0241191097
2476,108571.98885209757
2477,129492.70855168196
2478,155483.73194403225
2479,115889.39617010443
2480,159555.09576472157
2481,127231.5646067053
2482,121886.31660142721
2483,120220.03212567305
2484,130448.74551386017
2485,125633.38697895645
2486,151901.70309267746
2487,199026.3630839307
2488,166047.86241771036
2489,155983.9186759707
2490,145088.90722744176
2491,95010.10059269934
2492,181564.7882304316
2493,148747.36538823714
2494,151843.23070204025
2495,88734.91297379545
2496,248958.5576151571
2497,146065.79771229537
2498,111249.97209226331
2499,83918.51178883856
2500,141679.95697363236
2501,136252.2789207072
2502,141994.0582110858
2503,103131.1229004048
2504,213258.3350427969
2505,236240.20590858252
2506,245407.46020878584
2507,306707.8372323749
2508,247050.1552954521
2509,213928.65869119472
2510,210044.70898533595
2511,172448.8972545888
2512,198900.34089016894
2513,221238.95689675462
2514,291774.5700377632
2515,150736.398028923
2516,181419.2034771014
2517,148293.37179447126
2518,159577.96390943846
2519,222539.8351397875
2520,216530.2025948598
2521,180791.46931633394
2522,225233.2132036868
2523,123500.78475584638
2524,139299.31922112106
2525,150736.23208528385
2526,132687.48751197004
2527,125383.96278489733
2528,127473.6463010597
2529,131778.64560444542
2530,121054.42248225508
2531,254499.61352194368
2532,229560.10014996372
2533,188737.62011523818
2534,205856.64432823312
2535,308342.3671744047
2536,240532.44462718756
2537,249054.96510013947
2538,172879.22575265306
2539,184508.10964101148
2540,172121.55024309186
2541,169170.54410083944
2542,159217.67662283411
2543,122758.57344395244
2544,110743.5857173311
2545,130675.01380723313
2546,120175.65055524111
2547,139508.82136686094
2548,153266.35176014222
2549,169644.658992749
2550,436202.1990992164
2551,135266.9885035119
2552,125532.93371825015
2553,82621.30973247006
2554,111029.86064272968
2555,112890.7966658005
2556,97458.22387346822
2557,109071.60876818984
2558,169786.62169560455
2559,138420.25492589845
2560,152979.3571567821
2561,142324.8594999757
2562,139484.322440139
2563,160709.1711071701
2564,189580.33891908661
2565,141611.0623325749
2566,152160.77223881846
2567,141679.46110119848
2568,177595.53831462734
2569,214255.7068333305
2570,118309.55211062229
2571,189209.61288525723
2572,154244.60765203918
2573,210484.26882852943
2574,282830.0962195039
2575,131534.94592231116
2576,132200.55913668117
2577,149646.44767759653
2578,87742.85996363466
2579,90424.6720694342
2580,125634.47722659871
2581,120006.93068489805
2582,116845.95133466259
2583,273623.7309321669
2584,183318.13012245746
2585,181104.2544369334
2586,234787.96541259286
2587,202192.11905754908
2588,154959.15130415905
2589,146861.88017896342
2590,192759.53224352954
2591,214917.95132193633
2592,218795.3210720108
2593,247924.26485096104
2594,178726.63990131242
2595,187650.66970737177
2596,315791.3453568925
2597,172366.8216289551
2598,284505.0613515566
2599,350510.3949619734
2600,194876.75007222706
2601,151260.6298282551
2602,82826.27826804224
2603,86674.85046951547
2604,88251.1052861188
2605,79497.49967418429
2606,147263.04519788397
2607,202869.6031184893
2608,210874.58291639507
2609,166680.56639466505
2610,112067.16876289566
2611,123360.14770886087
2612,163655.10449396993
2613,134357.2756928274
2614,128872.20248567247
2615,162842.61317810876
2616,145976.0869573922
2617,177089.45309027354
2618,205000.4557308954
2619,189536.39455230336
2620,187563.53214218185
2621,176768.6825463093
2622,183503.60999474386
2623,245172.10992934043
2624,342230.7248919676
2625,301302.6089528897
2626,168705.10489146487
2627,157803.49474343832
2628,416889.6114120255
2629,485448.6654391474
2630,339236.42295805307
2631,450021.8922295874
2632,408203.3371088576
2633,289144.02176406723
2634,418975.35388057487
2635,157603.9153210112
2636,172399.50726779
2637,159246.57710480536
2638,282156.2896130117
2639,196927.29131721618
2640,153584.12199271412
2641,113707.03433236884
2642,200586.9249807258
2643,112858.80414521528
2644,122934.2545069329
2645,118110.00770117591
2646,98133.95291564867
2647,112739.8552452904
2648,144569.87197451017
2649,151322.95319264865
2650,133560.8166875354
2651,138050.36962315888
2652,405115.49675165466
2653,249054.27248068206
2654,241763.96188277978
2655,403633.59256265056
2656,314837.190436213
2657,355896.36583095684
2658,299669.36132457363
2659,285991.78469477873
2660,367242.16541787714
2661,333930.68030504615
2662,347759.4228467314
2663,298123.1252243129
2664,269360.8431577577
2665,341544.93563647394
2666,288513.68831059244
2667,163113.43993261267
2668,177848.18652073067
2669,174175.67749872676
2670,283711.51810857834
2671,180048.4063975449
2672,193198.92979257213
2673,204065.66438943165
2674,204652.1620279442
2675,159566.27063428832
2676,184387.1378519396
2677,197795.07045825163
2678,272420.73510867014
2679,275985.9346841869
2680,296711.6452115803
2681,401333.24000877974
2682,326183.38586040214
2683,473851.67188079597
2684,313587.9296014918
2685,336058.6753838139
2686,252476.9309429482
2687,317294.0879386428
2688,211673.35012976095
2689,202608.0160516297
2690,434992.79073912953
2691,189918.30207460935
2692,132580.47764284344
2693,193555.40632412778
2694,136215.21720307006
2695,185153.07517701635
2696,173386.4726971513
2697,185336.90138367898
2698,194152.06622270058
2699,175755.2536804745
2700,149911.4916667359
2701,149542.22806842174
2702,111028.03368136377
2703,114831.87870765902
2704,143061.25436896365
2705,122270.68471308879
2706,114917.79919521717
2707,126809.59664721358
2708,141648.9712674553
2709,108666.07364184016
2710,134959.8569334756
2711,247674.58121567962
2712,379332.05766897404
2713,170622.92379932897
2714,147400.15447525153
2715,173437.04568454908
2716,142847.10821091942
2717,196991.97680146105
2718,218128.8438530271
2719,158308.00536828977
2720,171354.3727209855
2721,133811.88197837793
2722,156830.18228927813
2723,143210.2385878653
2724,125871.66253232278
2725,134645.34296445124
2726,148086.61512706935
2727,183438.66923006446
2728,182637.6968749775
2729,155364.560991768
2730,149735.09909489396
2731,134037.038855562
2732,140432.98902906955
2733,161955.3265994016
2734,147470.56834261975
2735,132242.44352332753
2736,155568.98896209744
2737,116636.82877128694
2738,129180.4284649418
2739,154645.26033295508
2740,137255.80565315665
2741,142856.07365105097
2742,155844.8158203435
2743,155458.5853795351
2744,151911.1422847064
2745,134076.50303875876
2746,140523.87344390745
2747,142723.88121873327
2748,131541.1886986986
2749,140776.8509869665
2750,140466.1604546808
2751,142013.73960852833
2752,197944.5442941923
2753,147029.84891006362
2754,217072.70177173548
2755,134508.27740295732
2756,90293.47926128637
2757,64209.57531211237
2758,82438.31868163582
2759,160784.31050726245
2760,126718.69727597019
2761,144952.44749024496
2762,142295.72271304173
2763,193182.76023029754
2764,153747.29878555977
2765,292546.1095629745
2766,136643.39365942584
2767,94866.98092509714
2768,141959.2384654786
2769,130998.02231487767
2770,133438.65480033567
2771,112619.84190012405
2772,107334.07541181523
2773,168084.16394922265
2774,144591.6582619194
2775,115796.86978968217
2776,140452.53616968286
2777,135273.847256954
2778,112904.54865094254
2779,114912.71964271076
2780,92763.98864447784
2781,96045.01051338947
2782,101716.60155332866
2783,107650.69337856771
2784,114648.31239229307
2785,132753.53698546338
2786,65498.42558099417
2787,128505.380111131
2788,77316.07813823648
2789,180341.24321881862
2790,117032.52850495723
2791,118634.6066314846
2792,64196.39735416908
2793,179100.39243624528
2794,94147.00180227307
2795,119709.30549194785
2796,94553.84316741265
2797,206898.80510777998
2798,116674.68614909373
2799,123928.05254540131
2800,60864.221088117745
2801,117449.53585306853
2802,130692.60232915345
2803,150507.55821345083
2804,132876.7862200142
2805,100709.258987894
2806,83800.13593760022
2807,165123.13037541704
2808,151850.91472101078
2809,137854.65653336732
2810,130408.63922648918
2811,168675.29356952256
2812,157171.97879278692
2813,144167.80599320587
2814,145315.9615141201
2815,104367.1715084727
2816,244884.74842322693
2817,163257.08361018373
2818,134639.63901918192
2819,158673.43044762246
2820,136395.952454475
2821,117873.50106391261
2822,201396.7417200056
2823,326244.00837051676
2824,173568.63660424596
2825,144061.53441096225
2826,131905.02678605926
2827,143691.9115399165
2828,246055.81054555296
2829,219893.80732034912
2830,232071.16989829272
2831,166818.58073112927
2832,252798.5320493122
2833,305648.32144998835
2834,209829.01516637462
2835,208844.42586864746
2836,179228.61445378966
2837,159549.41619939858
2838,143824.18459149648
2839,164466.87241248955
2840,198987.4020928663
2841,196235.71939452618
2842,228410.936751138
2843,152681.9544084413
2844,176956.7353918863
2845,131224.6202097244
2846,201182.33917488228
2847,209273.42771602643
2848,227330.2362934326
2849,196184.11937365241
2850,292250.6934700263
2851,212314.69883173046
2852,226157.14604579553
2853,235008.92676331522
2854,139063.5848104456
2855,198875.86296475134
2856,194436.52180404222
2857,177450.93006698386
2858,199171.38279080542
2859,125638.78707397534
2860,128523.21852031222
2861,127684.97017627445
2862,186259.32170577627
2863,127052.95602291684
2864,246067.23693118012
2865,138596.20477046192
2866,134931.50748099523
2867,97051.84603909474
2868,82248.14209047632
2869,112463.56935089237
2870,130037.26852937645
2871,79520.35368098218
2872,50309.96520414506
2873,92122.18490600376
2874,129699.85854281811
2875,107317.68809065342
2876,157893.64112935818
2877,151067.8699820018
2878,185171.691972841
2879,142919.17071074012
2880,110812.42966430556
2881,154992.29347339892
2882,173916.84199410555
2883,182413.46026436109
2884,208197.7088976134
2885,203306.791225481
2886,227646.78205614354
2887,103077.79425482024
2888,138855.9337840925
2889,38242.08860270263
2890,83146.61770830034
2891,131976.0825832336
2892,52245.06019075867
2893,111613.40362877805
2894,62444.85073976638
2895,331256.26242986834
2896,265947.1846511645
2897,207785.3104334812
2898,140763.48314535027
2899,200275.88469636673
2900,158227.13044482336
2901,213896.74734343524
2902,186981.3975554436
2903,316293.3066895934
2904,347299.5516151594
2905,107277.14638245317
2906,200677.55420551053
2907,109531.3921733356
2908,131120.66650797048
2909,138425.44219152984
2910,80282.71612466517
2911,77402.68560089602
2912,158646.04029419052
2913,91251.2344864276
2914,77411.87325985788
2915,95392.30511933877
2916,85872.06271475344
2917,168921.25672767506
2918,119921.28486971867
2919,234100.3427517707
